Uploaded image for project: 'IMPALA'
  1. IMPALA
  2. IMPALA-4637

Linking error in release related to binutils in the toolchain

Attach filesAttach ScreenshotVotersWatch issueWatchersCreate sub-taskLinkCloneUpdate Comment AuthorReplace String in CommentUpdate Comment VisibilityDelete Comments
    XMLWordPrintableJSON

Details

    • New Feature
    • Status: Resolved
    • Blocker
    • Resolution: Not A Bug
    • Impala 2.8.0
    • None
    • Infrastructure

    Description

      18:58:03 Linking CXX executable ../../build/release/util/symbols-util-test
      18:58:03 /data/jenkins/workspace/impala-umbrella-build-and-test/Impala-Toolchain/binutils-2.26-p1/bin/ld: cannot find ../../build/release/gutil/libgutil.a: No such file or directory
      18:58:03 collect2: error: ld returned 1 exit status
      18:58:03 make[2]: *** [be/build/release/util/runtime-profile-test] Error 1
      18:58:03 make[1]: *** [be/src/util/CMakeFiles/runtime-profile-test.dir/all] Error 2

      Tim, assigning this to you for initial triage. Feel free to re-assign.

      Attachments

        Activity

          This comment will be Viewable by All Users Viewable by All Users
          Cancel

          People

            tarmstrong Tim Armstrong
            dtsirogiannis Dimitris Tsirogiannis
            Votes:
            0 Vote for this issue
            Watchers:
            2 Start watching this issue

            Dates

              Created:
              Updated:
              Resolved:

              Slack

                Issue deployment