Uploaded image for project: 'IMPALA'
  1. IMPALA
  2. IMPALA-2616

Build failed to archive test reports

    XMLWordPrintableJSON

    Details

    • Type: Bug
    • Status: Resolved
    • Priority: Major
    • Resolution: Cannot Reproduce
    • Affects Version/s: Impala 2.3.0
    • Fix Version/s: None
    • Component/s: Infrastructure

      Description

      http://sandbox.jenkins.cloudera.com/job/impala-cdh5.5.x-exhaustive/55/console

      14:54:29 Recording test results
      14:54:32 ERROR: Failed to archive test reports
      14:54:32 hudson.util.IOException2: remote file operation failed: /data/jenkins/workspace/impala-cdh5.5.x-exhaustive at hudson.remoting.Channel@4a8a9a86:impala-boost-static-burst-slave-1793.vpc.cloudera.com
      14:54:32 	at hudson.FilePath.act(FilePath.java:907)
      14:54:32 	at hudson.FilePath.act(FilePath.java:884)
      14:54:32 	at hudson.tasks.junit.JUnitParser.parse(JUnitParser.java:87)
      14:54:32 	at hudson.tasks.junit.JUnitResultArchiver.parse(JUnitResultArchiver.java:121)
      14:54:32 	at hudson.tasks.junit.JUnitResultArchiver.perform(JUnitResultArchiver.java:133)
      14:54:32 	at hudson.tasks.BuildStepMonitor$1.perform(BuildStepMonitor.java:20)
      14:54:32 	at hudson.model.AbstractBuild$AbstractBuildExecution.perform(AbstractBuild.java:785)
      14:54:32 	at hudson.model.AbstractBuild$AbstractBuildExecution.performAllBuildSteps(AbstractBuild.java:757)
      14:54:32 	at hudson.model.Build$BuildExecution.post2(Build.java:183)
      14:54:32 	at hudson.model.AbstractBuild$AbstractBuildExecution.post(AbstractBuild.java:706)
      14:54:32 	at hudson.model.Run.execute(Run.java:1690)
      14:54:32 	at hudson.model.FreeStyleBuild.run(FreeStyleBuild.java:46)
      14:54:32 	at hudson.model.ResourceController.execute(ResourceController.java:88)
      14:54:32 	at hudson.model.Executor.run(Executor.java:246)
      14:54:32 Caused by: hudson.util.IOException2: Failed to read /data/jenkins/workspace/impala-cdh5.5.x-exhaustive/cluster_logs-impala-cdh5.5.x-exhaustive-55.tar.gz
      14:54:32 Is this really a JUnit report file? Your configuration must be matching too many files
      14:54:32 	at hudson.tasks.junit.TestResult.parse(TestResult.java:282)
      14:54:32 	at hudson.tasks.junit.TestResult.parsePossiblyEmpty(TestResult.java:230)
      14:54:32 	at hudson.tasks.junit.TestResult.parse(TestResult.java:165)
      14:54:32 	at hudson.tasks.junit.TestResult.parse(TestResult.java:148)
      14:54:32 	at hudson.tasks.junit.TestResult.<init>(TestResult.java:124)
      14:54:32 	at hudson.tasks.junit.JUnitParser$ParseResultCallable.invoke(JUnitParser.java:117)
      14:54:32 	at hudson.tasks.junit.JUnitParser$ParseResultCallable.invoke(JUnitParser.java:90)
      14:54:32 	at hudson.FilePath$FileCallableWrapper.call(FilePath.java:2439)
      14:54:32 	at hudson.remoting.UserRequest.perform(UserRequest.java:118)
      14:54:32 	at hudson.remoting.UserRequest.perform(UserRequest.java:48)
      14:54:32 	at hudson.remoting.Request$2.run(Request.java:328)
      14:54:32 	at hudson.remoting.InterceptingExecutorService$1.call(InterceptingExecutorService.java:72)
      14:54:32 	at java.util.concurrent.FutureTask.run(FutureTask.java:262)
      14:54:32 	at java.util.concurrent.ThreadPoolExecutor.runWorker(ThreadPoolExecutor.java:1145)
      14:54:32 	at java.util.concurrent.ThreadPoolExecutor$Worker.run(ThreadPoolExecutor.java:615)
      14:54:32 	at java.lang.Thread.run(Thread.java:745)
      14:54:32 Caused by: org.dom4j.DocumentException: Invalid byte 1 of 1-byte UTF-8 sequence. Nested exception: Invalid byte 1 of 1-byte UTF-8 sequence.
      14:54:32 	at org.dom4j.io.SAXReader.read(SAXReader.java:484)
      14:54:32 	at org.dom4j.io.SAXReader.read(SAXReader.java:264)
      14:54:32 	at hudson.tasks.junit.SuiteResult.parse(SuiteResult.java:130)
      14:54:32 	at hudson.tasks.junit.TestResult.parse(TestResult.java:274)
      14:54:32 	... 15 more
      14:54:32 Caused by: com.sun.org.apache.xerces.internal.impl.io.MalformedByteSequenceException: Invalid byte 1 of 1-byte UTF-8 sequence.
      14:54:32 	at com.sun.org.apache.xerces.internal.impl.io.UTF8Reader.invalidByte(UTF8Reader.java:687)
      14:54:32 	at com.sun.org.apache.xerces.internal.impl.io.UTF8Reader.read(UTF8Reader.java:557)
      14:54:32 	at com.sun.org.apache.xerces.internal.impl.XMLEntityScanner.load(XMLEntityScanner.java:1753)
      14:54:32 	at com.sun.org.apache.xerces.internal.impl.XMLEntityScanner.arrangeCapacity(XMLEntityScanner.java:1629)
      14:54:32 	at com.sun.org.apache.xerces.internal.impl.XMLEntityScanner.skipString(XMLEntityScanner.java:1667)
      14:54:32 	at com.sun.org.apache.xerces.internal.impl.XMLVersionDetector.determineDocVersion(XMLVersionDetector.java:196)
      14:54:32 	at com.sun.org.apache.xerces.internal.parsers.XML11Configuration.parse(XML11Configuration.java:812)
      14:54:32 	at com.sun.org.apache.xerces.internal.parsers.XML11Configuration.parse(XML11Configuration.java:777)
      14:54:32 	at com.sun.org.apache.xerces.internal.parsers.XMLParser.parse(XMLParser.java:141)
      14:54:32 	at com.sun.org.apache.xerces.internal.parsers.AbstractSAXParser.parse(AbstractSAXParser.java:1213)
      14:54:32 	at com.sun.org.apache.xerces.internal.jaxp.SAXParserImpl$JAXPSAXParser.parse(SAXParserImpl.java:648)
      14:54:32 	at org.dom4j.io.SAXReader.read(SAXReader.java:465)
      14:54:32 	... 18 more
      14:54:32 Build step 'Publish JUnit test result report' changed build result to FAILURE
      14:54:32 Uploading build to reporting server
      14:54:33 Email was triggered for: Failure
      

      Nothing else appears to have failed.

        Attachments

          Activity

            People

            • Assignee:
              Unassigned
              Reporter:
              skye Skye Wanderman-Milne
            • Votes:
              0 Vote for this issue
              Watchers:
              3 Start watching this issue

              Dates

              • Created:
                Updated:
                Resolved: