Uploaded image for project: 'Ignite'
  1. Ignite
  2. IGNITE-3663

Failed test: Sporadic failures to WebSessionSelfTest.testSessionRenewalDuringLogin()

    XMLWordPrintableJSON

    Details

    • Type: Bug
    • Status: Open
    • Priority: Major
    • Resolution: Unresolved
    • Affects Version/s: 1.6
    • Fix Version/s: None
    • Component/s: websession
    • Labels:

      Description

      Stack trace:

      java.io.FileNotFoundException: \tmp\realm.properties (The system cannot find the path specified)
          at java.io.FileOutputStream.open(Native Method)
          at java.io.FileOutputStream.<init>(FileOutputStream.java:221)
          at java.io.FileOutputStream.<init>(FileOutputStream.java:171)
          at java.io.FileWriter.<init>(FileWriter.java:90)
          at org.apache.ignite.internal.websession.WebSessionSelfTest.createRealm(WebSessionSelfTest.java:895)
          at org.apache.ignite.internal.websession.WebSessionSelfTest.startServerWithLoginService(WebSessionSelfTest.java:856)
          at org.apache.ignite.internal.websession.WebSessionSelfTest.testSessionRenewalDuringLogin(WebSessionSelfTest.java:308)
          at org.apache.ignite.internal.websession.WebSessionSelfTest.testSessionRenewalDuringLogin(WebSessionSelfTest.java:92)
      ------- Stdout: -------
      [09:22:21,509][INFO ][main][root] >>> Starting test: WebSessionSelfTest#testSessionRenewalDuringLogin <<<
      [09:22:21,524][INFO ][main][root] >>> Stopping test: WebSessionSelfTest#testSessionRenewalDuringLogin in 15 ms <<<
      [09:22:21,524][INFO ][main][root] >>> Stopping test class: WebSessionSelfTest <<<
      ------- Stderr: -------
      [09:22:21,522][ERROR][main][root] Test failed.
      java.io.FileNotFoundException: \tmp\realm.properties (The system cannot find the path specified)
          at java.io.FileOutputStream.open(Native Method)
          at java.io.FileOutputStream.<init>(FileOutputStream.java:221)
          at java.io.FileOutputStream.<init>(FileOutputStream.java:171)
          at java.io.FileWriter.<init>(FileWriter.java:90)
          at org.apache.ignite.internal.websession.WebSessionSelfTest.createRealm(WebSessionSelfTest.java:895)
          at org.apache.ignite.internal.websession.WebSessionSelfTest.startServerWithLoginService(WebSessionSelfTest.java:856)
          at org.apache.ignite.internal.websession.WebSessionSelfTest.testSessionRenewalDuringLogin(WebSessionSelfTest.java:308)
          at org.apache.ignite.internal.websession.WebSessionSelfTest.testSessionRenewalDuringLogin(WebSessionSelfTest.java:92)
          at sun.reflect.NativeMethodAccessorImpl.invoke0(Native Method)
          at sun.reflect.NativeMethodAccessorImpl.invoke(NativeMethodAccessorImpl.java:57)
          at sun.reflect.DelegatingMethodAccessorImpl.invoke(DelegatingMethodAccessorImpl.java:43)
          at java.lang.reflect.Method.invoke(Method.java:606)
          at junit.framework.TestCase.runTest(TestCase.java:176)
          at org.apache.ignite.testframework.junits.GridAbstractTest.runTestInternal(GridAbstractTest.java:1760)
          at org.apache.ignite.testframework.junits.GridAbstractTest.access$000(GridAbstractTest.java:118)
          at org.apache.ignite.testframework.junits.GridAbstractTest$4.run(GridAbstractTest.java:1698)
          at java.lang.Thread.run(Thread.java:745)
      

        Attachments

          Activity

            People

            • Assignee:
              Unassigned
              Reporter:
              vozerov Vladimir Ozerov
            • Votes:
              0 Vote for this issue
              Watchers:
              1 Start watching this issue

              Dates

              • Created:
                Updated: