Details

    • Type: Improvement
    • Status: Patch Available
    • Priority: Minor
    • Resolution: Unresolved
    • Affects Version/s: None
    • Fix Version/s: None
    • Component/s: Query Processor
    • Labels:
      None

      Description

      Hive has some special commands which are not handled by Driver class (set, dfs, list, etc.). Users can extend hive grammars by adding custom implementation. Query rewriter handling DSL, for example.

      1. HIVE-8669.1.patch.txt
        20 kB
        Navis
      2. HIVE-8669.2.patch.txt
        41 kB
        Navis

        Activity

        Hide
        hiveqa Hive QA added a comment -

        Overall: -1 at least one tests failed

        Here are the results of testing the latest attachment:
        https://issues.apache.org/jira/secure/attachment/12678136/HIVE-8669.1.patch.txt

        ERROR: -1 due to 127 failed/errored test(s), 6591 tests executed
        Failed tests:

        org.apache.hadoop.hive.cli.TestCliDriver.testCliDriver_alter_merge_3
        org.apache.hadoop.hive.cli.TestCliDriver.testCliDriver_authorization_admin_almighty2
        org.apache.hadoop.hive.cli.TestCliDriver.testCliDriver_authorization_cli_nonsql
        org.apache.hadoop.hive.cli.TestCliDriver.testCliDriver_authorization_parts
        org.apache.hadoop.hive.cli.TestCliDriver.testCliDriver_bucket_if_with_path_filter
        org.apache.hadoop.hive.cli.TestCliDriver.testCliDriver_database_drop
        org.apache.hadoop.hive.cli.TestCliDriver.testCliDriver_delete_orig_table
        org.apache.hadoop.hive.cli.TestCliDriver.testCliDriver_drop_database_removes_partition_dirs
        org.apache.hadoop.hive.cli.TestCliDriver.testCliDriver_drop_index_removes_partition_dirs
        org.apache.hadoop.hive.cli.TestCliDriver.testCliDriver_drop_table_removes_partition_dirs
        org.apache.hadoop.hive.cli.TestCliDriver.testCliDriver_exim_00_nonpart_empty
        org.apache.hadoop.hive.cli.TestCliDriver.testCliDriver_exim_01_nonpart
        org.apache.hadoop.hive.cli.TestCliDriver.testCliDriver_exim_02_00_part_empty
        org.apache.hadoop.hive.cli.TestCliDriver.testCliDriver_exim_02_part
        org.apache.hadoop.hive.cli.TestCliDriver.testCliDriver_exim_03_nonpart_over_compat
        org.apache.hadoop.hive.cli.TestCliDriver.testCliDriver_exim_04_all_part
        org.apache.hadoop.hive.cli.TestCliDriver.testCliDriver_exim_04_evolved_parts
        org.apache.hadoop.hive.cli.TestCliDriver.testCliDriver_exim_05_some_part
        org.apache.hadoop.hive.cli.TestCliDriver.testCliDriver_exim_06_one_part
        org.apache.hadoop.hive.cli.TestCliDriver.testCliDriver_exim_07_all_part_over_nonoverlap
        org.apache.hadoop.hive.cli.TestCliDriver.testCliDriver_exim_08_nonpart_rename
        org.apache.hadoop.hive.cli.TestCliDriver.testCliDriver_exim_09_part_spec_nonoverlap
        org.apache.hadoop.hive.cli.TestCliDriver.testCliDriver_exim_10_external_managed
        org.apache.hadoop.hive.cli.TestCliDriver.testCliDriver_exim_11_managed_external
        org.apache.hadoop.hive.cli.TestCliDriver.testCliDriver_exim_12_external_location
        org.apache.hadoop.hive.cli.TestCliDriver.testCliDriver_exim_13_managed_location
        org.apache.hadoop.hive.cli.TestCliDriver.testCliDriver_exim_14_managed_location_over_existing
        org.apache.hadoop.hive.cli.TestCliDriver.testCliDriver_exim_15_external_part
        org.apache.hadoop.hive.cli.TestCliDriver.testCliDriver_exim_16_part_external
        org.apache.hadoop.hive.cli.TestCliDriver.testCliDriver_exim_17_part_managed
        org.apache.hadoop.hive.cli.TestCliDriver.testCliDriver_exim_18_part_external
        org.apache.hadoop.hive.cli.TestCliDriver.testCliDriver_exim_19_00_part_external_location
        org.apache.hadoop.hive.cli.TestCliDriver.testCliDriver_exim_19_part_external_location
        org.apache.hadoop.hive.cli.TestCliDriver.testCliDriver_exim_20_part_managed_location
        org.apache.hadoop.hive.cli.TestCliDriver.testCliDriver_exim_21_export_authsuccess
        org.apache.hadoop.hive.cli.TestCliDriver.testCliDriver_exim_22_import_exist_authsuccess
        org.apache.hadoop.hive.cli.TestCliDriver.testCliDriver_exim_23_import_part_authsuccess
        org.apache.hadoop.hive.cli.TestCliDriver.testCliDriver_exim_24_import_nonexist_authsuccess
        org.apache.hadoop.hive.cli.TestCliDriver.testCliDriver_exim_hidden_files
        org.apache.hadoop.hive.cli.TestCliDriver.testCliDriver_input13
        org.apache.hadoop.hive.cli.TestCliDriver.testCliDriver_input44
        org.apache.hadoop.hive.cli.TestCliDriver.testCliDriver_input45
        org.apache.hadoop.hive.cli.TestCliDriver.testCliDriver_input_dfs
        org.apache.hadoop.hive.cli.TestCliDriver.testCliDriver_insert_overwrite_local_directory_1
        org.apache.hadoop.hive.cli.TestCliDriver.testCliDriver_insertexternal1
        org.apache.hadoop.hive.cli.TestCliDriver.testCliDriver_list_bucket_query_oneskew_1
        org.apache.hadoop.hive.cli.TestCliDriver.testCliDriver_list_bucket_query_oneskew_2
        org.apache.hadoop.hive.cli.TestCliDriver.testCliDriver_list_bucket_query_oneskew_3
        org.apache.hadoop.hive.cli.TestCliDriver.testCliDriver_metadata_export_drop
        org.apache.hadoop.hive.cli.TestCliDriver.testCliDriver_multi_insert
        org.apache.hadoop.hive.cli.TestCliDriver.testCliDriver_multi_insert_move_tasks_share_dependencies
        org.apache.hadoop.hive.cli.TestCliDriver.testCliDriver_null_column
        org.apache.hadoop.hive.cli.TestCliDriver.testCliDriver_nullformat
        org.apache.hadoop.hive.cli.TestCliDriver.testCliDriver_nullformatCTAS
        org.apache.hadoop.hive.cli.TestCliDriver.testCliDriver_nullformatdir
        org.apache.hadoop.hive.cli.TestCliDriver.testCliDriver_ppd_multi_insert
        org.apache.hadoop.hive.cli.TestCliDriver.testCliDriver_rename_external_partition_location
        org.apache.hadoop.hive.cli.TestCliDriver.testCliDriver_repair
        org.apache.hadoop.hive.cli.TestCliDriver.testCliDriver_stats_noscan_2
        org.apache.hadoop.hive.cli.TestCliDriver.testCliDriver_subq
        org.apache.hadoop.hive.cli.TestCliDriver.testCliDriver_symlink_text_input_format
        org.apache.hadoop.hive.cli.TestCliDriver.testCliDriver_union
        org.apache.hadoop.hive.cli.TestCliDriver.testCliDriver_update_orig_table
        org.apache.hadoop.hive.cli.TestContribCliDriver.testCliDriver_dboutput
        org.apache.hadoop.hive.cli.TestHBaseCliDriver.testCliDriver_hbase_handler_bulk
        org.apache.hadoop.hive.cli.TestHBaseMinimrCliDriver.testCliDriver_hbase_bulk
        org.apache.hadoop.hive.cli.TestHBaseNegativeCliDriver.testCliDriver_cascade_dbdrop
        org.apache.hadoop.hive.cli.TestMiniTezCliDriver.testCliDriver_delete_orig_table
        org.apache.hadoop.hive.cli.TestMiniTezCliDriver.testCliDriver_tez_insert_overwrite_local_directory_1
        org.apache.hadoop.hive.cli.TestMiniTezCliDriver.testCliDriver_update_orig_table
        org.apache.hadoop.hive.cli.TestMinimrCliDriver.testCliDriver_empty_dir_in_table
        org.apache.hadoop.hive.cli.TestMinimrCliDriver.testCliDriver_external_table_with_space_in_location_path
        org.apache.hadoop.hive.cli.TestMinimrCliDriver.testCliDriver_file_with_header_footer
        org.apache.hadoop.hive.cli.TestMinimrCliDriver.testCliDriver_import_exported_table
        org.apache.hadoop.hive.cli.TestMinimrCliDriver.testCliDriver_load_hdfs_file_with_space_in_the_name
        org.apache.hadoop.hive.cli.TestMinimrCliDriver.testCliDriver_remote_script
        org.apache.hadoop.hive.cli.TestMinimrCliDriver.testCliDriver_root_dir_external_table
        org.apache.hadoop.hive.cli.TestMinimrCliDriver.testCliDriver_schemeAuthority
        org.apache.hadoop.hive.cli.TestMinimrCliDriver.testCliDriver_schemeAuthority2
        org.apache.hadoop.hive.cli.TestMinimrCliDriver.testCliDriver_temp_table_external
        org.apache.hadoop.hive.cli.TestMinimrCliDriver.testCliDriver_udf_using
        org.apache.hadoop.hive.cli.TestNegativeCliDriver.testNegativeCliDriver_authorization_dfs
        org.apache.hadoop.hive.cli.TestNegativeCliDriver.testNegativeCliDriver_authorization_droppartition
        org.apache.hadoop.hive.cli.TestNegativeCliDriver.testNegativeCliDriver_authorization_sba_drop_table
        org.apache.hadoop.hive.cli.TestNegativeCliDriver.testNegativeCliDriver_authorization_uri_add_partition
        org.apache.hadoop.hive.cli.TestNegativeCliDriver.testNegativeCliDriver_authorization_uri_alterpart_loc
        org.apache.hadoop.hive.cli.TestNegativeCliDriver.testNegativeCliDriver_authorization_uri_altertab_setloc
        org.apache.hadoop.hive.cli.TestNegativeCliDriver.testNegativeCliDriver_authorization_uri_create_table1
        org.apache.hadoop.hive.cli.TestNegativeCliDriver.testNegativeCliDriver_authorization_uri_create_table_ext
        org.apache.hadoop.hive.cli.TestNegativeCliDriver.testNegativeCliDriver_authorization_uri_createdb
        org.apache.hadoop.hive.cli.TestNegativeCliDriver.testNegativeCliDriver_authorization_uri_export
        org.apache.hadoop.hive.cli.TestNegativeCliDriver.testNegativeCliDriver_authorization_uri_import
        org.apache.hadoop.hive.cli.TestNegativeCliDriver.testNegativeCliDriver_authorization_uri_index
        org.apache.hadoop.hive.cli.TestNegativeCliDriver.testNegativeCliDriver_authorization_uri_insert
        org.apache.hadoop.hive.cli.TestNegativeCliDriver.testNegativeCliDriver_authorization_uri_insert_local
        org.apache.hadoop.hive.cli.TestNegativeCliDriver.testNegativeCliDriver_authorization_uri_load_data
        org.apache.hadoop.hive.cli.TestNegativeCliDriver.testNegativeCliDriver_exim_00_unsupported_schema
        org.apache.hadoop.hive.cli.TestNegativeCliDriver.testNegativeCliDriver_exim_01_nonpart_over_loaded
        org.apache.hadoop.hive.cli.TestNegativeCliDriver.testNegativeCliDriver_exim_02_all_part_over_overlap
        org.apache.hadoop.hive.cli.TestNegativeCliDriver.testNegativeCliDriver_exim_03_nonpart_noncompat_colschema
        org.apache.hadoop.hive.cli.TestNegativeCliDriver.testNegativeCliDriver_exim_04_nonpart_noncompat_colnumber
        org.apache.hadoop.hive.cli.TestNegativeCliDriver.testNegativeCliDriver_exim_05_nonpart_noncompat_coltype
        org.apache.hadoop.hive.cli.TestNegativeCliDriver.testNegativeCliDriver_exim_06_nonpart_noncompat_storage
        org.apache.hadoop.hive.cli.TestNegativeCliDriver.testNegativeCliDriver_exim_07_nonpart_noncompat_ifof
        org.apache.hadoop.hive.cli.TestNegativeCliDriver.testNegativeCliDriver_exim_08_nonpart_noncompat_serde
        org.apache.hadoop.hive.cli.TestNegativeCliDriver.testNegativeCliDriver_exim_09_nonpart_noncompat_serdeparam
        org.apache.hadoop.hive.cli.TestNegativeCliDriver.testNegativeCliDriver_exim_10_nonpart_noncompat_bucketing
        org.apache.hadoop.hive.cli.TestNegativeCliDriver.testNegativeCliDriver_exim_11_nonpart_noncompat_sorting
        org.apache.hadoop.hive.cli.TestNegativeCliDriver.testNegativeCliDriver_exim_13_nonnative_import
        org.apache.hadoop.hive.cli.TestNegativeCliDriver.testNegativeCliDriver_exim_14_nonpart_part
        org.apache.hadoop.hive.cli.TestNegativeCliDriver.testNegativeCliDriver_exim_15_part_nonpart
        org.apache.hadoop.hive.cli.TestNegativeCliDriver.testNegativeCliDriver_exim_16_part_noncompat_schema
        org.apache.hadoop.hive.cli.TestNegativeCliDriver.testNegativeCliDriver_exim_17_part_spec_underspec
        org.apache.hadoop.hive.cli.TestNegativeCliDriver.testNegativeCliDriver_exim_18_part_spec_missing
        org.apache.hadoop.hive.cli.TestNegativeCliDriver.testNegativeCliDriver_exim_19_external_over_existing
        org.apache.hadoop.hive.cli.TestNegativeCliDriver.testNegativeCliDriver_exim_20_managed_location_over_existing
        org.apache.hadoop.hive.cli.TestNegativeCliDriver.testNegativeCliDriver_exim_21_part_managed_external
        org.apache.hadoop.hive.cli.TestNegativeCliDriver.testNegativeCliDriver_exim_22_export_authfail
        org.apache.hadoop.hive.cli.TestNegativeCliDriver.testNegativeCliDriver_exim_23_import_exist_authfail
        org.apache.hadoop.hive.cli.TestNegativeCliDriver.testNegativeCliDriver_exim_24_import_part_authfail
        org.apache.hadoop.hive.cli.TestNegativeCliDriver.testNegativeCliDriver_exim_25_import_nonexist_authfail
        org.apache.hadoop.hive.cli.TestNegativeMinimrCliDriver.testNegativeCliDriver_file_with_header_footer_negative
        org.apache.hadoop.hive.ql.processors.TestCommandProcessorFactory.testAvailableCommands
        org.apache.hive.jdbc.TestJdbcDriver2.testFetchFirstDfsCmds
        org.apache.hive.jdbc.authorization.TestHS2AuthzContext.testAuthzContextContentsCmdProcessorCmd
        org.apache.hive.jdbc.authorization.TestJdbcWithSQLAuthorization.testAllowedCommands
        org.apache.hive.minikdc.TestJdbcWithMiniKdc.testNegativeTokenAuth
        

        Test results: http://ec2-174-129-184-35.compute-1.amazonaws.com/jenkins/job/PreCommit-HIVE-TRUNK-Build/1558/testReport
        Console output: http://ec2-174-129-184-35.compute-1.amazonaws.com/jenkins/job/PreCommit-HIVE-TRUNK-Build/1558/console
        Test logs: http://ec2-174-129-184-35.compute-1.amazonaws.com/logs/PreCommit-HIVE-TRUNK-Build-1558/

        Messages:

        Executing org.apache.hive.ptest.execution.PrepPhase
        Executing org.apache.hive.ptest.execution.ExecutionPhase
        Executing org.apache.hive.ptest.execution.ReportingPhase
        Tests exited with: TestsFailedException: 127 tests failed
        

        This message is automatically generated.

        ATTACHMENT ID: 12678136 - PreCommit-HIVE-TRUNK-Build

        Show
        hiveqa Hive QA added a comment - Overall : -1 at least one tests failed Here are the results of testing the latest attachment: https://issues.apache.org/jira/secure/attachment/12678136/HIVE-8669.1.patch.txt ERROR: -1 due to 127 failed/errored test(s), 6591 tests executed Failed tests: org.apache.hadoop.hive.cli.TestCliDriver.testCliDriver_alter_merge_3 org.apache.hadoop.hive.cli.TestCliDriver.testCliDriver_authorization_admin_almighty2 org.apache.hadoop.hive.cli.TestCliDriver.testCliDriver_authorization_cli_nonsql org.apache.hadoop.hive.cli.TestCliDriver.testCliDriver_authorization_parts org.apache.hadoop.hive.cli.TestCliDriver.testCliDriver_bucket_if_with_path_filter org.apache.hadoop.hive.cli.TestCliDriver.testCliDriver_database_drop org.apache.hadoop.hive.cli.TestCliDriver.testCliDriver_delete_orig_table org.apache.hadoop.hive.cli.TestCliDriver.testCliDriver_drop_database_removes_partition_dirs org.apache.hadoop.hive.cli.TestCliDriver.testCliDriver_drop_index_removes_partition_dirs org.apache.hadoop.hive.cli.TestCliDriver.testCliDriver_drop_table_removes_partition_dirs org.apache.hadoop.hive.cli.TestCliDriver.testCliDriver_exim_00_nonpart_empty org.apache.hadoop.hive.cli.TestCliDriver.testCliDriver_exim_01_nonpart org.apache.hadoop.hive.cli.TestCliDriver.testCliDriver_exim_02_00_part_empty org.apache.hadoop.hive.cli.TestCliDriver.testCliDriver_exim_02_part org.apache.hadoop.hive.cli.TestCliDriver.testCliDriver_exim_03_nonpart_over_compat org.apache.hadoop.hive.cli.TestCliDriver.testCliDriver_exim_04_all_part org.apache.hadoop.hive.cli.TestCliDriver.testCliDriver_exim_04_evolved_parts org.apache.hadoop.hive.cli.TestCliDriver.testCliDriver_exim_05_some_part org.apache.hadoop.hive.cli.TestCliDriver.testCliDriver_exim_06_one_part org.apache.hadoop.hive.cli.TestCliDriver.testCliDriver_exim_07_all_part_over_nonoverlap org.apache.hadoop.hive.cli.TestCliDriver.testCliDriver_exim_08_nonpart_rename org.apache.hadoop.hive.cli.TestCliDriver.testCliDriver_exim_09_part_spec_nonoverlap org.apache.hadoop.hive.cli.TestCliDriver.testCliDriver_exim_10_external_managed org.apache.hadoop.hive.cli.TestCliDriver.testCliDriver_exim_11_managed_external org.apache.hadoop.hive.cli.TestCliDriver.testCliDriver_exim_12_external_location org.apache.hadoop.hive.cli.TestCliDriver.testCliDriver_exim_13_managed_location org.apache.hadoop.hive.cli.TestCliDriver.testCliDriver_exim_14_managed_location_over_existing org.apache.hadoop.hive.cli.TestCliDriver.testCliDriver_exim_15_external_part org.apache.hadoop.hive.cli.TestCliDriver.testCliDriver_exim_16_part_external org.apache.hadoop.hive.cli.TestCliDriver.testCliDriver_exim_17_part_managed org.apache.hadoop.hive.cli.TestCliDriver.testCliDriver_exim_18_part_external org.apache.hadoop.hive.cli.TestCliDriver.testCliDriver_exim_19_00_part_external_location org.apache.hadoop.hive.cli.TestCliDriver.testCliDriver_exim_19_part_external_location org.apache.hadoop.hive.cli.TestCliDriver.testCliDriver_exim_20_part_managed_location org.apache.hadoop.hive.cli.TestCliDriver.testCliDriver_exim_21_export_authsuccess org.apache.hadoop.hive.cli.TestCliDriver.testCliDriver_exim_22_import_exist_authsuccess org.apache.hadoop.hive.cli.TestCliDriver.testCliDriver_exim_23_import_part_authsuccess org.apache.hadoop.hive.cli.TestCliDriver.testCliDriver_exim_24_import_nonexist_authsuccess org.apache.hadoop.hive.cli.TestCliDriver.testCliDriver_exim_hidden_files org.apache.hadoop.hive.cli.TestCliDriver.testCliDriver_input13 org.apache.hadoop.hive.cli.TestCliDriver.testCliDriver_input44 org.apache.hadoop.hive.cli.TestCliDriver.testCliDriver_input45 org.apache.hadoop.hive.cli.TestCliDriver.testCliDriver_input_dfs org.apache.hadoop.hive.cli.TestCliDriver.testCliDriver_insert_overwrite_local_directory_1 org.apache.hadoop.hive.cli.TestCliDriver.testCliDriver_insertexternal1 org.apache.hadoop.hive.cli.TestCliDriver.testCliDriver_list_bucket_query_oneskew_1 org.apache.hadoop.hive.cli.TestCliDriver.testCliDriver_list_bucket_query_oneskew_2 org.apache.hadoop.hive.cli.TestCliDriver.testCliDriver_list_bucket_query_oneskew_3 org.apache.hadoop.hive.cli.TestCliDriver.testCliDriver_metadata_export_drop org.apache.hadoop.hive.cli.TestCliDriver.testCliDriver_multi_insert org.apache.hadoop.hive.cli.TestCliDriver.testCliDriver_multi_insert_move_tasks_share_dependencies org.apache.hadoop.hive.cli.TestCliDriver.testCliDriver_null_column org.apache.hadoop.hive.cli.TestCliDriver.testCliDriver_nullformat org.apache.hadoop.hive.cli.TestCliDriver.testCliDriver_nullformatCTAS org.apache.hadoop.hive.cli.TestCliDriver.testCliDriver_nullformatdir org.apache.hadoop.hive.cli.TestCliDriver.testCliDriver_ppd_multi_insert org.apache.hadoop.hive.cli.TestCliDriver.testCliDriver_rename_external_partition_location org.apache.hadoop.hive.cli.TestCliDriver.testCliDriver_repair org.apache.hadoop.hive.cli.TestCliDriver.testCliDriver_stats_noscan_2 org.apache.hadoop.hive.cli.TestCliDriver.testCliDriver_subq org.apache.hadoop.hive.cli.TestCliDriver.testCliDriver_symlink_text_input_format org.apache.hadoop.hive.cli.TestCliDriver.testCliDriver_union org.apache.hadoop.hive.cli.TestCliDriver.testCliDriver_update_orig_table org.apache.hadoop.hive.cli.TestContribCliDriver.testCliDriver_dboutput org.apache.hadoop.hive.cli.TestHBaseCliDriver.testCliDriver_hbase_handler_bulk org.apache.hadoop.hive.cli.TestHBaseMinimrCliDriver.testCliDriver_hbase_bulk org.apache.hadoop.hive.cli.TestHBaseNegativeCliDriver.testCliDriver_cascade_dbdrop org.apache.hadoop.hive.cli.TestMiniTezCliDriver.testCliDriver_delete_orig_table org.apache.hadoop.hive.cli.TestMiniTezCliDriver.testCliDriver_tez_insert_overwrite_local_directory_1 org.apache.hadoop.hive.cli.TestMiniTezCliDriver.testCliDriver_update_orig_table org.apache.hadoop.hive.cli.TestMinimrCliDriver.testCliDriver_empty_dir_in_table org.apache.hadoop.hive.cli.TestMinimrCliDriver.testCliDriver_external_table_with_space_in_location_path org.apache.hadoop.hive.cli.TestMinimrCliDriver.testCliDriver_file_with_header_footer org.apache.hadoop.hive.cli.TestMinimrCliDriver.testCliDriver_import_exported_table org.apache.hadoop.hive.cli.TestMinimrCliDriver.testCliDriver_load_hdfs_file_with_space_in_the_name org.apache.hadoop.hive.cli.TestMinimrCliDriver.testCliDriver_remote_script org.apache.hadoop.hive.cli.TestMinimrCliDriver.testCliDriver_root_dir_external_table org.apache.hadoop.hive.cli.TestMinimrCliDriver.testCliDriver_schemeAuthority org.apache.hadoop.hive.cli.TestMinimrCliDriver.testCliDriver_schemeAuthority2 org.apache.hadoop.hive.cli.TestMinimrCliDriver.testCliDriver_temp_table_external org.apache.hadoop.hive.cli.TestMinimrCliDriver.testCliDriver_udf_using org.apache.hadoop.hive.cli.TestNegativeCliDriver.testNegativeCliDriver_authorization_dfs org.apache.hadoop.hive.cli.TestNegativeCliDriver.testNegativeCliDriver_authorization_droppartition org.apache.hadoop.hive.cli.TestNegativeCliDriver.testNegativeCliDriver_authorization_sba_drop_table org.apache.hadoop.hive.cli.TestNegativeCliDriver.testNegativeCliDriver_authorization_uri_add_partition org.apache.hadoop.hive.cli.TestNegativeCliDriver.testNegativeCliDriver_authorization_uri_alterpart_loc org.apache.hadoop.hive.cli.TestNegativeCliDriver.testNegativeCliDriver_authorization_uri_altertab_setloc org.apache.hadoop.hive.cli.TestNegativeCliDriver.testNegativeCliDriver_authorization_uri_create_table1 org.apache.hadoop.hive.cli.TestNegativeCliDriver.testNegativeCliDriver_authorization_uri_create_table_ext org.apache.hadoop.hive.cli.TestNegativeCliDriver.testNegativeCliDriver_authorization_uri_createdb org.apache.hadoop.hive.cli.TestNegativeCliDriver.testNegativeCliDriver_authorization_uri_export org.apache.hadoop.hive.cli.TestNegativeCliDriver.testNegativeCliDriver_authorization_uri_import org.apache.hadoop.hive.cli.TestNegativeCliDriver.testNegativeCliDriver_authorization_uri_index org.apache.hadoop.hive.cli.TestNegativeCliDriver.testNegativeCliDriver_authorization_uri_insert org.apache.hadoop.hive.cli.TestNegativeCliDriver.testNegativeCliDriver_authorization_uri_insert_local org.apache.hadoop.hive.cli.TestNegativeCliDriver.testNegativeCliDriver_authorization_uri_load_data org.apache.hadoop.hive.cli.TestNegativeCliDriver.testNegativeCliDriver_exim_00_unsupported_schema org.apache.hadoop.hive.cli.TestNegativeCliDriver.testNegativeCliDriver_exim_01_nonpart_over_loaded org.apache.hadoop.hive.cli.TestNegativeCliDriver.testNegativeCliDriver_exim_02_all_part_over_overlap org.apache.hadoop.hive.cli.TestNegativeCliDriver.testNegativeCliDriver_exim_03_nonpart_noncompat_colschema org.apache.hadoop.hive.cli.TestNegativeCliDriver.testNegativeCliDriver_exim_04_nonpart_noncompat_colnumber org.apache.hadoop.hive.cli.TestNegativeCliDriver.testNegativeCliDriver_exim_05_nonpart_noncompat_coltype org.apache.hadoop.hive.cli.TestNegativeCliDriver.testNegativeCliDriver_exim_06_nonpart_noncompat_storage org.apache.hadoop.hive.cli.TestNegativeCliDriver.testNegativeCliDriver_exim_07_nonpart_noncompat_ifof org.apache.hadoop.hive.cli.TestNegativeCliDriver.testNegativeCliDriver_exim_08_nonpart_noncompat_serde org.apache.hadoop.hive.cli.TestNegativeCliDriver.testNegativeCliDriver_exim_09_nonpart_noncompat_serdeparam org.apache.hadoop.hive.cli.TestNegativeCliDriver.testNegativeCliDriver_exim_10_nonpart_noncompat_bucketing org.apache.hadoop.hive.cli.TestNegativeCliDriver.testNegativeCliDriver_exim_11_nonpart_noncompat_sorting org.apache.hadoop.hive.cli.TestNegativeCliDriver.testNegativeCliDriver_exim_13_nonnative_import org.apache.hadoop.hive.cli.TestNegativeCliDriver.testNegativeCliDriver_exim_14_nonpart_part org.apache.hadoop.hive.cli.TestNegativeCliDriver.testNegativeCliDriver_exim_15_part_nonpart org.apache.hadoop.hive.cli.TestNegativeCliDriver.testNegativeCliDriver_exim_16_part_noncompat_schema org.apache.hadoop.hive.cli.TestNegativeCliDriver.testNegativeCliDriver_exim_17_part_spec_underspec org.apache.hadoop.hive.cli.TestNegativeCliDriver.testNegativeCliDriver_exim_18_part_spec_missing org.apache.hadoop.hive.cli.TestNegativeCliDriver.testNegativeCliDriver_exim_19_external_over_existing org.apache.hadoop.hive.cli.TestNegativeCliDriver.testNegativeCliDriver_exim_20_managed_location_over_existing org.apache.hadoop.hive.cli.TestNegativeCliDriver.testNegativeCliDriver_exim_21_part_managed_external org.apache.hadoop.hive.cli.TestNegativeCliDriver.testNegativeCliDriver_exim_22_export_authfail org.apache.hadoop.hive.cli.TestNegativeCliDriver.testNegativeCliDriver_exim_23_import_exist_authfail org.apache.hadoop.hive.cli.TestNegativeCliDriver.testNegativeCliDriver_exim_24_import_part_authfail org.apache.hadoop.hive.cli.TestNegativeCliDriver.testNegativeCliDriver_exim_25_import_nonexist_authfail org.apache.hadoop.hive.cli.TestNegativeMinimrCliDriver.testNegativeCliDriver_file_with_header_footer_negative org.apache.hadoop.hive.ql.processors.TestCommandProcessorFactory.testAvailableCommands org.apache.hive.jdbc.TestJdbcDriver2.testFetchFirstDfsCmds org.apache.hive.jdbc.authorization.TestHS2AuthzContext.testAuthzContextContentsCmdProcessorCmd org.apache.hive.jdbc.authorization.TestJdbcWithSQLAuthorization.testAllowedCommands org.apache.hive.minikdc.TestJdbcWithMiniKdc.testNegativeTokenAuth Test results: http://ec2-174-129-184-35.compute-1.amazonaws.com/jenkins/job/PreCommit-HIVE-TRUNK-Build/1558/testReport Console output: http://ec2-174-129-184-35.compute-1.amazonaws.com/jenkins/job/PreCommit-HIVE-TRUNK-Build/1558/console Test logs: http://ec2-174-129-184-35.compute-1.amazonaws.com/logs/PreCommit-HIVE-TRUNK-Build-1558/ Messages: Executing org.apache.hive.ptest.execution.PrepPhase Executing org.apache.hive.ptest.execution.ExecutionPhase Executing org.apache.hive.ptest.execution.ReportingPhase Tests exited with: TestsFailedException: 127 tests failed This message is automatically generated. ATTACHMENT ID: 12678136 - PreCommit-HIVE-TRUNK-Build
        Hide
        hiveqa Hive QA added a comment -

        Overall: -1 at least one tests failed

        Here are the results of testing the latest attachment:
        https://issues.apache.org/jira/secure/attachment/12678854/HIVE-8669.2.patch.txt

        ERROR: -1 due to 22 failed/errored test(s), 6555 tests executed
        Failed tests:

        org.apache.hadoop.hive.cli.TestMiniTezCliDriver.testCliDriver_optimize_nullscan
        org.apache.hadoop.hive.ql.io.parquet.serde.TestParquetTimestampUtils.testTimezone
        org.apache.hadoop.hive.ql.processors.TestCommandProcessorFactory.testAvailableCommands
        org.apache.hadoop.hive.ql.processors.TestCompileProcessor.testSyntax
        org.apache.hive.hcatalog.streaming.TestStreaming.testInterleavedTransactionBatchCommits
        org.apache.hive.hcatalog.streaming.TestStreaming.testTransactionBatchEmptyCommit
        org.apache.hive.jdbc.TestJdbcWithMiniMr.testConnection
        org.apache.hive.jdbc.TestSchedulerQueue.testFairSchedulerPrimaryQueueMapping
        org.apache.hive.jdbc.TestSchedulerQueue.testFairSchedulerQueueMapping
        org.apache.hive.jdbc.TestSchedulerQueue.testFairSchedulerSecondaryQueueMapping
        org.apache.hive.jdbc.TestSchedulerQueue.testQueueMappingCheckDisabled
        org.apache.hive.jdbc.authorization.TestHS2AuthzContext.testAuthzContextContentsCmdProcessorCmd
        org.apache.hive.jdbc.authorization.TestJdbcWithSQLAuthorization.testAllowedCommands
        org.apache.hive.jdbc.miniHS2.TestHiveServer2.testGetVariableValue
        org.apache.hive.jdbc.miniHS2.TestMiniHS2.testConfInSession
        org.apache.hive.minikdc.TestJdbcWithMiniKdc.testConnection
        org.apache.hive.minikdc.TestJdbcWithMiniKdc.testProxyAuth
        org.apache.hive.minikdc.TestJdbcWithMiniKdc.testTokenAuth
        org.apache.hive.service.cli.session.TestSessionGlobalInitFile.testSessionGlobalInitDir
        org.apache.hive.service.cli.session.TestSessionGlobalInitFile.testSessionGlobalInitFile
        org.apache.hive.service.cli.session.TestSessionGlobalInitFile.testSessionGlobalInitFileAndConfOverlay
        org.apache.hive.service.cli.session.TestSessionGlobalInitFile.testSessionGlobalInitFileWithUser
        

        Test results: http://ec2-174-129-184-35.compute-1.amazonaws.com/jenkins/job/PreCommit-HIVE-TRUNK-Build/1610/testReport
        Console output: http://ec2-174-129-184-35.compute-1.amazonaws.com/jenkins/job/PreCommit-HIVE-TRUNK-Build/1610/console
        Test logs: http://ec2-174-129-184-35.compute-1.amazonaws.com/logs/PreCommit-HIVE-TRUNK-Build-1610/

        Messages:

        Executing org.apache.hive.ptest.execution.PrepPhase
        Executing org.apache.hive.ptest.execution.ExecutionPhase
        Executing org.apache.hive.ptest.execution.ReportingPhase
        Tests exited with: TestsFailedException: 22 tests failed
        

        This message is automatically generated.

        ATTACHMENT ID: 12678854 - PreCommit-HIVE-TRUNK-Build

        Show
        hiveqa Hive QA added a comment - Overall : -1 at least one tests failed Here are the results of testing the latest attachment: https://issues.apache.org/jira/secure/attachment/12678854/HIVE-8669.2.patch.txt ERROR: -1 due to 22 failed/errored test(s), 6555 tests executed Failed tests: org.apache.hadoop.hive.cli.TestMiniTezCliDriver.testCliDriver_optimize_nullscan org.apache.hadoop.hive.ql.io.parquet.serde.TestParquetTimestampUtils.testTimezone org.apache.hadoop.hive.ql.processors.TestCommandProcessorFactory.testAvailableCommands org.apache.hadoop.hive.ql.processors.TestCompileProcessor.testSyntax org.apache.hive.hcatalog.streaming.TestStreaming.testInterleavedTransactionBatchCommits org.apache.hive.hcatalog.streaming.TestStreaming.testTransactionBatchEmptyCommit org.apache.hive.jdbc.TestJdbcWithMiniMr.testConnection org.apache.hive.jdbc.TestSchedulerQueue.testFairSchedulerPrimaryQueueMapping org.apache.hive.jdbc.TestSchedulerQueue.testFairSchedulerQueueMapping org.apache.hive.jdbc.TestSchedulerQueue.testFairSchedulerSecondaryQueueMapping org.apache.hive.jdbc.TestSchedulerQueue.testQueueMappingCheckDisabled org.apache.hive.jdbc.authorization.TestHS2AuthzContext.testAuthzContextContentsCmdProcessorCmd org.apache.hive.jdbc.authorization.TestJdbcWithSQLAuthorization.testAllowedCommands org.apache.hive.jdbc.miniHS2.TestHiveServer2.testGetVariableValue org.apache.hive.jdbc.miniHS2.TestMiniHS2.testConfInSession org.apache.hive.minikdc.TestJdbcWithMiniKdc.testConnection org.apache.hive.minikdc.TestJdbcWithMiniKdc.testProxyAuth org.apache.hive.minikdc.TestJdbcWithMiniKdc.testTokenAuth org.apache.hive.service.cli.session.TestSessionGlobalInitFile.testSessionGlobalInitDir org.apache.hive.service.cli.session.TestSessionGlobalInitFile.testSessionGlobalInitFile org.apache.hive.service.cli.session.TestSessionGlobalInitFile.testSessionGlobalInitFileAndConfOverlay org.apache.hive.service.cli.session.TestSessionGlobalInitFile.testSessionGlobalInitFileWithUser Test results: http://ec2-174-129-184-35.compute-1.amazonaws.com/jenkins/job/PreCommit-HIVE-TRUNK-Build/1610/testReport Console output: http://ec2-174-129-184-35.compute-1.amazonaws.com/jenkins/job/PreCommit-HIVE-TRUNK-Build/1610/console Test logs: http://ec2-174-129-184-35.compute-1.amazonaws.com/logs/PreCommit-HIVE-TRUNK-Build-1610/ Messages: Executing org.apache.hive.ptest.execution.PrepPhase Executing org.apache.hive.ptest.execution.ExecutionPhase Executing org.apache.hive.ptest.execution.ReportingPhase Tests exited with: TestsFailedException: 22 tests failed This message is automatically generated. ATTACHMENT ID: 12678854 - PreCommit-HIVE-TRUNK-Build

          People

          • Assignee:
            navis Navis
            Reporter:
            navis Navis
          • Votes:
            0 Vote for this issue
            Watchers:
            1 Start watching this issue

            Dates

            • Created:
              Updated:

              Development