Hive
  1. Hive
  2. HIVE-7829

Entity.getLocation can throw an NPE

    Details

    • Type: Bug Bug
    • Status: Closed
    • Priority: Major Major
    • Resolution: Fixed
    • Affects Version/s: None
    • Fix Version/s: 0.14.0
    • Component/s: None
    • Labels:
      None

      Description

      It's possible for the getDataLocation methods which Entity.getLocation calls to return null and as such NPE

      1. HIVE-7829.1.patch
        1 kB
        Brock Noland
      2. HIVE-7892.patch
        0.7 kB
        Brock Noland

        Issue Links

          Activity

          Hide
          Hive QA added a comment -

          Overall: -1 no tests executed

          Here are the results of testing the latest attachment:
          https://issues.apache.org/jira/secure/attachment/12663413/HIVE-7892.patch

          Test results: http://ec2-174-129-184-35.compute-1.amazonaws.com/jenkins/job/PreCommit-HIVE-TRUNK-Build/443/testReport
          Console output: http://ec2-174-129-184-35.compute-1.amazonaws.com/jenkins/job/PreCommit-HIVE-TRUNK-Build/443/console
          Test logs: http://ec2-174-129-184-35.compute-1.amazonaws.com/logs/PreCommit-HIVE-TRUNK-Build-443/

          Messages:

          **** This message was trimmed, see log for full details ****
          warning(200): IdentifiersParser.g:68:4: 
          Decision can match input such as "LPAREN LPAREN KW_NULL" using multiple alternatives: 1, 2
          
          As a result, alternative(s) 2 were disabled for that input
          warning(200): IdentifiersParser.g:68:4: 
          Decision can match input such as "LPAREN KW_CASE StringLiteral" using multiple alternatives: 1, 2
          
          As a result, alternative(s) 2 were disabled for that input
          warning(200): IdentifiersParser.g:115:5: 
          Decision can match input such as "KW_CLUSTER KW_BY LPAREN" using multiple alternatives: 1, 2
          
          As a result, alternative(s) 2 were disabled for that input
          warning(200): IdentifiersParser.g:127:5: 
          Decision can match input such as "KW_PARTITION KW_BY LPAREN" using multiple alternatives: 1, 2
          
          As a result, alternative(s) 2 were disabled for that input
          warning(200): IdentifiersParser.g:138:5: 
          Decision can match input such as "KW_DISTRIBUTE KW_BY LPAREN" using multiple alternatives: 1, 2
          
          As a result, alternative(s) 2 were disabled for that input
          warning(200): IdentifiersParser.g:149:5: 
          Decision can match input such as "KW_SORT KW_BY LPAREN" using multiple alternatives: 1, 2
          
          As a result, alternative(s) 2 were disabled for that input
          warning(200): IdentifiersParser.g:166:7: 
          Decision can match input such as "STAR" using multiple alternatives: 1, 2
          
          As a result, alternative(s) 2 were disabled for that input
          warning(200): IdentifiersParser.g:179:5: 
          Decision can match input such as "KW_STRUCT" using multiple alternatives: 4, 6
          
          As a result, alternative(s) 6 were disabled for that input
          warning(200): IdentifiersParser.g:179:5: 
          Decision can match input such as "KW_ARRAY" using multiple alternatives: 2, 6
          
          As a result, alternative(s) 6 were disabled for that input
          warning(200): IdentifiersParser.g:179:5: 
          Decision can match input such as "KW_UNIONTYPE" using multiple alternatives: 5, 6
          
          As a result, alternative(s) 6 were disabled for that input
          warning(200): IdentifiersParser.g:261:5: 
          Decision can match input such as "KW_NULL" using multiple alternatives: 1, 8
          
          As a result, alternative(s) 8 were disabled for that input
          warning(200): IdentifiersParser.g:261:5: 
          Decision can match input such as "KW_TRUE" using multiple alternatives: 3, 8
          
          As a result, alternative(s) 8 were disabled for that input
          warning(200): IdentifiersParser.g:261:5: 
          Decision can match input such as "KW_DATE StringLiteral" using multiple alternatives: 2, 3
          
          As a result, alternative(s) 3 were disabled for that input
          warning(200): IdentifiersParser.g:261:5: 
          Decision can match input such as "KW_FALSE" using multiple alternatives: 3, 8
          
          As a result, alternative(s) 8 were disabled for that input
          warning(200): IdentifiersParser.g:393:5: 
          Decision can match input such as "{KW_LIKE, KW_REGEXP, KW_RLIKE} KW_CLUSTER KW_BY" using multiple alternatives: 2, 9
          
          As a result, alternative(s) 9 were disabled for that input
          warning(200): IdentifiersParser.g:393:5: 
          Decision can match input such as "{KW_LIKE, KW_REGEXP, KW_RLIKE} KW_MAP LPAREN" using multiple alternatives: 2, 9
          
          As a result, alternative(s) 9 were disabled for that input
          warning(200): IdentifiersParser.g:393:5: 
          Decision can match input such as "{KW_LIKE, KW_REGEXP, KW_RLIKE} KW_INSERT KW_OVERWRITE" using multiple alternatives: 2, 9
          
          As a result, alternative(s) 9 were disabled for that input
          warning(200): IdentifiersParser.g:393:5: 
          Decision can match input such as "{KW_LIKE, KW_REGEXP, KW_RLIKE} KW_GROUP KW_BY" using multiple alternatives: 2, 9
          
          As a result, alternative(s) 9 were disabled for that input
          warning(200): IdentifiersParser.g:393:5: 
          Decision can match input such as "{KW_LIKE, KW_REGEXP, KW_RLIKE} KW_INSERT KW_INTO" using multiple alternatives: 2, 9
          
          As a result, alternative(s) 9 were disabled for that input
          warning(200): IdentifiersParser.g:393:5: 
          Decision can match input such as "{KW_LIKE, KW_REGEXP, KW_RLIKE} KW_LATERAL KW_VIEW" using multiple alternatives: 2, 9
          
          As a result, alternative(s) 9 were disabled for that input
          warning(200): IdentifiersParser.g:393:5: 
          Decision can match input such as "{KW_LIKE, KW_REGEXP, KW_RLIKE} KW_SORT KW_BY" using multiple alternatives: 2, 9
          
          As a result, alternative(s) 9 were disabled for that input
          warning(200): IdentifiersParser.g:393:5: 
          Decision can match input such as "{KW_LIKE, KW_REGEXP, KW_RLIKE} KW_UNION KW_ALL" using multiple alternatives: 2, 9
          
          As a result, alternative(s) 9 were disabled for that input
          warning(200): IdentifiersParser.g:393:5: 
          Decision can match input such as "{KW_LIKE, KW_REGEXP, KW_RLIKE} KW_ORDER KW_BY" using multiple alternatives: 2, 9
          
          As a result, alternative(s) 9 were disabled for that input
          warning(200): IdentifiersParser.g:393:5: 
          Decision can match input such as "KW_BETWEEN KW_MAP LPAREN" using multiple alternatives: 8, 9
          
          As a result, alternative(s) 9 were disabled for that input
          warning(200): IdentifiersParser.g:393:5: 
          Decision can match input such as "{KW_LIKE, KW_REGEXP, KW_RLIKE} KW_DISTRIBUTE KW_BY" using multiple alternatives: 2, 9
          
          As a result, alternative(s) 9 were disabled for that input
          warning(200): IdentifiersParser.g:518:5: 
          Decision can match input such as "{AMPERSAND..BITWISEXOR, DIV..DIVIDE, EQUAL..EQUAL_NS, GREATERTHAN..GREATERTHANOREQUALTO, KW_AND, KW_ARRAY, KW_BETWEEN..KW_BOOLEAN, KW_CASE, KW_DOUBLE, KW_FLOAT, KW_IF, KW_IN, KW_INT, KW_LIKE, KW_MAP, KW_NOT, KW_OR, KW_REGEXP, KW_RLIKE, KW_SMALLINT, KW_STRING..KW_STRUCT, KW_TINYINT, KW_UNIONTYPE, KW_WHEN, LESSTHAN..LESSTHANOREQUALTO, MINUS..NOTEQUAL, PLUS, STAR, TILDE}" using multiple alternatives: 1, 3
          
          As a result, alternative(s) 3 were disabled for that input
          [INFO] 
          [INFO] --- maven-remote-resources-plugin:1.5:process (default) @ hive-exec ---
          [INFO] 
          [INFO] --- maven-resources-plugin:2.6:resources (default-resources) @ hive-exec ---
          [INFO] Using 'UTF-8' encoding to copy filtered resources.
          [INFO] Copying 2 resources
          [INFO] Copying 3 resources
          [INFO] 
          [INFO] --- maven-antrun-plugin:1.7:run (define-classpath) @ hive-exec ---
          [INFO] Executing tasks
          
          main:
          [INFO] Executed tasks
          [INFO] 
          [INFO] --- maven-compiler-plugin:3.1:compile (default-compile) @ hive-exec ---
          [INFO] Compiling 1736 source files to /data/hive-ptest/working/apache-svn-trunk-source/ql/target/classes
          [INFO] -------------------------------------------------------------
          [WARNING] COMPILATION WARNING : 
          [INFO] -------------------------------------------------------------
          [WARNING] /data/hive-ptest/working/apache-svn-trunk-source/ql/src/java/org/apache/hadoop/hive/ql/exec/persistence/MapJoinBytesTableContainer.java: Some input files use or override a deprecated API.
          [WARNING] /data/hive-ptest/working/apache-svn-trunk-source/ql/src/java/org/apache/hadoop/hive/ql/exec/persistence/MapJoinBytesTableContainer.java: Recompile with -Xlint:deprecation for details.
          [WARNING] /data/hive-ptest/working/apache-svn-trunk-source/ql/src/gen/thrift/gen-javabean/org/apache/hadoop/hive/ql/plan/api/Query.java: Some input files use unchecked or unsafe operations.
          [WARNING] /data/hive-ptest/working/apache-svn-trunk-source/ql/src/gen/thrift/gen-javabean/org/apache/hadoop/hive/ql/plan/api/Query.java: Recompile with -Xlint:unchecked for details.
          [INFO] 4 warnings 
          [INFO] -------------------------------------------------------------
          [INFO] -------------------------------------------------------------
          [ERROR] COMPILATION ERROR : 
          [INFO] -------------------------------------------------------------
          [ERROR] /data/hive-ptest/working/apache-svn-trunk-source/ql/src/java/org/apache/hadoop/hive/ql/hooks/Entity.java:[279,7] cannot find symbol
            symbol:   class Path
            location: class org.apache.hadoop.hive.ql.hooks.Entity
          [ERROR] /data/hive-ptest/working/apache-svn-trunk-source/ql/src/java/org/apache/hadoop/hive/ql/hooks/Entity.java:[284,7] cannot find symbol
            symbol:   class Path
            location: class org.apache.hadoop.hive.ql.hooks.Entity
          [INFO] 2 errors 
          [INFO] -------------------------------------------------------------
          [INFO] ------------------------------------------------------------------------
          [INFO] Reactor Summary:
          [INFO] 
          [INFO] Hive .............................................. SUCCESS [13.814s]
          [INFO] Hive Shims Common ................................. SUCCESS [8.117s]
          [INFO] Hive Shims 0.20 ................................... SUCCESS [3.642s]
          [INFO] Hive Shims Secure Common .......................... SUCCESS [5.033s]
          [INFO] Hive Shims 0.20S .................................. SUCCESS [2.931s]
          [INFO] Hive Shims 0.23 ................................... SUCCESS [7.944s]
          [INFO] Hive Shims ........................................ SUCCESS [1.224s]
          [INFO] Hive Common ....................................... SUCCESS [44.592s]
          [INFO] Hive Serde ........................................ SUCCESS [14.314s]
          [INFO] Hive Metastore .................................... SUCCESS [35.904s]
          [INFO] Hive Ant Utilities ................................ SUCCESS [1.755s]
          [INFO] Hive Query Language ............................... FAILURE [1:03.321s]
          [INFO] Hive Service ...................................... SKIPPED
          [INFO] Hive Accumulo Handler ............................. SKIPPED
          [INFO] Hive JDBC ......................................... SKIPPED
          [INFO] Hive Beeline ...................................... SKIPPED
          [INFO] Hive CLI .......................................... SKIPPED
          [INFO] Hive Contrib ...................................... SKIPPED
          [INFO] Hive HBase Handler ................................ SKIPPED
          [INFO] Hive HCatalog ..................................... SKIPPED
          [INFO] Hive HCatalog Core ................................ SKIPPED
          [INFO] Hive HCatalog Pig Adapter ......................... SKIPPED
          [INFO] Hive HCatalog Server Extensions ................... SKIPPED
          [INFO] Hive HCatalog Webhcat Java Client ................. SKIPPED
          [INFO] Hive HCatalog Webhcat ............................. SKIPPED
          [INFO] Hive HCatalog Streaming ........................... SKIPPED
          [INFO] Hive HWI .......................................... SKIPPED
          [INFO] Hive ODBC ......................................... SKIPPED
          [INFO] Hive Shims Aggregator ............................. SKIPPED
          [INFO] Hive TestUtils .................................... SKIPPED
          [INFO] Hive Packaging .................................... SKIPPED
          [INFO] ------------------------------------------------------------------------
          [INFO] BUILD FAILURE
          [INFO] ------------------------------------------------------------------------
          [INFO] Total time: 3:25.463s
          [INFO] Finished at: Thu Aug 21 12:33:13 EDT 2014
          [INFO] Final Memory: 94M/740M
          [INFO] ------------------------------------------------------------------------
          [ERROR] Failed to execute goal org.apache.maven.plugins:maven-compiler-plugin:3.1:compile (default-compile) on project hive-exec: Compilation failure: Compilation failure:
          [ERROR] /data/hive-ptest/working/apache-svn-trunk-source/ql/src/java/org/apache/hadoop/hive/ql/hooks/Entity.java:[279,7] cannot find symbol
          [ERROR] symbol:   class Path
          [ERROR] location: class org.apache.hadoop.hive.ql.hooks.Entity
          [ERROR] /data/hive-ptest/working/apache-svn-trunk-source/ql/src/java/org/apache/hadoop/hive/ql/hooks/Entity.java:[284,7] cannot find symbol
          [ERROR] symbol:   class Path
          [ERROR] location: class org.apache.hadoop.hive.ql.hooks.Entity
          [ERROR] -> [Help 1]
          [ERROR] 
          [ERROR] To see the full stack trace of the errors, re-run Maven with the -e switch.
          [ERROR] Re-run Maven using the -X switch to enable full debug logging.
          [ERROR] 
          [ERROR] For more information about the errors and possible solutions, please read the following articles:
          [ERROR] [Help 1] http://cwiki.apache.org/confluence/display/MAVEN/MojoFailureException
          [ERROR] 
          [ERROR] After correcting the problems, you can resume the build with the command
          [ERROR]   mvn <goals> -rf :hive-exec
          + exit 1
          '
          

          This message is automatically generated.

          ATTACHMENT ID: 12663413

          Show
          Hive QA added a comment - Overall : -1 no tests executed Here are the results of testing the latest attachment: https://issues.apache.org/jira/secure/attachment/12663413/HIVE-7892.patch Test results: http://ec2-174-129-184-35.compute-1.amazonaws.com/jenkins/job/PreCommit-HIVE-TRUNK-Build/443/testReport Console output: http://ec2-174-129-184-35.compute-1.amazonaws.com/jenkins/job/PreCommit-HIVE-TRUNK-Build/443/console Test logs: http://ec2-174-129-184-35.compute-1.amazonaws.com/logs/PreCommit-HIVE-TRUNK-Build-443/ Messages: **** This message was trimmed, see log for full details **** warning(200): IdentifiersParser.g:68:4: Decision can match input such as "LPAREN LPAREN KW_NULL" using multiple alternatives: 1, 2 As a result, alternative(s) 2 were disabled for that input warning(200): IdentifiersParser.g:68:4: Decision can match input such as "LPAREN KW_CASE StringLiteral" using multiple alternatives: 1, 2 As a result, alternative(s) 2 were disabled for that input warning(200): IdentifiersParser.g:115:5: Decision can match input such as "KW_CLUSTER KW_BY LPAREN" using multiple alternatives: 1, 2 As a result, alternative(s) 2 were disabled for that input warning(200): IdentifiersParser.g:127:5: Decision can match input such as "KW_PARTITION KW_BY LPAREN" using multiple alternatives: 1, 2 As a result, alternative(s) 2 were disabled for that input warning(200): IdentifiersParser.g:138:5: Decision can match input such as "KW_DISTRIBUTE KW_BY LPAREN" using multiple alternatives: 1, 2 As a result, alternative(s) 2 were disabled for that input warning(200): IdentifiersParser.g:149:5: Decision can match input such as "KW_SORT KW_BY LPAREN" using multiple alternatives: 1, 2 As a result, alternative(s) 2 were disabled for that input warning(200): IdentifiersParser.g:166:7: Decision can match input such as "STAR" using multiple alternatives: 1, 2 As a result, alternative(s) 2 were disabled for that input warning(200): IdentifiersParser.g:179:5: Decision can match input such as "KW_STRUCT" using multiple alternatives: 4, 6 As a result, alternative(s) 6 were disabled for that input warning(200): IdentifiersParser.g:179:5: Decision can match input such as "KW_ARRAY" using multiple alternatives: 2, 6 As a result, alternative(s) 6 were disabled for that input warning(200): IdentifiersParser.g:179:5: Decision can match input such as "KW_UNIONTYPE" using multiple alternatives: 5, 6 As a result, alternative(s) 6 were disabled for that input warning(200): IdentifiersParser.g:261:5: Decision can match input such as "KW_NULL" using multiple alternatives: 1, 8 As a result, alternative(s) 8 were disabled for that input warning(200): IdentifiersParser.g:261:5: Decision can match input such as "KW_TRUE" using multiple alternatives: 3, 8 As a result, alternative(s) 8 were disabled for that input warning(200): IdentifiersParser.g:261:5: Decision can match input such as "KW_DATE StringLiteral" using multiple alternatives: 2, 3 As a result, alternative(s) 3 were disabled for that input warning(200): IdentifiersParser.g:261:5: Decision can match input such as "KW_FALSE" using multiple alternatives: 3, 8 As a result, alternative(s) 8 were disabled for that input warning(200): IdentifiersParser.g:393:5: Decision can match input such as "{KW_LIKE, KW_REGEXP, KW_RLIKE} KW_CLUSTER KW_BY" using multiple alternatives: 2, 9 As a result, alternative(s) 9 were disabled for that input warning(200): IdentifiersParser.g:393:5: Decision can match input such as "{KW_LIKE, KW_REGEXP, KW_RLIKE} KW_MAP LPAREN" using multiple alternatives: 2, 9 As a result, alternative(s) 9 were disabled for that input warning(200): IdentifiersParser.g:393:5: Decision can match input such as "{KW_LIKE, KW_REGEXP, KW_RLIKE} KW_INSERT KW_OVERWRITE" using multiple alternatives: 2, 9 As a result, alternative(s) 9 were disabled for that input warning(200): IdentifiersParser.g:393:5: Decision can match input such as "{KW_LIKE, KW_REGEXP, KW_RLIKE} KW_GROUP KW_BY" using multiple alternatives: 2, 9 As a result, alternative(s) 9 were disabled for that input warning(200): IdentifiersParser.g:393:5: Decision can match input such as "{KW_LIKE, KW_REGEXP, KW_RLIKE} KW_INSERT KW_INTO" using multiple alternatives: 2, 9 As a result, alternative(s) 9 were disabled for that input warning(200): IdentifiersParser.g:393:5: Decision can match input such as "{KW_LIKE, KW_REGEXP, KW_RLIKE} KW_LATERAL KW_VIEW" using multiple alternatives: 2, 9 As a result, alternative(s) 9 were disabled for that input warning(200): IdentifiersParser.g:393:5: Decision can match input such as "{KW_LIKE, KW_REGEXP, KW_RLIKE} KW_SORT KW_BY" using multiple alternatives: 2, 9 As a result, alternative(s) 9 were disabled for that input warning(200): IdentifiersParser.g:393:5: Decision can match input such as "{KW_LIKE, KW_REGEXP, KW_RLIKE} KW_UNION KW_ALL" using multiple alternatives: 2, 9 As a result, alternative(s) 9 were disabled for that input warning(200): IdentifiersParser.g:393:5: Decision can match input such as "{KW_LIKE, KW_REGEXP, KW_RLIKE} KW_ORDER KW_BY" using multiple alternatives: 2, 9 As a result, alternative(s) 9 were disabled for that input warning(200): IdentifiersParser.g:393:5: Decision can match input such as "KW_BETWEEN KW_MAP LPAREN" using multiple alternatives: 8, 9 As a result, alternative(s) 9 were disabled for that input warning(200): IdentifiersParser.g:393:5: Decision can match input such as "{KW_LIKE, KW_REGEXP, KW_RLIKE} KW_DISTRIBUTE KW_BY" using multiple alternatives: 2, 9 As a result, alternative(s) 9 were disabled for that input warning(200): IdentifiersParser.g:518:5: Decision can match input such as "{AMPERSAND..BITWISEXOR, DIV..DIVIDE, EQUAL..EQUAL_NS, GREATERTHAN..GREATERTHANOREQUALTO, KW_AND, KW_ARRAY, KW_BETWEEN..KW_BOOLEAN, KW_CASE, KW_DOUBLE, KW_FLOAT, KW_IF, KW_IN, KW_INT, KW_LIKE, KW_MAP, KW_NOT, KW_OR, KW_REGEXP, KW_RLIKE, KW_SMALLINT, KW_STRING..KW_STRUCT, KW_TINYINT, KW_UNIONTYPE, KW_WHEN, LESSTHAN..LESSTHANOREQUALTO, MINUS..NOTEQUAL, PLUS, STAR, TILDE}" using multiple alternatives: 1, 3 As a result, alternative(s) 3 were disabled for that input [INFO] [INFO] --- maven-remote-resources-plugin:1.5:process (default) @ hive-exec --- [INFO] [INFO] --- maven-resources-plugin:2.6:resources (default-resources) @ hive-exec --- [INFO] Using 'UTF-8' encoding to copy filtered resources. [INFO] Copying 2 resources [INFO] Copying 3 resources [INFO] [INFO] --- maven-antrun-plugin:1.7:run (define-classpath) @ hive-exec --- [INFO] Executing tasks main: [INFO] Executed tasks [INFO] [INFO] --- maven-compiler-plugin:3.1:compile (default-compile) @ hive-exec --- [INFO] Compiling 1736 source files to /data/hive-ptest/working/apache-svn-trunk-source/ql/target/classes [INFO] ------------------------------------------------------------- [WARNING] COMPILATION WARNING : [INFO] ------------------------------------------------------------- [WARNING] /data/hive-ptest/working/apache-svn-trunk-source/ql/src/java/org/apache/hadoop/hive/ql/exec/persistence/MapJoinBytesTableContainer.java: Some input files use or override a deprecated API. [WARNING] /data/hive-ptest/working/apache-svn-trunk-source/ql/src/java/org/apache/hadoop/hive/ql/exec/persistence/MapJoinBytesTableContainer.java: Recompile with -Xlint:deprecation for details. [WARNING] /data/hive-ptest/working/apache-svn-trunk-source/ql/src/gen/thrift/gen-javabean/org/apache/hadoop/hive/ql/plan/api/Query.java: Some input files use unchecked or unsafe operations. [WARNING] /data/hive-ptest/working/apache-svn-trunk-source/ql/src/gen/thrift/gen-javabean/org/apache/hadoop/hive/ql/plan/api/Query.java: Recompile with -Xlint:unchecked for details. [INFO] 4 warnings [INFO] ------------------------------------------------------------- [INFO] ------------------------------------------------------------- [ERROR] COMPILATION ERROR : [INFO] ------------------------------------------------------------- [ERROR] /data/hive-ptest/working/apache-svn-trunk-source/ql/src/java/org/apache/hadoop/hive/ql/hooks/Entity.java:[279,7] cannot find symbol symbol: class Path location: class org.apache.hadoop.hive.ql.hooks.Entity [ERROR] /data/hive-ptest/working/apache-svn-trunk-source/ql/src/java/org/apache/hadoop/hive/ql/hooks/Entity.java:[284,7] cannot find symbol symbol: class Path location: class org.apache.hadoop.hive.ql.hooks.Entity [INFO] 2 errors [INFO] ------------------------------------------------------------- [INFO] ------------------------------------------------------------------------ [INFO] Reactor Summary: [INFO] [INFO] Hive .............................................. SUCCESS [13.814s] [INFO] Hive Shims Common ................................. SUCCESS [8.117s] [INFO] Hive Shims 0.20 ................................... SUCCESS [3.642s] [INFO] Hive Shims Secure Common .......................... SUCCESS [5.033s] [INFO] Hive Shims 0.20S .................................. SUCCESS [2.931s] [INFO] Hive Shims 0.23 ................................... SUCCESS [7.944s] [INFO] Hive Shims ........................................ SUCCESS [1.224s] [INFO] Hive Common ....................................... SUCCESS [44.592s] [INFO] Hive Serde ........................................ SUCCESS [14.314s] [INFO] Hive Metastore .................................... SUCCESS [35.904s] [INFO] Hive Ant Utilities ................................ SUCCESS [1.755s] [INFO] Hive Query Language ............................... FAILURE [1:03.321s] [INFO] Hive Service ...................................... SKIPPED [INFO] Hive Accumulo Handler ............................. SKIPPED [INFO] Hive JDBC ......................................... SKIPPED [INFO] Hive Beeline ...................................... SKIPPED [INFO] Hive CLI .......................................... SKIPPED [INFO] Hive Contrib ...................................... SKIPPED [INFO] Hive HBase Handler ................................ SKIPPED [INFO] Hive HCatalog ..................................... SKIPPED [INFO] Hive HCatalog Core ................................ SKIPPED [INFO] Hive HCatalog Pig Adapter ......................... SKIPPED [INFO] Hive HCatalog Server Extensions ................... SKIPPED [INFO] Hive HCatalog Webhcat Java Client ................. SKIPPED [INFO] Hive HCatalog Webhcat ............................. SKIPPED [INFO] Hive HCatalog Streaming ........................... SKIPPED [INFO] Hive HWI .......................................... SKIPPED [INFO] Hive ODBC ......................................... SKIPPED [INFO] Hive Shims Aggregator ............................. SKIPPED [INFO] Hive TestUtils .................................... SKIPPED [INFO] Hive Packaging .................................... SKIPPED [INFO] ------------------------------------------------------------------------ [INFO] BUILD FAILURE [INFO] ------------------------------------------------------------------------ [INFO] Total time: 3:25.463s [INFO] Finished at: Thu Aug 21 12:33:13 EDT 2014 [INFO] Final Memory: 94M/740M [INFO] ------------------------------------------------------------------------ [ERROR] Failed to execute goal org.apache.maven.plugins:maven-compiler-plugin:3.1:compile (default-compile) on project hive-exec: Compilation failure: Compilation failure: [ERROR] /data/hive-ptest/working/apache-svn-trunk-source/ql/src/java/org/apache/hadoop/hive/ql/hooks/Entity.java:[279,7] cannot find symbol [ERROR] symbol: class Path [ERROR] location: class org.apache.hadoop.hive.ql.hooks.Entity [ERROR] /data/hive-ptest/working/apache-svn-trunk-source/ql/src/java/org/apache/hadoop/hive/ql/hooks/Entity.java:[284,7] cannot find symbol [ERROR] symbol: class Path [ERROR] location: class org.apache.hadoop.hive.ql.hooks.Entity [ERROR] -> [Help 1] [ERROR] [ERROR] To see the full stack trace of the errors, re-run Maven with the -e switch. [ERROR] Re-run Maven using the -X switch to enable full debug logging. [ERROR] [ERROR] For more information about the errors and possible solutions, please read the following articles: [ERROR] [Help 1] http://cwiki.apache.org/confluence/display/MAVEN/MojoFailureException [ERROR] [ERROR] After correcting the problems, you can resume the build with the command [ERROR] mvn <goals> -rf :hive-exec + exit 1 ' This message is automatically generated. ATTACHMENT ID: 12663413
          Hide
          Szehon Ho added a comment -

          +1 pending tests

          Show
          Szehon Ho added a comment - +1 pending tests
          Hide
          Hive QA added a comment -

          Overall: -1 at least one tests failed

          Here are the results of testing the latest attachment:
          https://issues.apache.org/jira/secure/attachment/12663432/HIVE-7829.1.patch

          ERROR: -1 due to 2 failed/errored test(s), 6115 tests executed
          Failed tests:

          org.apache.hadoop.hive.cli.TestCliDriver.testCliDriver_parquet_join
          org.apache.hadoop.hive.cli.TestMiniTezCliDriver.testCliDriver_dynpart_sort_opt_vectorization
          

          Test results: http://ec2-174-129-184-35.compute-1.amazonaws.com/jenkins/job/PreCommit-HIVE-TRUNK-Build/447/testReport
          Console output: http://ec2-174-129-184-35.compute-1.amazonaws.com/jenkins/job/PreCommit-HIVE-TRUNK-Build/447/console
          Test logs: http://ec2-174-129-184-35.compute-1.amazonaws.com/logs/PreCommit-HIVE-TRUNK-Build-447/

          Messages:

          Executing org.apache.hive.ptest.execution.PrepPhase
          Executing org.apache.hive.ptest.execution.ExecutionPhase
          Executing org.apache.hive.ptest.execution.ReportingPhase
          Tests exited with: TestsFailedException: 2 tests failed
          

          This message is automatically generated.

          ATTACHMENT ID: 12663432

          Show
          Hive QA added a comment - Overall : -1 at least one tests failed Here are the results of testing the latest attachment: https://issues.apache.org/jira/secure/attachment/12663432/HIVE-7829.1.patch ERROR: -1 due to 2 failed/errored test(s), 6115 tests executed Failed tests: org.apache.hadoop.hive.cli.TestCliDriver.testCliDriver_parquet_join org.apache.hadoop.hive.cli.TestMiniTezCliDriver.testCliDriver_dynpart_sort_opt_vectorization Test results: http://ec2-174-129-184-35.compute-1.amazonaws.com/jenkins/job/PreCommit-HIVE-TRUNK-Build/447/testReport Console output: http://ec2-174-129-184-35.compute-1.amazonaws.com/jenkins/job/PreCommit-HIVE-TRUNK-Build/447/console Test logs: http://ec2-174-129-184-35.compute-1.amazonaws.com/logs/PreCommit-HIVE-TRUNK-Build-447/ Messages: Executing org.apache.hive.ptest.execution.PrepPhase Executing org.apache.hive.ptest.execution.ExecutionPhase Executing org.apache.hive.ptest.execution.ReportingPhase Tests exited with: TestsFailedException: 2 tests failed This message is automatically generated. ATTACHMENT ID: 12663432
          Hide
          Brock Noland added a comment -

          Thank you Szehon for the review! I have committed this to trunk!

          Show
          Brock Noland added a comment - Thank you Szehon for the review! I have committed this to trunk!
          Hide
          Thejas M Nair added a comment -

          This has been fixed in 0.14 release. Please open new jira if you see any issues.

          Show
          Thejas M Nair added a comment - This has been fixed in 0.14 release. Please open new jira if you see any issues.

            People

            • Assignee:
              Brock Noland
              Reporter:
              Brock Noland
            • Votes:
              0 Vote for this issue
              Watchers:
              3 Start watching this issue

              Dates

              • Created:
                Updated:
                Resolved:

                Development