Hive
  1. Hive
  2. HIVE-7456

HIVE-7361 missed updating authorization_fail_8

    Details

    • Type: Task Task
    • Status: Closed
    • Priority: Trivial Trivial
    • Resolution: Fixed
    • Affects Version/s: None
    • Fix Version/s: 0.14.0
    • Component/s: Tests
    • Labels:
      None

      Description

      Running: diff -a /home/hiveptest/54.91.198.254-hiveptest-1/apache-svn-trunk-source/itests/qtest/../../itests/qtest/target/qfile-results/clientnegative/authorization_fail_8.q.out /home/hiveptest/54.91.198.254-hiveptest-1/apache-svn-trunk-source/itests/qtest/../../ql/src/test/results/clientnegative/authorization_fail_8.q.out
      48c48
      < FAILED: Execution Error, return code 1 from org.apache.hadoop.hive.ql.exec.DDLTask. Permission denied. Principal [name=user2, type=USER] does not have following privileges on Object [type=TABLE_OR_VIEW, name=default.authorization_fail] for operation GRANT_PRIVILEGE : [SELECT with grant]
      ---
      > FAILED: Execution Error, return code 1 from org.apache.hadoop.hive.ql.exec.DDLTask. Permission denied. Principal [name=user2, type=USER] does not have following privileges on Object [type=TABLE_OR_VIEW, name=default.authorization_fail] : [SELECT with grant]
      

      and template update for HIVE-7385

        Issue Links

          Activity

          Hide
          Thejas M Nair added a comment -

          This has been fixed in 0.14 release. Please open new jira if you see any issues.

          Show
          Thejas M Nair added a comment - This has been fixed in 0.14 release. Please open new jira if you see any issues.
          Hide
          Lefty Leverenz added a comment -

          hive.optimize.null.scan is documented in the wiki here:

          Show
          Lefty Leverenz added a comment - hive.optimize.null.scan is documented in the wiki here: Configuration Properties – hive.optimize.null.scan
          Hide
          Lefty Leverenz added a comment -

          Just for the record (and searchability): this updates hive-default.xml.template with hive.optimize.null.scan which was added to HiveConf.java in HIVE-7385.

          There's a trivial typo in the parameter description, but it's also in HiveConf.java so the template file is an exact match. Both can be fixed another time.

          Show
          Lefty Leverenz added a comment - Just for the record (and searchability): this updates hive-default.xml.template with hive.optimize.null.scan which was added to HiveConf.java in HIVE-7385 . There's a trivial typo in the parameter description, but it's also in HiveConf.java so the template file is an exact match. Both can be fixed another time.
          Hide
          Navis added a comment -

          Committed to trunk. Thanks, Thejas.

          Show
          Navis added a comment - Committed to trunk. Thanks, Thejas.
          Hide
          Thejas M Nair added a comment -

          +1

          Show
          Thejas M Nair added a comment - +1
          Hide
          Hive QA added a comment -

          Overall: -1 at least one tests failed

          Here are the results of testing the latest attachment:
          https://issues.apache.org/jira/secure/attachment/12656815/HIVE-7456.1.patch.txt

          ERROR: -1 due to 2 failed/errored test(s), 5734 tests executed
          Failed tests:

          org.apache.hadoop.hive.cli.TestCliDriver.testCliDriver_groupby8_map
          org.apache.hadoop.hive.cli.TestMinimrCliDriver.testCliDriver_ql_rewrite_gbtoidx
          

          Test results: http://ec2-174-129-184-35.compute-1.amazonaws.com/jenkins/job/PreCommit-HIVE-Build/869/testReport
          Console output: http://ec2-174-129-184-35.compute-1.amazonaws.com/jenkins/job/PreCommit-HIVE-Build/869/console
          Test logs: http://ec2-174-129-184-35.compute-1.amazonaws.com/logs/PreCommit-HIVE-Build-869/

          Messages:

          Executing org.apache.hive.ptest.execution.PrepPhase
          Executing org.apache.hive.ptest.execution.ExecutionPhase
          Executing org.apache.hive.ptest.execution.ReportingPhase
          Tests exited with: TestsFailedException: 2 tests failed
          

          This message is automatically generated.

          ATTACHMENT ID: 12656815

          Show
          Hive QA added a comment - Overall : -1 at least one tests failed Here are the results of testing the latest attachment: https://issues.apache.org/jira/secure/attachment/12656815/HIVE-7456.1.patch.txt ERROR: -1 due to 2 failed/errored test(s), 5734 tests executed Failed tests: org.apache.hadoop.hive.cli.TestCliDriver.testCliDriver_groupby8_map org.apache.hadoop.hive.cli.TestMinimrCliDriver.testCliDriver_ql_rewrite_gbtoidx Test results: http://ec2-174-129-184-35.compute-1.amazonaws.com/jenkins/job/PreCommit-HIVE-Build/869/testReport Console output: http://ec2-174-129-184-35.compute-1.amazonaws.com/jenkins/job/PreCommit-HIVE-Build/869/console Test logs: http://ec2-174-129-184-35.compute-1.amazonaws.com/logs/PreCommit-HIVE-Build-869/ Messages: Executing org.apache.hive.ptest.execution.PrepPhase Executing org.apache.hive.ptest.execution.ExecutionPhase Executing org.apache.hive.ptest.execution.ReportingPhase Tests exited with: TestsFailedException: 2 tests failed This message is automatically generated. ATTACHMENT ID: 12656815

            People

            • Assignee:
              Navis
              Reporter:
              Navis
            • Votes:
              0 Vote for this issue
              Watchers:
              3 Start watching this issue

              Dates

              • Created:
                Updated:
                Resolved:

                Development