Hive
  1. Hive
  2. HIVE-7298

desc database extended does not show properties of the database

    Details

    • Type: Bug Bug
    • Status: Closed
    • Priority: Minor Minor
    • Resolution: Fixed
    • Affects Version/s: None
    • Fix Version/s: 0.14.0
    • Component/s: Query Processor
    • Labels:
      None

      Description

      HIVE-6386 added owner information to desc, but not updated schema of it.

      1. HIVE-7298.2.patch.txt
        8 kB
        Navis
      2. HIVE-7298.1.patch.txt
        4 kB
        Navis

        Activity

        Hide
        Thejas M Nair added a comment -

        This has been fixed in 0.14 release. Please open new jira if you see any issues.

        Show
        Thejas M Nair added a comment - This has been fixed in 0.14 release. Please open new jira if you see any issues.
        Hide
        Navis added a comment -

        Committed to trunk. Thanks Ashutosh, for the review!

        Show
        Navis added a comment - Committed to trunk. Thanks Ashutosh, for the review!
        Hide
        Navis added a comment -

        Fail of auto_join20.q is not related to this (Could not find status of job:job_local1690960560_0001). Will commit this shortly after.

        Show
        Navis added a comment - Fail of auto_join20.q is not related to this (Could not find status of job:job_local1690960560_0001). Will commit this shortly after.
        Hide
        Hive QA added a comment -

        Overall: -1 at least one tests failed

        Here are the results of testing the latest attachment:
        https://issues.apache.org/jira/secure/attachment/12652739/HIVE-7298.2.patch.txt

        ERROR: -1 due to 3 failed/errored test(s), 5670 tests executed
        Failed tests:

        org.apache.hadoop.hive.cli.TestCliDriver.testCliDriver_auto_join20
        org.apache.hadoop.hive.cli.TestMinimrCliDriver.testCliDriver_root_dir_external_table
        org.apache.hive.jdbc.miniHS2.TestHiveServer2.testConnection
        

        Test results: http://ec2-174-129-184-35.compute-1.amazonaws.com/jenkins/job/PreCommit-HIVE-Build/610/testReport
        Console output: http://ec2-174-129-184-35.compute-1.amazonaws.com/jenkins/job/PreCommit-HIVE-Build/610/console
        Test logs: http://ec2-174-129-184-35.compute-1.amazonaws.com/logs/PreCommit-HIVE-Build-610/

        Messages:

        Executing org.apache.hive.ptest.execution.PrepPhase
        Executing org.apache.hive.ptest.execution.ExecutionPhase
        Executing org.apache.hive.ptest.execution.ReportingPhase
        Tests exited with: TestsFailedException: 3 tests failed
        

        This message is automatically generated.

        ATTACHMENT ID: 12652739

        Show
        Hive QA added a comment - Overall : -1 at least one tests failed Here are the results of testing the latest attachment: https://issues.apache.org/jira/secure/attachment/12652739/HIVE-7298.2.patch.txt ERROR: -1 due to 3 failed/errored test(s), 5670 tests executed Failed tests: org.apache.hadoop.hive.cli.TestCliDriver.testCliDriver_auto_join20 org.apache.hadoop.hive.cli.TestMinimrCliDriver.testCliDriver_root_dir_external_table org.apache.hive.jdbc.miniHS2.TestHiveServer2.testConnection Test results: http://ec2-174-129-184-35.compute-1.amazonaws.com/jenkins/job/PreCommit-HIVE-Build/610/testReport Console output: http://ec2-174-129-184-35.compute-1.amazonaws.com/jenkins/job/PreCommit-HIVE-Build/610/console Test logs: http://ec2-174-129-184-35.compute-1.amazonaws.com/logs/PreCommit-HIVE-Build-610/ Messages: Executing org.apache.hive.ptest.execution.PrepPhase Executing org.apache.hive.ptest.execution.ExecutionPhase Executing org.apache.hive.ptest.execution.ReportingPhase Tests exited with: TestsFailedException: 3 tests failed This message is automatically generated. ATTACHMENT ID: 12652739
        Hide
        Sumit Kumar added a comment -

        +1

        Show
        Sumit Kumar added a comment - +1
        Hide
        Hive QA added a comment -

        Overall: -1 at least one tests failed

        Here are the results of testing the latest attachment:
        https://issues.apache.org/jira/secure/attachment/12652558/HIVE-7298.1.patch.txt

        ERROR: -1 due to 6 failed/errored test(s), 5655 tests executed
        Failed tests:

        org.apache.hadoop.hive.cli.TestCliDriver.testCliDriver_alter_db_owner
        org.apache.hadoop.hive.cli.TestCliDriver.testCliDriver_authorization_owner_actions_db
        org.apache.hadoop.hive.cli.TestCliDriver.testCliDriver_database_location
        org.apache.hadoop.hive.cli.TestCliDriver.testCliDriver_database_properties
        org.apache.hadoop.hive.cli.TestMinimrCliDriver.testCliDriver_root_dir_external_table
        org.apache.hive.hcatalog.cli.TestSemanticAnalysis.testDescDB
        

        Test results: http://ec2-174-129-184-35.compute-1.amazonaws.com/jenkins/job/PreCommit-HIVE-Build/599/testReport
        Console output: http://ec2-174-129-184-35.compute-1.amazonaws.com/jenkins/job/PreCommit-HIVE-Build/599/console
        Test logs: http://ec2-174-129-184-35.compute-1.amazonaws.com/logs/PreCommit-HIVE-Build-599/

        Messages:

        Executing org.apache.hive.ptest.execution.PrepPhase
        Executing org.apache.hive.ptest.execution.ExecutionPhase
        Executing org.apache.hive.ptest.execution.ReportingPhase
        Tests exited with: TestsFailedException: 6 tests failed
        

        This message is automatically generated.

        ATTACHMENT ID: 12652558

        Show
        Hive QA added a comment - Overall : -1 at least one tests failed Here are the results of testing the latest attachment: https://issues.apache.org/jira/secure/attachment/12652558/HIVE-7298.1.patch.txt ERROR: -1 due to 6 failed/errored test(s), 5655 tests executed Failed tests: org.apache.hadoop.hive.cli.TestCliDriver.testCliDriver_alter_db_owner org.apache.hadoop.hive.cli.TestCliDriver.testCliDriver_authorization_owner_actions_db org.apache.hadoop.hive.cli.TestCliDriver.testCliDriver_database_location org.apache.hadoop.hive.cli.TestCliDriver.testCliDriver_database_properties org.apache.hadoop.hive.cli.TestMinimrCliDriver.testCliDriver_root_dir_external_table org.apache.hive.hcatalog.cli.TestSemanticAnalysis.testDescDB Test results: http://ec2-174-129-184-35.compute-1.amazonaws.com/jenkins/job/PreCommit-HIVE-Build/599/testReport Console output: http://ec2-174-129-184-35.compute-1.amazonaws.com/jenkins/job/PreCommit-HIVE-Build/599/console Test logs: http://ec2-174-129-184-35.compute-1.amazonaws.com/logs/PreCommit-HIVE-Build-599/ Messages: Executing org.apache.hive.ptest.execution.PrepPhase Executing org.apache.hive.ptest.execution.ExecutionPhase Executing org.apache.hive.ptest.execution.ReportingPhase Tests exited with: TestsFailedException: 6 tests failed This message is automatically generated. ATTACHMENT ID: 12652558
        Hide
        Ashutosh Chauhan added a comment -

        +1

        Show
        Ashutosh Chauhan added a comment - +1

          People

          • Assignee:
            Navis
            Reporter:
            Navis
          • Votes:
            0 Vote for this issue
            Watchers:
            3 Start watching this issue

            Dates

            • Created:
              Updated:
              Resolved:

              Development