Details

    • Type: Task Task
    • Status: Closed
    • Priority: Major Major
    • Resolution: Fixed
    • Affects Version/s: None
    • Fix Version/s: 0.14.0
    • Component/s: Tests
    • Labels:
      None

      Description

      There is some code to workaround limitations in historic Hadoop (hadoop-17 & earlier). Lets get rid of those.

      1. HIVE-7008.patch
        24 kB
        Ashutosh Chauhan
      2. HIVE-7008.1.patch
        26 kB
        Ashutosh Chauhan

        Issue Links

          Activity

          Hide
          Ashutosh Chauhan added a comment -

          As a first step, mark now-obsolete classes as Deprecated and delete tests. Next release we should delete classes as well.

          Show
          Ashutosh Chauhan added a comment - As a first step, mark now-obsolete classes as Deprecated and delete tests. Next release we should delete classes as well.
          Show
          Ashutosh Chauhan added a comment - https://reviews.apache.org/r/21016/
          Hide
          Ashutosh Chauhan added a comment -

          Incorporated Jason's RB feedback.

          Show
          Ashutosh Chauhan added a comment - Incorporated Jason's RB feedback.
          Hide
          Jason Dere added a comment -

          +1

          Show
          Jason Dere added a comment - +1
          Hide
          Hive QA added a comment -

          Overall: -1 at least one tests failed

          Here are the results of testing the latest attachment:
          https://issues.apache.org/jira/secure/attachment/12643087/HIVE-7008.patch

          ERROR: -1 due to 6 failed/errored test(s), 5428 tests executed
          Failed tests:

          org.apache.hadoop.hive.cli.TestCliDriver.testCliDriver_groupby2_map_skew
          org.apache.hadoop.hive.cli.TestCliDriver.testCliDriver_stats_list_bucket
          org.apache.hadoop.hive.cli.TestCliDriver.testCliDriver_stats_partscan_1_23
          org.apache.hadoop.hive.cli.TestMinimrCliDriver.testCliDriver_root_dir_external_table
          org.apache.hadoop.hive.cli.TestNegativeCliDriver.testNegativeCliDriver_dynamic_partitions_with_whitelist
          org.apache.hadoop.hive.cli.TestNegativeCliDriver.testNegativeCliDriver_stats_partialscan_autogether
          

          Test results: http://ec2-174-129-184-35.compute-1.amazonaws.com/jenkins/job/PreCommit-HIVE-Build/108/testReport
          Console output: http://ec2-174-129-184-35.compute-1.amazonaws.com/jenkins/job/PreCommit-HIVE-Build/108/console

          Messages:

          Executing org.apache.hive.ptest.execution.PrepPhase
          Executing org.apache.hive.ptest.execution.ExecutionPhase
          Executing org.apache.hive.ptest.execution.ReportingPhase
          Tests exited with: TestsFailedException: 6 tests failed
          

          This message is automatically generated.

          ATTACHMENT ID: 12643087

          Show
          Hive QA added a comment - Overall : -1 at least one tests failed Here are the results of testing the latest attachment: https://issues.apache.org/jira/secure/attachment/12643087/HIVE-7008.patch ERROR: -1 due to 6 failed/errored test(s), 5428 tests executed Failed tests: org.apache.hadoop.hive.cli.TestCliDriver.testCliDriver_groupby2_map_skew org.apache.hadoop.hive.cli.TestCliDriver.testCliDriver_stats_list_bucket org.apache.hadoop.hive.cli.TestCliDriver.testCliDriver_stats_partscan_1_23 org.apache.hadoop.hive.cli.TestMinimrCliDriver.testCliDriver_root_dir_external_table org.apache.hadoop.hive.cli.TestNegativeCliDriver.testNegativeCliDriver_dynamic_partitions_with_whitelist org.apache.hadoop.hive.cli.TestNegativeCliDriver.testNegativeCliDriver_stats_partialscan_autogether Test results: http://ec2-174-129-184-35.compute-1.amazonaws.com/jenkins/job/PreCommit-HIVE-Build/108/testReport Console output: http://ec2-174-129-184-35.compute-1.amazonaws.com/jenkins/job/PreCommit-HIVE-Build/108/console Messages: Executing org.apache.hive.ptest.execution.PrepPhase Executing org.apache.hive.ptest.execution.ExecutionPhase Executing org.apache.hive.ptest.execution.ReportingPhase Tests exited with: TestsFailedException: 6 tests failed This message is automatically generated. ATTACHMENT ID: 12643087
          Hide
          Hive QA added a comment -

          Overall: -1 at least one tests failed

          Here are the results of testing the latest attachment:
          https://issues.apache.org/jira/secure/attachment/12643156/HIVE-7008.1.patch

          ERROR: -1 due to 6 failed/errored test(s), 5428 tests executed
          Failed tests:

          org.apache.hadoop.hive.cli.TestCliDriver.testCliDriver_groupby2_map_skew
          org.apache.hadoop.hive.cli.TestCliDriver.testCliDriver_stats_list_bucket
          org.apache.hadoop.hive.cli.TestCliDriver.testCliDriver_stats_partscan_1_23
          org.apache.hadoop.hive.cli.TestMinimrCliDriver.testCliDriver_root_dir_external_table
          org.apache.hadoop.hive.cli.TestNegativeCliDriver.testNegativeCliDriver_dynamic_partitions_with_whitelist
          org.apache.hadoop.hive.cli.TestNegativeCliDriver.testNegativeCliDriver_stats_partialscan_autogether
          

          Test results: http://ec2-174-129-184-35.compute-1.amazonaws.com/jenkins/job/PreCommit-HIVE-Build/114/testReport
          Console output: http://ec2-174-129-184-35.compute-1.amazonaws.com/jenkins/job/PreCommit-HIVE-Build/114/console

          Messages:

          Executing org.apache.hive.ptest.execution.PrepPhase
          Executing org.apache.hive.ptest.execution.ExecutionPhase
          Executing org.apache.hive.ptest.execution.ReportingPhase
          Tests exited with: TestsFailedException: 6 tests failed
          

          This message is automatically generated.

          ATTACHMENT ID: 12643156

          Show
          Hive QA added a comment - Overall : -1 at least one tests failed Here are the results of testing the latest attachment: https://issues.apache.org/jira/secure/attachment/12643156/HIVE-7008.1.patch ERROR: -1 due to 6 failed/errored test(s), 5428 tests executed Failed tests: org.apache.hadoop.hive.cli.TestCliDriver.testCliDriver_groupby2_map_skew org.apache.hadoop.hive.cli.TestCliDriver.testCliDriver_stats_list_bucket org.apache.hadoop.hive.cli.TestCliDriver.testCliDriver_stats_partscan_1_23 org.apache.hadoop.hive.cli.TestMinimrCliDriver.testCliDriver_root_dir_external_table org.apache.hadoop.hive.cli.TestNegativeCliDriver.testNegativeCliDriver_dynamic_partitions_with_whitelist org.apache.hadoop.hive.cli.TestNegativeCliDriver.testNegativeCliDriver_stats_partialscan_autogether Test results: http://ec2-174-129-184-35.compute-1.amazonaws.com/jenkins/job/PreCommit-HIVE-Build/114/testReport Console output: http://ec2-174-129-184-35.compute-1.amazonaws.com/jenkins/job/PreCommit-HIVE-Build/114/console Messages: Executing org.apache.hive.ptest.execution.PrepPhase Executing org.apache.hive.ptest.execution.ExecutionPhase Executing org.apache.hive.ptest.execution.ReportingPhase Tests exited with: TestsFailedException: 6 tests failed This message is automatically generated. ATTACHMENT ID: 12643156
          Hide
          Ashutosh Chauhan added a comment -

          Committed to trunk.

          Show
          Ashutosh Chauhan added a comment - Committed to trunk.
          Hide
          Thejas M Nair added a comment -

          This has been fixed in 0.14 release. Please open new jira if you see any issues.

          Show
          Thejas M Nair added a comment - This has been fixed in 0.14 release. Please open new jira if you see any issues.

            People

            • Assignee:
              Ashutosh Chauhan
              Reporter:
              Ashutosh Chauhan
            • Votes:
              0 Vote for this issue
              Watchers:
              2 Start watching this issue

              Dates

              • Created:
                Updated:
                Resolved:

                Development