Hive
  1. Hive
  2. HIVE-6901

Explain plan doesn't show operator tree for the fetch operator

    Details

    • Type: Bug Bug
    • Status: Closed
    • Priority: Minor Minor
    • Resolution: Fixed
    • Affects Version/s: 0.12.0
    • Fix Version/s: 0.14.0
    • Component/s: Query Processor
    • Labels:
      None

      Description

      Explaining a simple select query that involves a MR phase doesn't show processor tree for the fetch operator.

      hive> explain select d from test;
      OK
      STAGE DEPENDENCIES:
        Stage-1 is a root stage
        Stage-0 is a root stage
      
      STAGE PLANS:
        Stage: Stage-1
          Map Reduce
            Map Operator Tree:
      ...
        Stage: Stage-0
          Fetch Operator
            limit: -1
      

      It would be nice if the operator tree is shown even if there is only one node.

      Please note that in local execution, the operator tree is complete:

      hive> explain select * from test;
      OK
      STAGE DEPENDENCIES:
        Stage-0 is a root stage
      
      STAGE PLANS:
        Stage: Stage-0
          Fetch Operator
            limit: -1
            Processor Tree:
              TableScan
                alias: test
                Statistics: Num rows: 8 Data size: 34 Basic stats: COMPLETE Column stats: NONE
                Select Operator
                  expressions: d (type: int)
                  outputColumnNames: _col0
                  Statistics: Num rows: 8 Data size: 34 Basic stats: COMPLETE Column stats: NONE
                  ListSink
      
      1. HIVE-6901.patch
        1 kB
        Xuefu Zhang
      2. HIVE-6901.9.patch
        557 kB
        Xuefu Zhang
      3. HIVE-6901.8.patch
        621 kB
        Xuefu Zhang
      4. HIVE-6901.7.patch
        557 kB
        Xuefu Zhang
      5. HIVE-6901.6.patch
        563 kB
        Xuefu Zhang
      6. HIVE-6901.5.patch
        536 kB
        Xuefu Zhang
      7. HIVE-6901.4.patch
        494 kB
        Xuefu Zhang
      8. HIVE-6901.3.patch
        445 kB
        Xuefu Zhang
      9. HIVE-6901.2.patch
        446 kB
        Szehon Ho
      10. HIVE-6901.1.patch
        447 kB
        Xuefu Zhang
      11. HIVE-6109.10.patch
        529 kB
        Xuefu Zhang

        Issue Links

          Activity

          Transition Time In Source Status Execution Times Last Executer Last Execution Date
          Open Open Patch Available Patch Available
          11m 32s 1 Xuefu Zhang 12/Apr/14 03:42
          Patch Available Patch Available Resolved Resolved
          31d 13h 54m 1 Ashutosh Chauhan 13/May/14 17:36
          Resolved Resolved Closed Closed
          184d 3h 7m 1 Thejas M Nair 13/Nov/14 19:43
          Thejas M Nair made changes -
          Status Resolved [ 5 ] Closed [ 6 ]
          Hide
          Thejas M Nair added a comment -

          This has been fixed in 0.14 release. Please open new jira if you see any issues.

          Show
          Thejas M Nair added a comment - This has been fixed in 0.14 release. Please open new jira if you see any issues.
          Ashutosh Chauhan made changes -
          Status Patch Available [ 10002 ] Resolved [ 5 ]
          Fix Version/s 0.14.0 [ 12326450 ]
          Resolution Fixed [ 1 ]
          Hide
          Ashutosh Chauhan added a comment -

          Committed to trunk. Thanks, Xuefu!

          Show
          Ashutosh Chauhan added a comment - Committed to trunk. Thanks, Xuefu!
          Hide
          Ashutosh Chauhan added a comment -

          +1

          Show
          Ashutosh Chauhan added a comment - +1
          Hide
          Xuefu Zhang added a comment -

          Ashutosh Chauhan Would you mind reviewing the one-line change? Thanks.

          Show
          Xuefu Zhang added a comment - Ashutosh Chauhan Would you mind reviewing the one-line change? Thanks.
          Hide
          Hive QA added a comment -

          Overall: -1 at least one tests failed

          Here are the results of testing the latest attachment:
          https://issues.apache.org/jira/secure/attachment/12643097/HIVE-6109.10.patch

          ERROR: -1 due to 6 failed/errored test(s), 5430 tests executed
          Failed tests:

          org.apache.hadoop.hive.cli.TestCliDriver.testCliDriver_groupby2_map_skew
          org.apache.hadoop.hive.cli.TestCliDriver.testCliDriver_stats_list_bucket
          org.apache.hadoop.hive.cli.TestCliDriver.testCliDriver_stats_partscan_1_23
          org.apache.hadoop.hive.cli.TestMinimrCliDriver.testCliDriver_root_dir_external_table
          org.apache.hadoop.hive.cli.TestNegativeCliDriver.testNegativeCliDriver_dynamic_partitions_with_whitelist
          org.apache.hadoop.hive.cli.TestNegativeCliDriver.testNegativeCliDriver_stats_partialscan_autogether
          

          Test results: http://ec2-174-129-184-35.compute-1.amazonaws.com/jenkins/job/PreCommit-HIVE-Build/109/testReport
          Console output: http://ec2-174-129-184-35.compute-1.amazonaws.com/jenkins/job/PreCommit-HIVE-Build/109/console

          Messages:

          Executing org.apache.hive.ptest.execution.PrepPhase
          Executing org.apache.hive.ptest.execution.ExecutionPhase
          Executing org.apache.hive.ptest.execution.ReportingPhase
          Tests exited with: TestsFailedException: 6 tests failed
          

          This message is automatically generated.

          ATTACHMENT ID: 12643097

          Show
          Hive QA added a comment - Overall : -1 at least one tests failed Here are the results of testing the latest attachment: https://issues.apache.org/jira/secure/attachment/12643097/HIVE-6109.10.patch ERROR: -1 due to 6 failed/errored test(s), 5430 tests executed Failed tests: org.apache.hadoop.hive.cli.TestCliDriver.testCliDriver_groupby2_map_skew org.apache.hadoop.hive.cli.TestCliDriver.testCliDriver_stats_list_bucket org.apache.hadoop.hive.cli.TestCliDriver.testCliDriver_stats_partscan_1_23 org.apache.hadoop.hive.cli.TestMinimrCliDriver.testCliDriver_root_dir_external_table org.apache.hadoop.hive.cli.TestNegativeCliDriver.testNegativeCliDriver_dynamic_partitions_with_whitelist org.apache.hadoop.hive.cli.TestNegativeCliDriver.testNegativeCliDriver_stats_partialscan_autogether Test results: http://ec2-174-129-184-35.compute-1.amazonaws.com/jenkins/job/PreCommit-HIVE-Build/109/testReport Console output: http://ec2-174-129-184-35.compute-1.amazonaws.com/jenkins/job/PreCommit-HIVE-Build/109/console Messages: Executing org.apache.hive.ptest.execution.PrepPhase Executing org.apache.hive.ptest.execution.ExecutionPhase Executing org.apache.hive.ptest.execution.ReportingPhase Tests exited with: TestsFailedException: 6 tests failed This message is automatically generated. ATTACHMENT ID: 12643097
          Xuefu Zhang made changes -
          Attachment HIVE-6109.10.patch [ 12643097 ]
          Hide
          Hive QA added a comment -

          Overall: -1 no tests executed

          Here are the results of testing the latest attachment:
          https://issues.apache.org/jira/secure/attachment/12642733/HIVE-6901.9.patch

          Test results: http://ec2-174-129-184-35.compute-1.amazonaws.com/jenkins/job/PreCommit-HIVE-Build/99/testReport
          Console output: http://ec2-174-129-184-35.compute-1.amazonaws.com/jenkins/job/PreCommit-HIVE-Build/99/console

          Messages:

          Executing org.apache.hive.ptest.execution.PrepPhase
          Tests exited with: NonZeroExitCodeException
          Command 'bash /data/hive-ptest/working/scratch/source-prep.sh' failed with exit status 1 and output '+ [[ -n '' ]]
          + export 'ANT_OPTS=-Xmx1g -XX:MaxPermSize=256m '
          + ANT_OPTS='-Xmx1g -XX:MaxPermSize=256m '
          + export 'M2_OPTS=-Xmx1g -XX:MaxPermSize=256m -Dhttp.proxyHost=localhost -Dhttp.proxyPort=3128'
          + M2_OPTS='-Xmx1g -XX:MaxPermSize=256m -Dhttp.proxyHost=localhost -Dhttp.proxyPort=3128'
          + cd /data/hive-ptest/working/
          + tee /data/hive-ptest/logs/PreCommit-HIVE-Build-99/source-prep.txt
          + [[ false == \t\r\u\e ]]
          + mkdir -p maven ivy
          + [[ svn = \s\v\n ]]
          + [[ -n '' ]]
          + [[ -d apache-svn-trunk-source ]]
          + [[ ! -d apache-svn-trunk-source/.svn ]]
          + [[ ! -d apache-svn-trunk-source ]]
          + cd apache-svn-trunk-source
          + svn revert -R .
          Reverted 'conf/hive-default.xml.template'
          Reverted 'hbase-handler/src/java/org/apache/hadoop/hive/hbase/HiveHBaseTableInputFormat.java'
          Reverted 'hbase-handler/src/java/org/apache/hadoop/hive/hbase/HBaseSerDe.java'
          Reverted 'common/src/java/org/apache/hadoop/hive/conf/HiveConf.java'
          Reverted 'serde/src/test/org/apache/hadoop/hive/serde2/lazy/TestLazyPrimitive.java'
          Reverted 'serde/src/test/org/apache/hadoop/hive/serde2/thrift_test/CreateSequenceFile.java'
          Reverted 'serde/src/java/org/apache/hadoop/hive/serde2/lazy/LazySimpleSerDe.java'
          Reverted 'serde/src/java/org/apache/hadoop/hive/serde2/binarysortable/BinarySortableSerDe.java'
          Reverted 'serde/src/java/org/apache/hadoop/hive/serde2/binarysortable/OutputByteBuffer.java'
          Reverted 'serde/src/java/org/apache/hadoop/hive/serde2/columnar/ColumnarSerDe.java'
          Reverted 'serde/src/java/org/apache/hadoop/hive/serde2/columnar/LazyBinaryColumnarSerDe.java'
          Reverted 'serde/src/java/org/apache/hadoop/hive/serde2/lazybinary/LazyBinaryUtils.java'
          Reverted 'serde/src/java/org/apache/hadoop/hive/serde2/lazybinary/LazyBinarySerDe.java'
          Reverted 'serde/src/java/org/apache/hadoop/hive/serde2/lazybinary/objectinspector/LazyBinaryStructObjectInspector.java'
          Reverted 'serde/src/java/org/apache/hadoop/hive/serde2/lazybinary/LazyBinaryStruct.java'
          Reverted 'serde/src/java/org/apache/hadoop/hive/serde2/dynamic_type/DynamicSerDe.java'
          Reverted 'serde/src/java/org/apache/hadoop/hive/serde2/objectinspector/primitive/PrimitiveObjectInspectorConverter.java'
          Reverted 'serde/src/java/org/apache/hadoop/hive/serde2/ByteStream.java'
          Reverted 'serde/src/java/org/apache/hadoop/hive/serde2/io/HiveDecimalWritable.java'
          Reverted 'serde/src/java/org/apache/hadoop/hive/serde2/io/DateWritable.java'
          Reverted 'serde/src/java/org/apache/hadoop/hive/serde2/io/TimestampWritable.java'
          Reverted 'ql/src/test/results/clientpositive/mapjoin_mapjoin.q.out'
          Reverted 'ql/src/test/results/clientpositive/tez/mapjoin_mapjoin.q.out'
          Reverted 'ql/src/test/results/clientpositive/tez/mapjoin_decimal.q.out'
          Reverted 'ql/src/test/org/apache/hadoop/hive/ql/exec/persistence/TestMapJoinEqualityTableContainer.java'
          Reverted 'ql/src/test/org/apache/hadoop/hive/ql/exec/persistence/TestMapJoinTableContainer.java'
          Reverted 'ql/src/test/queries/clientpositive/mapjoin_decimal.q'
          Reverted 'ql/src/test/queries/clientpositive/mapjoin_mapjoin.q'
          Reverted 'ql/src/test/queries/clientpositive/tez_union.q'
          Reverted 'ql/src/java/org/apache/hadoop/hive/ql/optimizer/ReduceSinkMapJoinProc.java'
          Reverted 'ql/src/java/org/apache/hadoop/hive/ql/optimizer/ConvertJoinMapJoin.java'
          Reverted 'ql/src/java/org/apache/hadoop/hive/ql/plan/ReduceSinkDesc.java'
          Reverted 'ql/src/java/org/apache/hadoop/hive/ql/exec/HashTableSinkOperator.java'
          Reverted 'ql/src/java/org/apache/hadoop/hive/ql/exec/persistence/HashMapWrapper.java'
          Reverted 'ql/src/java/org/apache/hadoop/hive/ql/exec/persistence/MapJoinKey.java'
          Reverted 'ql/src/java/org/apache/hadoop/hive/ql/exec/persistence/MapJoinRowContainer.java'
          Reverted 'ql/src/java/org/apache/hadoop/hive/ql/exec/persistence/MapJoinTableContainer.java'
          Reverted 'ql/src/java/org/apache/hadoop/hive/ql/exec/persistence/MapJoinTableContainerSerDe.java'
          Reverted 'ql/src/java/org/apache/hadoop/hive/ql/exec/persistence/AbstractMapJoinTableContainer.java'
          Reverted 'ql/src/java/org/apache/hadoop/hive/ql/exec/MapJoinOperator.java'
          Reverted 'ql/src/java/org/apache/hadoop/hive/ql/exec/vector/VectorizedColumnarSerDe.java'
          Reverted 'ql/src/java/org/apache/hadoop/hive/ql/exec/vector/VectorMapJoinOperator.java'
          Reverted 'ql/src/java/org/apache/hadoop/hive/ql/exec/ReduceSinkOperator.java'
          Reverted 'ql/src/java/org/apache/hadoop/hive/ql/exec/tez/HashTableLoader.java'
          Reverted 'ql/src/java/org/apache/hadoop/hive/ql/Driver.java'
          Reverted 'ql/src/java/org/apache/hadoop/hive/ql/udf/UDFToString.java'
          ++ awk '{print $2}'
          ++ egrep -v '^X|^Performing status on external'
          ++ svn status --no-ignore
          + rm -rf target datanucleus.log ant/target shims/target shims/0.20/target shims/0.20S/target shims/0.23/target shims/aggregator/target shims/common/target shims/common-secure/target packaging/target hbase-handler/target testutils/target jdbc/target metastore/target itests/target itests/hcatalog-unit/target itests/test-serde/target itests/qtest/target itests/hive-minikdc/target itests/hive-unit/target itests/custom-serde/target itests/util/target hcatalog/target hcatalog/core/target hcatalog/streaming/target hcatalog/server-extensions/target hcatalog/webhcat/svr/target hcatalog/webhcat/java-client/target hcatalog/hcatalog-pig-adapter/target hwi/target common/target common/src/gen contrib/target service/target serde/target serde/src/java/org/apache/hadoop/hive/serde2/WriteBuffers.java beeline/target odbc/target cli/target ql/dependency-reduced-pom.xml ql/target ql/src/test/org/apache/hadoop/hive/ql/exec/persistence/TestBytesBytesMultiHashMap.java ql/src/java/org/apache/hadoop/hive/ql/debug ql/src/java/org/apache/hadoop/hive/ql/exec/persistence/MapJoinPersistableTableContainer.java ql/src/java/org/apache/hadoop/hive/ql/exec/persistence/BytesBytesMultiHashMap.java ql/src/java/org/apache/hadoop/hive/ql/exec/persistence/MapJoinBytesTableContainer.java
          + svn update
          A    data/files/test1.txt
          U    README.txt
          A    ql/src/test/results/clientpositive/analyze_table_null_partition.q.out
          U    ql/src/test/results/clientpositive/tez/tez_union.q.out
          U    ql/src/test/results/clientpositive/tez/bucket_map_join_tez1.q.out
          U    ql/src/test/results/clientpositive/tez/limit_pushdown.q.out
          U    ql/src/test/results/clientpositive/tez/union3.q.out
          U    ql/src/test/results/clientpositive/tez/union5.q.out
          U    ql/src/test/results/clientpositive/tez/union7.q.out
          U    ql/src/test/results/clientpositive/tez/union9.q.out
          U    ql/src/test/results/clientpositive/tez/count.q.out
          U    ql/src/test/results/clientpositive/tez/bucket_map_join_tez2.q.out
          U    ql/src/test/results/clientpositive/tez/tez_dml.q.out
          U    ql/src/test/results/clientpositive/tez/mrr.q.out
          U    ql/src/test/results/clientpositive/tez/union2.q.out
          U    ql/src/test/results/clientpositive/tez/load_dyn_part1.q.out
          A    ql/src/test/queries/clientpositive/analyze_table_null_partition.q
          U    ql/src/java/org/apache/hadoop/hive/ql/exec/TableScanOperator.java
          
          Fetching external item into 'hcatalog/src/test/e2e/harness'
          Updated external to revision 1591803.
          
          Updated to revision 1591803.
          + patchCommandPath=/data/hive-ptest/working/scratch/smart-apply-patch.sh
          + patchFilePath=/data/hive-ptest/working/scratch/build.patch
          + [[ -f /data/hive-ptest/working/scratch/build.patch ]]
          + chmod +x /data/hive-ptest/working/scratch/smart-apply-patch.sh
          + /data/hive-ptest/working/scratch/smart-apply-patch.sh /data/hive-ptest/working/scratch/build.patch
          The patch does not appear to apply with p0, p1, or p2
          + exit 1
          '
          

          This message is automatically generated.

          ATTACHMENT ID: 12642733

          Show
          Hive QA added a comment - Overall : -1 no tests executed Here are the results of testing the latest attachment: https://issues.apache.org/jira/secure/attachment/12642733/HIVE-6901.9.patch Test results: http://ec2-174-129-184-35.compute-1.amazonaws.com/jenkins/job/PreCommit-HIVE-Build/99/testReport Console output: http://ec2-174-129-184-35.compute-1.amazonaws.com/jenkins/job/PreCommit-HIVE-Build/99/console Messages: Executing org.apache.hive.ptest.execution.PrepPhase Tests exited with: NonZeroExitCodeException Command 'bash /data/hive-ptest/working/scratch/source-prep.sh' failed with exit status 1 and output '+ [[ -n '' ]] + export 'ANT_OPTS=-Xmx1g -XX:MaxPermSize=256m ' + ANT_OPTS='-Xmx1g -XX:MaxPermSize=256m ' + export 'M2_OPTS=-Xmx1g -XX:MaxPermSize=256m -Dhttp.proxyHost=localhost -Dhttp.proxyPort=3128' + M2_OPTS='-Xmx1g -XX:MaxPermSize=256m -Dhttp.proxyHost=localhost -Dhttp.proxyPort=3128' + cd /data/hive-ptest/working/ + tee /data/hive-ptest/logs/PreCommit-HIVE-Build-99/source-prep.txt + [[ false == \t\r\u\e ]] + mkdir -p maven ivy + [[ svn = \s\v\n ]] + [[ -n '' ]] + [[ -d apache-svn-trunk-source ]] + [[ ! -d apache-svn-trunk-source/.svn ]] + [[ ! -d apache-svn-trunk-source ]] + cd apache-svn-trunk-source + svn revert -R . Reverted 'conf/hive-default.xml.template' Reverted 'hbase-handler/src/java/org/apache/hadoop/hive/hbase/HiveHBaseTableInputFormat.java' Reverted 'hbase-handler/src/java/org/apache/hadoop/hive/hbase/HBaseSerDe.java' Reverted 'common/src/java/org/apache/hadoop/hive/conf/HiveConf.java' Reverted 'serde/src/test/org/apache/hadoop/hive/serde2/lazy/TestLazyPrimitive.java' Reverted 'serde/src/test/org/apache/hadoop/hive/serde2/thrift_test/CreateSequenceFile.java' Reverted 'serde/src/java/org/apache/hadoop/hive/serde2/lazy/LazySimpleSerDe.java' Reverted 'serde/src/java/org/apache/hadoop/hive/serde2/binarysortable/BinarySortableSerDe.java' Reverted 'serde/src/java/org/apache/hadoop/hive/serde2/binarysortable/OutputByteBuffer.java' Reverted 'serde/src/java/org/apache/hadoop/hive/serde2/columnar/ColumnarSerDe.java' Reverted 'serde/src/java/org/apache/hadoop/hive/serde2/columnar/LazyBinaryColumnarSerDe.java' Reverted 'serde/src/java/org/apache/hadoop/hive/serde2/lazybinary/LazyBinaryUtils.java' Reverted 'serde/src/java/org/apache/hadoop/hive/serde2/lazybinary/LazyBinarySerDe.java' Reverted 'serde/src/java/org/apache/hadoop/hive/serde2/lazybinary/objectinspector/LazyBinaryStructObjectInspector.java' Reverted 'serde/src/java/org/apache/hadoop/hive/serde2/lazybinary/LazyBinaryStruct.java' Reverted 'serde/src/java/org/apache/hadoop/hive/serde2/dynamic_type/DynamicSerDe.java' Reverted 'serde/src/java/org/apache/hadoop/hive/serde2/objectinspector/primitive/PrimitiveObjectInspectorConverter.java' Reverted 'serde/src/java/org/apache/hadoop/hive/serde2/ByteStream.java' Reverted 'serde/src/java/org/apache/hadoop/hive/serde2/io/HiveDecimalWritable.java' Reverted 'serde/src/java/org/apache/hadoop/hive/serde2/io/DateWritable.java' Reverted 'serde/src/java/org/apache/hadoop/hive/serde2/io/TimestampWritable.java' Reverted 'ql/src/test/results/clientpositive/mapjoin_mapjoin.q.out' Reverted 'ql/src/test/results/clientpositive/tez/mapjoin_mapjoin.q.out' Reverted 'ql/src/test/results/clientpositive/tez/mapjoin_decimal.q.out' Reverted 'ql/src/test/org/apache/hadoop/hive/ql/exec/persistence/TestMapJoinEqualityTableContainer.java' Reverted 'ql/src/test/org/apache/hadoop/hive/ql/exec/persistence/TestMapJoinTableContainer.java' Reverted 'ql/src/test/queries/clientpositive/mapjoin_decimal.q' Reverted 'ql/src/test/queries/clientpositive/mapjoin_mapjoin.q' Reverted 'ql/src/test/queries/clientpositive/tez_union.q' Reverted 'ql/src/java/org/apache/hadoop/hive/ql/optimizer/ReduceSinkMapJoinProc.java' Reverted 'ql/src/java/org/apache/hadoop/hive/ql/optimizer/ConvertJoinMapJoin.java' Reverted 'ql/src/java/org/apache/hadoop/hive/ql/plan/ReduceSinkDesc.java' Reverted 'ql/src/java/org/apache/hadoop/hive/ql/exec/HashTableSinkOperator.java' Reverted 'ql/src/java/org/apache/hadoop/hive/ql/exec/persistence/HashMapWrapper.java' Reverted 'ql/src/java/org/apache/hadoop/hive/ql/exec/persistence/MapJoinKey.java' Reverted 'ql/src/java/org/apache/hadoop/hive/ql/exec/persistence/MapJoinRowContainer.java' Reverted 'ql/src/java/org/apache/hadoop/hive/ql/exec/persistence/MapJoinTableContainer.java' Reverted 'ql/src/java/org/apache/hadoop/hive/ql/exec/persistence/MapJoinTableContainerSerDe.java' Reverted 'ql/src/java/org/apache/hadoop/hive/ql/exec/persistence/AbstractMapJoinTableContainer.java' Reverted 'ql/src/java/org/apache/hadoop/hive/ql/exec/MapJoinOperator.java' Reverted 'ql/src/java/org/apache/hadoop/hive/ql/exec/vector/VectorizedColumnarSerDe.java' Reverted 'ql/src/java/org/apache/hadoop/hive/ql/exec/vector/VectorMapJoinOperator.java' Reverted 'ql/src/java/org/apache/hadoop/hive/ql/exec/ReduceSinkOperator.java' Reverted 'ql/src/java/org/apache/hadoop/hive/ql/exec/tez/HashTableLoader.java' Reverted 'ql/src/java/org/apache/hadoop/hive/ql/Driver.java' Reverted 'ql/src/java/org/apache/hadoop/hive/ql/udf/UDFToString.java' ++ awk '{print $2}' ++ egrep -v '^X|^Performing status on external' ++ svn status --no-ignore + rm -rf target datanucleus.log ant/target shims/target shims/0.20/target shims/0.20S/target shims/0.23/target shims/aggregator/target shims/common/target shims/common-secure/target packaging/target hbase-handler/target testutils/target jdbc/target metastore/target itests/target itests/hcatalog-unit/target itests/test-serde/target itests/qtest/target itests/hive-minikdc/target itests/hive-unit/target itests/custom-serde/target itests/util/target hcatalog/target hcatalog/core/target hcatalog/streaming/target hcatalog/server-extensions/target hcatalog/webhcat/svr/target hcatalog/webhcat/java-client/target hcatalog/hcatalog-pig-adapter/target hwi/target common/target common/src/gen contrib/target service/target serde/target serde/src/java/org/apache/hadoop/hive/serde2/WriteBuffers.java beeline/target odbc/target cli/target ql/dependency-reduced-pom.xml ql/target ql/src/test/org/apache/hadoop/hive/ql/exec/persistence/TestBytesBytesMultiHashMap.java ql/src/java/org/apache/hadoop/hive/ql/debug ql/src/java/org/apache/hadoop/hive/ql/exec/persistence/MapJoinPersistableTableContainer.java ql/src/java/org/apache/hadoop/hive/ql/exec/persistence/BytesBytesMultiHashMap.java ql/src/java/org/apache/hadoop/hive/ql/exec/persistence/MapJoinBytesTableContainer.java + svn update A data/files/test1.txt U README.txt A ql/src/test/results/clientpositive/analyze_table_null_partition.q.out U ql/src/test/results/clientpositive/tez/tez_union.q.out U ql/src/test/results/clientpositive/tez/bucket_map_join_tez1.q.out U ql/src/test/results/clientpositive/tez/limit_pushdown.q.out U ql/src/test/results/clientpositive/tez/union3.q.out U ql/src/test/results/clientpositive/tez/union5.q.out U ql/src/test/results/clientpositive/tez/union7.q.out U ql/src/test/results/clientpositive/tez/union9.q.out U ql/src/test/results/clientpositive/tez/count.q.out U ql/src/test/results/clientpositive/tez/bucket_map_join_tez2.q.out U ql/src/test/results/clientpositive/tez/tez_dml.q.out U ql/src/test/results/clientpositive/tez/mrr.q.out U ql/src/test/results/clientpositive/tez/union2.q.out U ql/src/test/results/clientpositive/tez/load_dyn_part1.q.out A ql/src/test/queries/clientpositive/analyze_table_null_partition.q U ql/src/java/org/apache/hadoop/hive/ql/exec/TableScanOperator.java Fetching external item into 'hcatalog/src/test/e2e/harness' Updated external to revision 1591803. Updated to revision 1591803. + patchCommandPath=/data/hive-ptest/working/scratch/smart-apply-patch.sh + patchFilePath=/data/hive-ptest/working/scratch/build.patch + [[ -f /data/hive-ptest/working/scratch/build.patch ]] + chmod +x /data/hive-ptest/working/scratch/smart-apply-patch.sh + /data/hive-ptest/working/scratch/smart-apply-patch.sh /data/hive-ptest/working/scratch/build.patch The patch does not appear to apply with p0, p1, or p2 + exit 1 ' This message is automatically generated. ATTACHMENT ID: 12642733
          Xuefu Zhang made changes -
          Attachment HIVE-6901.9.patch [ 12642733 ]
          Hide
          Hive QA added a comment -

          Overall: -1 at least one tests failed

          Here are the results of testing the latest attachment:
          https://issues.apache.org/jira/secure/attachment/12642600/HIVE-6901.8.patch

          ERROR: -1 due to 12 failed/errored test(s), 5426 tests executed
          Failed tests:

          org.apache.hadoop.hive.cli.TestCliDriver.testCliDriver_groupby2_map_skew
          org.apache.hadoop.hive.cli.TestCliDriver.testCliDriver_groupby_sort_skew_1
          org.apache.hadoop.hive.cli.TestCliDriver.testCliDriver_list_bucket_dml_14
          org.apache.hadoop.hive.cli.TestCliDriver.testCliDriver_list_bucket_dml_6
          org.apache.hadoop.hive.cli.TestCliDriver.testCliDriver_list_bucket_dml_7
          org.apache.hadoop.hive.cli.TestCliDriver.testCliDriver_show_create_table_serde
          org.apache.hadoop.hive.cli.TestCliDriver.testCliDriver_stats_list_bucket
          org.apache.hadoop.hive.cli.TestCliDriver.testCliDriver_stats_partscan_1_23
          org.apache.hadoop.hive.cli.TestCliDriver.testCliDriver_unset_table_view_property
          org.apache.hadoop.hive.cli.TestMinimrCliDriver.testCliDriver_root_dir_external_table
          org.apache.hadoop.hive.cli.TestNegativeCliDriver.testNegativeCliDriver_dynamic_partitions_with_whitelist
          org.apache.hadoop.hive.cli.TestNegativeCliDriver.testNegativeCliDriver_stats_partialscan_autogether
          

          Test results: http://ec2-174-129-184-35.compute-1.amazonaws.com/jenkins/job/PreCommit-HIVE-Build/87/testReport
          Console output: http://ec2-174-129-184-35.compute-1.amazonaws.com/jenkins/job/PreCommit-HIVE-Build/87/console

          Messages:

          Executing org.apache.hive.ptest.execution.PrepPhase
          Executing org.apache.hive.ptest.execution.ExecutionPhase
          Executing org.apache.hive.ptest.execution.ReportingPhase
          Tests exited with: TestsFailedException: 12 tests failed
          

          This message is automatically generated.

          ATTACHMENT ID: 12642600

          Show
          Hive QA added a comment - Overall : -1 at least one tests failed Here are the results of testing the latest attachment: https://issues.apache.org/jira/secure/attachment/12642600/HIVE-6901.8.patch ERROR: -1 due to 12 failed/errored test(s), 5426 tests executed Failed tests: org.apache.hadoop.hive.cli.TestCliDriver.testCliDriver_groupby2_map_skew org.apache.hadoop.hive.cli.TestCliDriver.testCliDriver_groupby_sort_skew_1 org.apache.hadoop.hive.cli.TestCliDriver.testCliDriver_list_bucket_dml_14 org.apache.hadoop.hive.cli.TestCliDriver.testCliDriver_list_bucket_dml_6 org.apache.hadoop.hive.cli.TestCliDriver.testCliDriver_list_bucket_dml_7 org.apache.hadoop.hive.cli.TestCliDriver.testCliDriver_show_create_table_serde org.apache.hadoop.hive.cli.TestCliDriver.testCliDriver_stats_list_bucket org.apache.hadoop.hive.cli.TestCliDriver.testCliDriver_stats_partscan_1_23 org.apache.hadoop.hive.cli.TestCliDriver.testCliDriver_unset_table_view_property org.apache.hadoop.hive.cli.TestMinimrCliDriver.testCliDriver_root_dir_external_table org.apache.hadoop.hive.cli.TestNegativeCliDriver.testNegativeCliDriver_dynamic_partitions_with_whitelist org.apache.hadoop.hive.cli.TestNegativeCliDriver.testNegativeCliDriver_stats_partialscan_autogether Test results: http://ec2-174-129-184-35.compute-1.amazonaws.com/jenkins/job/PreCommit-HIVE-Build/87/testReport Console output: http://ec2-174-129-184-35.compute-1.amazonaws.com/jenkins/job/PreCommit-HIVE-Build/87/console Messages: Executing org.apache.hive.ptest.execution.PrepPhase Executing org.apache.hive.ptest.execution.ExecutionPhase Executing org.apache.hive.ptest.execution.ReportingPhase Tests exited with: TestsFailedException: 12 tests failed This message is automatically generated. ATTACHMENT ID: 12642600
          Xuefu Zhang made changes -
          Attachment HIVE-6901.8.patch [ 12642600 ]
          Hide
          Hive QA added a comment -

          Overall: -1 at least one tests failed

          Here are the results of testing the latest attachment:
          https://issues.apache.org/jira/secure/attachment/12642510/HIVE-6901.7.patch

          ERROR: -1 due to 14 failed/errored test(s), 5424 tests executed
          Failed tests:

          org.apache.hadoop.hive.cli.TestCliDriver.testCliDriver_groupby2_map_skew
          org.apache.hadoop.hive.cli.TestCliDriver.testCliDriver_groupby_sort_1
          org.apache.hadoop.hive.cli.TestCliDriver.testCliDriver_groupby_sort_skew_1
          org.apache.hadoop.hive.cli.TestCliDriver.testCliDriver_list_bucket_dml_14
          org.apache.hadoop.hive.cli.TestCliDriver.testCliDriver_list_bucket_dml_6
          org.apache.hadoop.hive.cli.TestCliDriver.testCliDriver_list_bucket_dml_7
          org.apache.hadoop.hive.cli.TestCliDriver.testCliDriver_list_bucket_dml_8
          org.apache.hadoop.hive.cli.TestCliDriver.testCliDriver_show_create_table_serde
          org.apache.hadoop.hive.cli.TestCliDriver.testCliDriver_stats_list_bucket
          org.apache.hadoop.hive.cli.TestCliDriver.testCliDriver_stats_partscan_1_23
          org.apache.hadoop.hive.cli.TestCliDriver.testCliDriver_truncate_column_list_bucket
          org.apache.hadoop.hive.cli.TestCliDriver.testCliDriver_unset_table_view_property
          org.apache.hadoop.hive.cli.TestMinimrCliDriver.testCliDriver_root_dir_external_table
          org.apache.hadoop.hive.cli.TestNegativeCliDriver.testNegativeCliDriver_dynamic_partitions_with_whitelist
          

          Test results: http://ec2-174-129-184-35.compute-1.amazonaws.com/jenkins/job/PreCommit-HIVE-Build/80/testReport
          Console output: http://ec2-174-129-184-35.compute-1.amazonaws.com/jenkins/job/PreCommit-HIVE-Build/80/console

          Messages:

          Executing org.apache.hive.ptest.execution.PrepPhase
          Executing org.apache.hive.ptest.execution.ExecutionPhase
          Executing org.apache.hive.ptest.execution.ReportingPhase
          Tests exited with: TestsFailedException: 14 tests failed
          

          This message is automatically generated.

          ATTACHMENT ID: 12642510

          Show
          Hive QA added a comment - Overall : -1 at least one tests failed Here are the results of testing the latest attachment: https://issues.apache.org/jira/secure/attachment/12642510/HIVE-6901.7.patch ERROR: -1 due to 14 failed/errored test(s), 5424 tests executed Failed tests: org.apache.hadoop.hive.cli.TestCliDriver.testCliDriver_groupby2_map_skew org.apache.hadoop.hive.cli.TestCliDriver.testCliDriver_groupby_sort_1 org.apache.hadoop.hive.cli.TestCliDriver.testCliDriver_groupby_sort_skew_1 org.apache.hadoop.hive.cli.TestCliDriver.testCliDriver_list_bucket_dml_14 org.apache.hadoop.hive.cli.TestCliDriver.testCliDriver_list_bucket_dml_6 org.apache.hadoop.hive.cli.TestCliDriver.testCliDriver_list_bucket_dml_7 org.apache.hadoop.hive.cli.TestCliDriver.testCliDriver_list_bucket_dml_8 org.apache.hadoop.hive.cli.TestCliDriver.testCliDriver_show_create_table_serde org.apache.hadoop.hive.cli.TestCliDriver.testCliDriver_stats_list_bucket org.apache.hadoop.hive.cli.TestCliDriver.testCliDriver_stats_partscan_1_23 org.apache.hadoop.hive.cli.TestCliDriver.testCliDriver_truncate_column_list_bucket org.apache.hadoop.hive.cli.TestCliDriver.testCliDriver_unset_table_view_property org.apache.hadoop.hive.cli.TestMinimrCliDriver.testCliDriver_root_dir_external_table org.apache.hadoop.hive.cli.TestNegativeCliDriver.testNegativeCliDriver_dynamic_partitions_with_whitelist Test results: http://ec2-174-129-184-35.compute-1.amazonaws.com/jenkins/job/PreCommit-HIVE-Build/80/testReport Console output: http://ec2-174-129-184-35.compute-1.amazonaws.com/jenkins/job/PreCommit-HIVE-Build/80/console Messages: Executing org.apache.hive.ptest.execution.PrepPhase Executing org.apache.hive.ptest.execution.ExecutionPhase Executing org.apache.hive.ptest.execution.ReportingPhase Tests exited with: TestsFailedException: 14 tests failed This message is automatically generated. ATTACHMENT ID: 12642510
          Xuefu Zhang made changes -
          Attachment HIVE-6901.7.patch [ 12642510 ]
          Hide
          Hive QA added a comment -

          Overall: -1 at least one tests failed

          Here are the results of testing the latest attachment:
          https://issues.apache.org/jira/secure/attachment/12642168/HIVE-6901.6.patch

          ERROR: -1 due to 46 failed/errored test(s), 5419 tests executed
          Failed tests:

          org.apache.hadoop.hive.cli.TestCliDriver.testCliDriver_auto_join32
          org.apache.hadoop.hive.cli.TestCliDriver.testCliDriver_filter_numeric
          org.apache.hadoop.hive.cli.TestCliDriver.testCliDriver_groupby2_map_skew
          org.apache.hadoop.hive.cli.TestCliDriver.testCliDriver_groupby_sort_1
          org.apache.hadoop.hive.cli.TestCliDriver.testCliDriver_infer_bucket_sort_list_bucket
          org.apache.hadoop.hive.cli.TestCliDriver.testCliDriver_list_bucket_dml_6
          org.apache.hadoop.hive.cli.TestCliDriver.testCliDriver_list_bucket_dml_7
          org.apache.hadoop.hive.cli.TestCliDriver.testCliDriver_list_bucket_dml_8
          org.apache.hadoop.hive.cli.TestCliDriver.testCliDriver_nullformatCTAS
          org.apache.hadoop.hive.cli.TestCliDriver.testCliDriver_nullgroup3
          org.apache.hadoop.hive.cli.TestCliDriver.testCliDriver_orc_createas1
          org.apache.hadoop.hive.cli.TestCliDriver.testCliDriver_ppd_join4
          org.apache.hadoop.hive.cli.TestCliDriver.testCliDriver_select_dummy_source
          org.apache.hadoop.hive.cli.TestCliDriver.testCliDriver_show_create_table_alter
          org.apache.hadoop.hive.cli.TestCliDriver.testCliDriver_show_create_table_serde
          org.apache.hadoop.hive.cli.TestCliDriver.testCliDriver_show_tblproperties
          org.apache.hadoop.hive.cli.TestCliDriver.testCliDriver_stats_list_bucket
          org.apache.hadoop.hive.cli.TestCliDriver.testCliDriver_stats_partscan_1_23
          org.apache.hadoop.hive.cli.TestCliDriver.testCliDriver_symlink_text_input_format
          org.apache.hadoop.hive.cli.TestCliDriver.testCliDriver_truncate_column_list_bucket
          org.apache.hadoop.hive.cli.TestCliDriver.testCliDriver_udf_current_database
          org.apache.hadoop.hive.cli.TestCliDriver.testCliDriver_union_remove_10
          org.apache.hadoop.hive.cli.TestCliDriver.testCliDriver_union_remove_12
          org.apache.hadoop.hive.cli.TestCliDriver.testCliDriver_union_remove_13
          org.apache.hadoop.hive.cli.TestCliDriver.testCliDriver_union_remove_14
          org.apache.hadoop.hive.cli.TestCliDriver.testCliDriver_union_remove_19
          org.apache.hadoop.hive.cli.TestCliDriver.testCliDriver_union_remove_2
          org.apache.hadoop.hive.cli.TestCliDriver.testCliDriver_union_remove_20
          org.apache.hadoop.hive.cli.TestCliDriver.testCliDriver_union_remove_21
          org.apache.hadoop.hive.cli.TestCliDriver.testCliDriver_union_remove_22
          org.apache.hadoop.hive.cli.TestCliDriver.testCliDriver_union_remove_23
          org.apache.hadoop.hive.cli.TestCliDriver.testCliDriver_union_remove_24
          org.apache.hadoop.hive.cli.TestCliDriver.testCliDriver_union_remove_4
          org.apache.hadoop.hive.cli.TestCliDriver.testCliDriver_union_remove_5
          org.apache.hadoop.hive.cli.TestCliDriver.testCliDriver_union_remove_7
          org.apache.hadoop.hive.cli.TestCliDriver.testCliDriver_union_remove_8
          org.apache.hadoop.hive.cli.TestCliDriver.testCliDriver_union_remove_9
          org.apache.hadoop.hive.cli.TestCliDriver.testCliDriver_unset_table_view_property
          org.apache.hadoop.hive.cli.TestMinimrCliDriver.testCliDriver_bucketizedhiveinputformat
          org.apache.hadoop.hive.cli.TestMinimrCliDriver.testCliDriver_root_dir_external_table
          org.apache.hadoop.hive.cli.TestNegativeCliDriver.testNegativeCliDriver_dynamic_partitions_with_whitelist
          org.apache.hadoop.hive.cli.TestNegativeCliDriver.testNegativeCliDriver_stats_partialscan_autogether
          org.apache.hadoop.hive.cli.TestNegativeCliDriver.testNegativeCliDriver_unset_table_property
          org.apache.hadoop.hive.metastore.TestMetaStoreAuthorization.testMetaStoreAuthorization
          org.apache.hadoop.hive.metastore.TestRetryingHMSHandler.testRetryingHMSHandler
          org.apache.hadoop.hive.ql.security.TestStorageBasedClientSideAuthorizationProvider.testSimplePrivileges
          

          Test results: http://ec2-174-129-184-35.compute-1.amazonaws.com/jenkins/job/PreCommit-HIVE-Build/61/testReport
          Console output: http://ec2-174-129-184-35.compute-1.amazonaws.com/jenkins/job/PreCommit-HIVE-Build/61/console

          Messages:

          Executing org.apache.hive.ptest.execution.PrepPhase
          Executing org.apache.hive.ptest.execution.ExecutionPhase
          Executing org.apache.hive.ptest.execution.ReportingPhase
          Tests exited with: TestsFailedException: 46 tests failed
          

          This message is automatically generated.

          ATTACHMENT ID: 12642168

          Show
          Hive QA added a comment - Overall : -1 at least one tests failed Here are the results of testing the latest attachment: https://issues.apache.org/jira/secure/attachment/12642168/HIVE-6901.6.patch ERROR: -1 due to 46 failed/errored test(s), 5419 tests executed Failed tests: org.apache.hadoop.hive.cli.TestCliDriver.testCliDriver_auto_join32 org.apache.hadoop.hive.cli.TestCliDriver.testCliDriver_filter_numeric org.apache.hadoop.hive.cli.TestCliDriver.testCliDriver_groupby2_map_skew org.apache.hadoop.hive.cli.TestCliDriver.testCliDriver_groupby_sort_1 org.apache.hadoop.hive.cli.TestCliDriver.testCliDriver_infer_bucket_sort_list_bucket org.apache.hadoop.hive.cli.TestCliDriver.testCliDriver_list_bucket_dml_6 org.apache.hadoop.hive.cli.TestCliDriver.testCliDriver_list_bucket_dml_7 org.apache.hadoop.hive.cli.TestCliDriver.testCliDriver_list_bucket_dml_8 org.apache.hadoop.hive.cli.TestCliDriver.testCliDriver_nullformatCTAS org.apache.hadoop.hive.cli.TestCliDriver.testCliDriver_nullgroup3 org.apache.hadoop.hive.cli.TestCliDriver.testCliDriver_orc_createas1 org.apache.hadoop.hive.cli.TestCliDriver.testCliDriver_ppd_join4 org.apache.hadoop.hive.cli.TestCliDriver.testCliDriver_select_dummy_source org.apache.hadoop.hive.cli.TestCliDriver.testCliDriver_show_create_table_alter org.apache.hadoop.hive.cli.TestCliDriver.testCliDriver_show_create_table_serde org.apache.hadoop.hive.cli.TestCliDriver.testCliDriver_show_tblproperties org.apache.hadoop.hive.cli.TestCliDriver.testCliDriver_stats_list_bucket org.apache.hadoop.hive.cli.TestCliDriver.testCliDriver_stats_partscan_1_23 org.apache.hadoop.hive.cli.TestCliDriver.testCliDriver_symlink_text_input_format org.apache.hadoop.hive.cli.TestCliDriver.testCliDriver_truncate_column_list_bucket org.apache.hadoop.hive.cli.TestCliDriver.testCliDriver_udf_current_database org.apache.hadoop.hive.cli.TestCliDriver.testCliDriver_union_remove_10 org.apache.hadoop.hive.cli.TestCliDriver.testCliDriver_union_remove_12 org.apache.hadoop.hive.cli.TestCliDriver.testCliDriver_union_remove_13 org.apache.hadoop.hive.cli.TestCliDriver.testCliDriver_union_remove_14 org.apache.hadoop.hive.cli.TestCliDriver.testCliDriver_union_remove_19 org.apache.hadoop.hive.cli.TestCliDriver.testCliDriver_union_remove_2 org.apache.hadoop.hive.cli.TestCliDriver.testCliDriver_union_remove_20 org.apache.hadoop.hive.cli.TestCliDriver.testCliDriver_union_remove_21 org.apache.hadoop.hive.cli.TestCliDriver.testCliDriver_union_remove_22 org.apache.hadoop.hive.cli.TestCliDriver.testCliDriver_union_remove_23 org.apache.hadoop.hive.cli.TestCliDriver.testCliDriver_union_remove_24 org.apache.hadoop.hive.cli.TestCliDriver.testCliDriver_union_remove_4 org.apache.hadoop.hive.cli.TestCliDriver.testCliDriver_union_remove_5 org.apache.hadoop.hive.cli.TestCliDriver.testCliDriver_union_remove_7 org.apache.hadoop.hive.cli.TestCliDriver.testCliDriver_union_remove_8 org.apache.hadoop.hive.cli.TestCliDriver.testCliDriver_union_remove_9 org.apache.hadoop.hive.cli.TestCliDriver.testCliDriver_unset_table_view_property org.apache.hadoop.hive.cli.TestMinimrCliDriver.testCliDriver_bucketizedhiveinputformat org.apache.hadoop.hive.cli.TestMinimrCliDriver.testCliDriver_root_dir_external_table org.apache.hadoop.hive.cli.TestNegativeCliDriver.testNegativeCliDriver_dynamic_partitions_with_whitelist org.apache.hadoop.hive.cli.TestNegativeCliDriver.testNegativeCliDriver_stats_partialscan_autogether org.apache.hadoop.hive.cli.TestNegativeCliDriver.testNegativeCliDriver_unset_table_property org.apache.hadoop.hive.metastore.TestMetaStoreAuthorization.testMetaStoreAuthorization org.apache.hadoop.hive.metastore.TestRetryingHMSHandler.testRetryingHMSHandler org.apache.hadoop.hive.ql.security.TestStorageBasedClientSideAuthorizationProvider.testSimplePrivileges Test results: http://ec2-174-129-184-35.compute-1.amazonaws.com/jenkins/job/PreCommit-HIVE-Build/61/testReport Console output: http://ec2-174-129-184-35.compute-1.amazonaws.com/jenkins/job/PreCommit-HIVE-Build/61/console Messages: Executing org.apache.hive.ptest.execution.PrepPhase Executing org.apache.hive.ptest.execution.ExecutionPhase Executing org.apache.hive.ptest.execution.ReportingPhase Tests exited with: TestsFailedException: 46 tests failed This message is automatically generated. ATTACHMENT ID: 12642168
          Xuefu Zhang made changes -
          Attachment HIVE-6901.6.patch [ 12642168 ]
          Hide
          Hive QA added a comment -

          Overall: -1 at least one tests failed

          Here are the results of testing the latest attachment:
          https://issues.apache.org/jira/secure/attachment/12642131/HIVE-6901.5.patch

          ERROR: -1 due to 55 failed/errored test(s), 5484 tests executed
          Failed tests:

          org.apache.hadoop.hive.cli.TestCliDriver.testCliDriver_auto_join32
          org.apache.hadoop.hive.cli.TestCliDriver.testCliDriver_filter_numeric
          org.apache.hadoop.hive.cli.TestCliDriver.testCliDriver_groupby2_map_skew
          org.apache.hadoop.hive.cli.TestCliDriver.testCliDriver_groupby_sort_1
          org.apache.hadoop.hive.cli.TestCliDriver.testCliDriver_infer_bucket_sort_list_bucket
          org.apache.hadoop.hive.cli.TestCliDriver.testCliDriver_list_bucket_dml_6
          org.apache.hadoop.hive.cli.TestCliDriver.testCliDriver_list_bucket_dml_7
          org.apache.hadoop.hive.cli.TestCliDriver.testCliDriver_list_bucket_dml_8
          org.apache.hadoop.hive.cli.TestCliDriver.testCliDriver_nullformatCTAS
          org.apache.hadoop.hive.cli.TestCliDriver.testCliDriver_nullgroup3
          org.apache.hadoop.hive.cli.TestCliDriver.testCliDriver_orc_createas1
          org.apache.hadoop.hive.cli.TestCliDriver.testCliDriver_ppd_join4
          org.apache.hadoop.hive.cli.TestCliDriver.testCliDriver_select_dummy_source
          org.apache.hadoop.hive.cli.TestCliDriver.testCliDriver_show_create_table_alter
          org.apache.hadoop.hive.cli.TestCliDriver.testCliDriver_show_create_table_serde
          org.apache.hadoop.hive.cli.TestCliDriver.testCliDriver_show_tblproperties
          org.apache.hadoop.hive.cli.TestCliDriver.testCliDriver_stats_list_bucket
          org.apache.hadoop.hive.cli.TestCliDriver.testCliDriver_stats_partscan_1_23
          org.apache.hadoop.hive.cli.TestCliDriver.testCliDriver_symlink_text_input_format
          org.apache.hadoop.hive.cli.TestCliDriver.testCliDriver_truncate_column_list_bucket
          org.apache.hadoop.hive.cli.TestCliDriver.testCliDriver_udf_current_database
          org.apache.hadoop.hive.cli.TestCliDriver.testCliDriver_union_remove_10
          org.apache.hadoop.hive.cli.TestCliDriver.testCliDriver_union_remove_12
          org.apache.hadoop.hive.cli.TestCliDriver.testCliDriver_union_remove_13
          org.apache.hadoop.hive.cli.TestCliDriver.testCliDriver_union_remove_14
          org.apache.hadoop.hive.cli.TestCliDriver.testCliDriver_union_remove_19
          org.apache.hadoop.hive.cli.TestCliDriver.testCliDriver_union_remove_2
          org.apache.hadoop.hive.cli.TestCliDriver.testCliDriver_union_remove_20
          org.apache.hadoop.hive.cli.TestCliDriver.testCliDriver_union_remove_21
          org.apache.hadoop.hive.cli.TestCliDriver.testCliDriver_union_remove_22
          org.apache.hadoop.hive.cli.TestCliDriver.testCliDriver_union_remove_23
          org.apache.hadoop.hive.cli.TestCliDriver.testCliDriver_union_remove_24
          org.apache.hadoop.hive.cli.TestCliDriver.testCliDriver_union_remove_4
          org.apache.hadoop.hive.cli.TestCliDriver.testCliDriver_union_remove_5
          org.apache.hadoop.hive.cli.TestCliDriver.testCliDriver_union_remove_7
          org.apache.hadoop.hive.cli.TestCliDriver.testCliDriver_union_remove_8
          org.apache.hadoop.hive.cli.TestCliDriver.testCliDriver_union_remove_9
          org.apache.hadoop.hive.cli.TestCliDriver.testCliDriver_unset_table_view_property
          org.apache.hadoop.hive.cli.TestMiniTezCliDriver.testCliDriver_bucket_map_join_tez1
          org.apache.hadoop.hive.cli.TestMiniTezCliDriver.testCliDriver_bucket_map_join_tez2
          org.apache.hadoop.hive.cli.TestMiniTezCliDriver.testCliDriver_count
          org.apache.hadoop.hive.cli.TestMiniTezCliDriver.testCliDriver_insert1
          org.apache.hadoop.hive.cli.TestMiniTezCliDriver.testCliDriver_limit_pushdown
          org.apache.hadoop.hive.cli.TestMiniTezCliDriver.testCliDriver_load_dyn_part1
          org.apache.hadoop.hive.cli.TestMiniTezCliDriver.testCliDriver_tez_union
          org.apache.hadoop.hive.cli.TestMiniTezCliDriver.testCliDriver_union2
          org.apache.hadoop.hive.cli.TestMiniTezCliDriver.testCliDriver_union3
          org.apache.hadoop.hive.cli.TestMiniTezCliDriver.testCliDriver_union5
          org.apache.hadoop.hive.cli.TestMiniTezCliDriver.testCliDriver_union7
          org.apache.hadoop.hive.cli.TestMiniTezCliDriver.testCliDriver_union9
          org.apache.hadoop.hive.cli.TestMinimrCliDriver.testCliDriver_bucketizedhiveinputformat
          org.apache.hadoop.hive.cli.TestMinimrCliDriver.testCliDriver_root_dir_external_table
          org.apache.hadoop.hive.cli.TestNegativeCliDriver.testNegativeCliDriver_dynamic_partitions_with_whitelist
          org.apache.hadoop.hive.cli.TestNegativeCliDriver.testNegativeCliDriver_stats_partialscan_autogether
          org.apache.hadoop.hive.cli.TestNegativeCliDriver.testNegativeCliDriver_unset_table_property
          

          Test results: http://ec2-174-129-184-35.compute-1.amazonaws.com/jenkins/job/PreCommit-HIVE-Build/60/testReport
          Console output: http://ec2-174-129-184-35.compute-1.amazonaws.com/jenkins/job/PreCommit-HIVE-Build/60/console

          Messages:

          Executing org.apache.hive.ptest.execution.PrepPhase
          Executing org.apache.hive.ptest.execution.ExecutionPhase
          Executing org.apache.hive.ptest.execution.ReportingPhase
          Tests exited with: TestsFailedException: 55 tests failed
          

          This message is automatically generated.

          ATTACHMENT ID: 12642131

          Show
          Hive QA added a comment - Overall : -1 at least one tests failed Here are the results of testing the latest attachment: https://issues.apache.org/jira/secure/attachment/12642131/HIVE-6901.5.patch ERROR: -1 due to 55 failed/errored test(s), 5484 tests executed Failed tests: org.apache.hadoop.hive.cli.TestCliDriver.testCliDriver_auto_join32 org.apache.hadoop.hive.cli.TestCliDriver.testCliDriver_filter_numeric org.apache.hadoop.hive.cli.TestCliDriver.testCliDriver_groupby2_map_skew org.apache.hadoop.hive.cli.TestCliDriver.testCliDriver_groupby_sort_1 org.apache.hadoop.hive.cli.TestCliDriver.testCliDriver_infer_bucket_sort_list_bucket org.apache.hadoop.hive.cli.TestCliDriver.testCliDriver_list_bucket_dml_6 org.apache.hadoop.hive.cli.TestCliDriver.testCliDriver_list_bucket_dml_7 org.apache.hadoop.hive.cli.TestCliDriver.testCliDriver_list_bucket_dml_8 org.apache.hadoop.hive.cli.TestCliDriver.testCliDriver_nullformatCTAS org.apache.hadoop.hive.cli.TestCliDriver.testCliDriver_nullgroup3 org.apache.hadoop.hive.cli.TestCliDriver.testCliDriver_orc_createas1 org.apache.hadoop.hive.cli.TestCliDriver.testCliDriver_ppd_join4 org.apache.hadoop.hive.cli.TestCliDriver.testCliDriver_select_dummy_source org.apache.hadoop.hive.cli.TestCliDriver.testCliDriver_show_create_table_alter org.apache.hadoop.hive.cli.TestCliDriver.testCliDriver_show_create_table_serde org.apache.hadoop.hive.cli.TestCliDriver.testCliDriver_show_tblproperties org.apache.hadoop.hive.cli.TestCliDriver.testCliDriver_stats_list_bucket org.apache.hadoop.hive.cli.TestCliDriver.testCliDriver_stats_partscan_1_23 org.apache.hadoop.hive.cli.TestCliDriver.testCliDriver_symlink_text_input_format org.apache.hadoop.hive.cli.TestCliDriver.testCliDriver_truncate_column_list_bucket org.apache.hadoop.hive.cli.TestCliDriver.testCliDriver_udf_current_database org.apache.hadoop.hive.cli.TestCliDriver.testCliDriver_union_remove_10 org.apache.hadoop.hive.cli.TestCliDriver.testCliDriver_union_remove_12 org.apache.hadoop.hive.cli.TestCliDriver.testCliDriver_union_remove_13 org.apache.hadoop.hive.cli.TestCliDriver.testCliDriver_union_remove_14 org.apache.hadoop.hive.cli.TestCliDriver.testCliDriver_union_remove_19 org.apache.hadoop.hive.cli.TestCliDriver.testCliDriver_union_remove_2 org.apache.hadoop.hive.cli.TestCliDriver.testCliDriver_union_remove_20 org.apache.hadoop.hive.cli.TestCliDriver.testCliDriver_union_remove_21 org.apache.hadoop.hive.cli.TestCliDriver.testCliDriver_union_remove_22 org.apache.hadoop.hive.cli.TestCliDriver.testCliDriver_union_remove_23 org.apache.hadoop.hive.cli.TestCliDriver.testCliDriver_union_remove_24 org.apache.hadoop.hive.cli.TestCliDriver.testCliDriver_union_remove_4 org.apache.hadoop.hive.cli.TestCliDriver.testCliDriver_union_remove_5 org.apache.hadoop.hive.cli.TestCliDriver.testCliDriver_union_remove_7 org.apache.hadoop.hive.cli.TestCliDriver.testCliDriver_union_remove_8 org.apache.hadoop.hive.cli.TestCliDriver.testCliDriver_union_remove_9 org.apache.hadoop.hive.cli.TestCliDriver.testCliDriver_unset_table_view_property org.apache.hadoop.hive.cli.TestMiniTezCliDriver.testCliDriver_bucket_map_join_tez1 org.apache.hadoop.hive.cli.TestMiniTezCliDriver.testCliDriver_bucket_map_join_tez2 org.apache.hadoop.hive.cli.TestMiniTezCliDriver.testCliDriver_count org.apache.hadoop.hive.cli.TestMiniTezCliDriver.testCliDriver_insert1 org.apache.hadoop.hive.cli.TestMiniTezCliDriver.testCliDriver_limit_pushdown org.apache.hadoop.hive.cli.TestMiniTezCliDriver.testCliDriver_load_dyn_part1 org.apache.hadoop.hive.cli.TestMiniTezCliDriver.testCliDriver_tez_union org.apache.hadoop.hive.cli.TestMiniTezCliDriver.testCliDriver_union2 org.apache.hadoop.hive.cli.TestMiniTezCliDriver.testCliDriver_union3 org.apache.hadoop.hive.cli.TestMiniTezCliDriver.testCliDriver_union5 org.apache.hadoop.hive.cli.TestMiniTezCliDriver.testCliDriver_union7 org.apache.hadoop.hive.cli.TestMiniTezCliDriver.testCliDriver_union9 org.apache.hadoop.hive.cli.TestMinimrCliDriver.testCliDriver_bucketizedhiveinputformat org.apache.hadoop.hive.cli.TestMinimrCliDriver.testCliDriver_root_dir_external_table org.apache.hadoop.hive.cli.TestNegativeCliDriver.testNegativeCliDriver_dynamic_partitions_with_whitelist org.apache.hadoop.hive.cli.TestNegativeCliDriver.testNegativeCliDriver_stats_partialscan_autogether org.apache.hadoop.hive.cli.TestNegativeCliDriver.testNegativeCliDriver_unset_table_property Test results: http://ec2-174-129-184-35.compute-1.amazonaws.com/jenkins/job/PreCommit-HIVE-Build/60/testReport Console output: http://ec2-174-129-184-35.compute-1.amazonaws.com/jenkins/job/PreCommit-HIVE-Build/60/console Messages: Executing org.apache.hive.ptest.execution.PrepPhase Executing org.apache.hive.ptest.execution.ExecutionPhase Executing org.apache.hive.ptest.execution.ReportingPhase Tests exited with: TestsFailedException: 55 tests failed This message is automatically generated. ATTACHMENT ID: 12642131
          Xuefu Zhang made changes -
          Attachment HIVE-6901.5.patch [ 12642131 ]
          Hide
          Hive QA added a comment -

          Overall: -1 at least one tests failed

          Here are the results of testing the latest attachment:
          https://issues.apache.org/jira/secure/attachment/12642064/HIVE-6901.4.patch

          ERROR: -1 due to 103 failed/errored test(s), 5484 tests executed
          Failed tests:

          org.apache.hadoop.hive.cli.TestCliDriver.testCliDriver_alter_partition_coltype
          org.apache.hadoop.hive.cli.TestCliDriver.testCliDriver_auto_join32
          org.apache.hadoop.hive.cli.TestCliDriver.testCliDriver_combine2
          org.apache.hadoop.hive.cli.TestCliDriver.testCliDriver_filter_numeric
          org.apache.hadoop.hive.cli.TestCliDriver.testCliDriver_groupby2_map_skew
          org.apache.hadoop.hive.cli.TestCliDriver.testCliDriver_groupby_sort_1
          org.apache.hadoop.hive.cli.TestCliDriver.testCliDriver_groupby_sort_skew_1
          org.apache.hadoop.hive.cli.TestCliDriver.testCliDriver_infer_bucket_sort_list_bucket
          org.apache.hadoop.hive.cli.TestCliDriver.testCliDriver_input39
          org.apache.hadoop.hive.cli.TestCliDriver.testCliDriver_list_bucket_dml_1
          org.apache.hadoop.hive.cli.TestCliDriver.testCliDriver_list_bucket_dml_11
          org.apache.hadoop.hive.cli.TestCliDriver.testCliDriver_list_bucket_dml_12
          org.apache.hadoop.hive.cli.TestCliDriver.testCliDriver_list_bucket_dml_13
          org.apache.hadoop.hive.cli.TestCliDriver.testCliDriver_list_bucket_dml_2
          org.apache.hadoop.hive.cli.TestCliDriver.testCliDriver_list_bucket_dml_3
          org.apache.hadoop.hive.cli.TestCliDriver.testCliDriver_list_bucket_dml_4
          org.apache.hadoop.hive.cli.TestCliDriver.testCliDriver_list_bucket_dml_5
          org.apache.hadoop.hive.cli.TestCliDriver.testCliDriver_list_bucket_dml_6
          org.apache.hadoop.hive.cli.TestCliDriver.testCliDriver_list_bucket_dml_7
          org.apache.hadoop.hive.cli.TestCliDriver.testCliDriver_list_bucket_dml_8
          org.apache.hadoop.hive.cli.TestCliDriver.testCliDriver_list_bucket_dml_9
          org.apache.hadoop.hive.cli.TestCliDriver.testCliDriver_list_bucket_query_multiskew_1
          org.apache.hadoop.hive.cli.TestCliDriver.testCliDriver_list_bucket_query_multiskew_2
          org.apache.hadoop.hive.cli.TestCliDriver.testCliDriver_list_bucket_query_multiskew_3
          org.apache.hadoop.hive.cli.TestCliDriver.testCliDriver_list_bucket_query_oneskew_1
          org.apache.hadoop.hive.cli.TestCliDriver.testCliDriver_list_bucket_query_oneskew_2
          org.apache.hadoop.hive.cli.TestCliDriver.testCliDriver_list_bucket_query_oneskew_3
          org.apache.hadoop.hive.cli.TestCliDriver.testCliDriver_mapjoin_test_outer
          org.apache.hadoop.hive.cli.TestCliDriver.testCliDriver_nullformatCTAS
          org.apache.hadoop.hive.cli.TestCliDriver.testCliDriver_nullgroup3
          org.apache.hadoop.hive.cli.TestCliDriver.testCliDriver_orc_createas1
          org.apache.hadoop.hive.cli.TestCliDriver.testCliDriver_ppd_join4
          org.apache.hadoop.hive.cli.TestCliDriver.testCliDriver_sample8
          org.apache.hadoop.hive.cli.TestCliDriver.testCliDriver_select_dummy_source
          org.apache.hadoop.hive.cli.TestCliDriver.testCliDriver_show_create_table_alter
          org.apache.hadoop.hive.cli.TestCliDriver.testCliDriver_show_create_table_serde
          org.apache.hadoop.hive.cli.TestCliDriver.testCliDriver_show_tblproperties
          org.apache.hadoop.hive.cli.TestCliDriver.testCliDriver_skewjoin_union_remove_1
          org.apache.hadoop.hive.cli.TestCliDriver.testCliDriver_skewjoin_union_remove_2
          org.apache.hadoop.hive.cli.TestCliDriver.testCliDriver_stats_list_bucket
          org.apache.hadoop.hive.cli.TestCliDriver.testCliDriver_stats_partscan_1_23
          org.apache.hadoop.hive.cli.TestCliDriver.testCliDriver_symlink_text_input_format
          org.apache.hadoop.hive.cli.TestCliDriver.testCliDriver_transform_ppr1
          org.apache.hadoop.hive.cli.TestCliDriver.testCliDriver_transform_ppr2
          org.apache.hadoop.hive.cli.TestCliDriver.testCliDriver_truncate_column_list_bucket
          org.apache.hadoop.hive.cli.TestCliDriver.testCliDriver_udf_current_database
          org.apache.hadoop.hive.cli.TestCliDriver.testCliDriver_union_ppr
          org.apache.hadoop.hive.cli.TestCliDriver.testCliDriver_union_remove_1
          org.apache.hadoop.hive.cli.TestCliDriver.testCliDriver_union_remove_10
          org.apache.hadoop.hive.cli.TestCliDriver.testCliDriver_union_remove_12
          org.apache.hadoop.hive.cli.TestCliDriver.testCliDriver_union_remove_13
          org.apache.hadoop.hive.cli.TestCliDriver.testCliDriver_union_remove_14
          org.apache.hadoop.hive.cli.TestCliDriver.testCliDriver_union_remove_19
          org.apache.hadoop.hive.cli.TestCliDriver.testCliDriver_union_remove_2
          org.apache.hadoop.hive.cli.TestCliDriver.testCliDriver_union_remove_20
          org.apache.hadoop.hive.cli.TestCliDriver.testCliDriver_union_remove_21
          org.apache.hadoop.hive.cli.TestCliDriver.testCliDriver_union_remove_22
          org.apache.hadoop.hive.cli.TestCliDriver.testCliDriver_union_remove_23
          org.apache.hadoop.hive.cli.TestCliDriver.testCliDriver_union_remove_24
          org.apache.hadoop.hive.cli.TestCliDriver.testCliDriver_union_remove_4
          org.apache.hadoop.hive.cli.TestCliDriver.testCliDriver_union_remove_5
          org.apache.hadoop.hive.cli.TestCliDriver.testCliDriver_union_remove_7
          org.apache.hadoop.hive.cli.TestCliDriver.testCliDriver_union_remove_8
          org.apache.hadoop.hive.cli.TestCliDriver.testCliDriver_union_remove_9
          org.apache.hadoop.hive.cli.TestCliDriver.testCliDriver_unset_table_view_property
          org.apache.hadoop.hive.cli.TestMiniTezCliDriver.testCliDriver_auto_join0
          org.apache.hadoop.hive.cli.TestMiniTezCliDriver.testCliDriver_bucket2
          org.apache.hadoop.hive.cli.TestMiniTezCliDriver.testCliDriver_bucket3
          org.apache.hadoop.hive.cli.TestMiniTezCliDriver.testCliDriver_bucket4
          org.apache.hadoop.hive.cli.TestMiniTezCliDriver.testCliDriver_bucket_map_join_tez1
          org.apache.hadoop.hive.cli.TestMiniTezCliDriver.testCliDriver_bucket_map_join_tez2
          org.apache.hadoop.hive.cli.TestMiniTezCliDriver.testCliDriver_count
          org.apache.hadoop.hive.cli.TestMiniTezCliDriver.testCliDriver_cross_join
          org.apache.hadoop.hive.cli.TestMiniTezCliDriver.testCliDriver_cross_product_check_1
          org.apache.hadoop.hive.cli.TestMiniTezCliDriver.testCliDriver_cross_product_check_2
          org.apache.hadoop.hive.cli.TestMiniTezCliDriver.testCliDriver_disable_merge_for_bucketing
          org.apache.hadoop.hive.cli.TestMiniTezCliDriver.testCliDriver_filter_join_breaktask
          org.apache.hadoop.hive.cli.TestMiniTezCliDriver.testCliDriver_having
          org.apache.hadoop.hive.cli.TestMiniTezCliDriver.testCliDriver_join0
          org.apache.hadoop.hive.cli.TestMiniTezCliDriver.testCliDriver_limit_pushdown
          org.apache.hadoop.hive.cli.TestMiniTezCliDriver.testCliDriver_load_dyn_part1
          org.apache.hadoop.hive.cli.TestMiniTezCliDriver.testCliDriver_mapjoin_decimal
          org.apache.hadoop.hive.cli.TestMiniTezCliDriver.testCliDriver_mapjoin_mapjoin
          org.apache.hadoop.hive.cli.TestMiniTezCliDriver.testCliDriver_metadata_only_queries
          org.apache.hadoop.hive.cli.TestMiniTezCliDriver.testCliDriver_mrr
          org.apache.hadoop.hive.cli.TestMiniTezCliDriver.testCliDriver_subquery_exists
          org.apache.hadoop.hive.cli.TestMiniTezCliDriver.testCliDriver_subquery_in
          org.apache.hadoop.hive.cli.TestMiniTezCliDriver.testCliDriver_tez_join_tests
          org.apache.hadoop.hive.cli.TestMiniTezCliDriver.testCliDriver_tez_joins_explain
          org.apache.hadoop.hive.cli.TestMiniTezCliDriver.testCliDriver_tez_union
          org.apache.hadoop.hive.cli.TestMiniTezCliDriver.testCliDriver_union2
          org.apache.hadoop.hive.cli.TestMiniTezCliDriver.testCliDriver_union3
          org.apache.hadoop.hive.cli.TestMiniTezCliDriver.testCliDriver_union5
          org.apache.hadoop.hive.cli.TestMiniTezCliDriver.testCliDriver_union7
          org.apache.hadoop.hive.cli.TestMiniTezCliDriver.testCliDriver_union8
          org.apache.hadoop.hive.cli.TestMiniTezCliDriver.testCliDriver_union9
          org.apache.hadoop.hive.cli.TestMinimrCliDriver.testCliDriver_bucketizedhiveinputformat
          org.apache.hadoop.hive.cli.TestMinimrCliDriver.testCliDriver_root_dir_external_table
          org.apache.hadoop.hive.cli.TestMinimrCliDriver.testCliDriver_stats_counter
          org.apache.hadoop.hive.cli.TestNegativeCliDriver.testNegativeCliDriver_authorization_part
          org.apache.hadoop.hive.cli.TestNegativeCliDriver.testNegativeCliDriver_dynamic_partitions_with_whitelist
          org.apache.hadoop.hive.cli.TestNegativeCliDriver.testNegativeCliDriver_stats_partialscan_autogether
          org.apache.hadoop.hive.cli.TestNegativeCliDriver.testNegativeCliDriver_unset_table_property
          

          Test results: http://ec2-174-129-184-35.compute-1.amazonaws.com/jenkins/job/PreCommit-HIVE-Build/57/testReport
          Console output: http://ec2-174-129-184-35.compute-1.amazonaws.com/jenkins/job/PreCommit-HIVE-Build/57/console

          Messages:

          Executing org.apache.hive.ptest.execution.PrepPhase
          Executing org.apache.hive.ptest.execution.ExecutionPhase
          Executing org.apache.hive.ptest.execution.ReportingPhase
          Tests exited with: TestsFailedException: 103 tests failed
          

          This message is automatically generated.

          ATTACHMENT ID: 12642064

          Show
          Hive QA added a comment - Overall : -1 at least one tests failed Here are the results of testing the latest attachment: https://issues.apache.org/jira/secure/attachment/12642064/HIVE-6901.4.patch ERROR: -1 due to 103 failed/errored test(s), 5484 tests executed Failed tests: org.apache.hadoop.hive.cli.TestCliDriver.testCliDriver_alter_partition_coltype org.apache.hadoop.hive.cli.TestCliDriver.testCliDriver_auto_join32 org.apache.hadoop.hive.cli.TestCliDriver.testCliDriver_combine2 org.apache.hadoop.hive.cli.TestCliDriver.testCliDriver_filter_numeric org.apache.hadoop.hive.cli.TestCliDriver.testCliDriver_groupby2_map_skew org.apache.hadoop.hive.cli.TestCliDriver.testCliDriver_groupby_sort_1 org.apache.hadoop.hive.cli.TestCliDriver.testCliDriver_groupby_sort_skew_1 org.apache.hadoop.hive.cli.TestCliDriver.testCliDriver_infer_bucket_sort_list_bucket org.apache.hadoop.hive.cli.TestCliDriver.testCliDriver_input39 org.apache.hadoop.hive.cli.TestCliDriver.testCliDriver_list_bucket_dml_1 org.apache.hadoop.hive.cli.TestCliDriver.testCliDriver_list_bucket_dml_11 org.apache.hadoop.hive.cli.TestCliDriver.testCliDriver_list_bucket_dml_12 org.apache.hadoop.hive.cli.TestCliDriver.testCliDriver_list_bucket_dml_13 org.apache.hadoop.hive.cli.TestCliDriver.testCliDriver_list_bucket_dml_2 org.apache.hadoop.hive.cli.TestCliDriver.testCliDriver_list_bucket_dml_3 org.apache.hadoop.hive.cli.TestCliDriver.testCliDriver_list_bucket_dml_4 org.apache.hadoop.hive.cli.TestCliDriver.testCliDriver_list_bucket_dml_5 org.apache.hadoop.hive.cli.TestCliDriver.testCliDriver_list_bucket_dml_6 org.apache.hadoop.hive.cli.TestCliDriver.testCliDriver_list_bucket_dml_7 org.apache.hadoop.hive.cli.TestCliDriver.testCliDriver_list_bucket_dml_8 org.apache.hadoop.hive.cli.TestCliDriver.testCliDriver_list_bucket_dml_9 org.apache.hadoop.hive.cli.TestCliDriver.testCliDriver_list_bucket_query_multiskew_1 org.apache.hadoop.hive.cli.TestCliDriver.testCliDriver_list_bucket_query_multiskew_2 org.apache.hadoop.hive.cli.TestCliDriver.testCliDriver_list_bucket_query_multiskew_3 org.apache.hadoop.hive.cli.TestCliDriver.testCliDriver_list_bucket_query_oneskew_1 org.apache.hadoop.hive.cli.TestCliDriver.testCliDriver_list_bucket_query_oneskew_2 org.apache.hadoop.hive.cli.TestCliDriver.testCliDriver_list_bucket_query_oneskew_3 org.apache.hadoop.hive.cli.TestCliDriver.testCliDriver_mapjoin_test_outer org.apache.hadoop.hive.cli.TestCliDriver.testCliDriver_nullformatCTAS org.apache.hadoop.hive.cli.TestCliDriver.testCliDriver_nullgroup3 org.apache.hadoop.hive.cli.TestCliDriver.testCliDriver_orc_createas1 org.apache.hadoop.hive.cli.TestCliDriver.testCliDriver_ppd_join4 org.apache.hadoop.hive.cli.TestCliDriver.testCliDriver_sample8 org.apache.hadoop.hive.cli.TestCliDriver.testCliDriver_select_dummy_source org.apache.hadoop.hive.cli.TestCliDriver.testCliDriver_show_create_table_alter org.apache.hadoop.hive.cli.TestCliDriver.testCliDriver_show_create_table_serde org.apache.hadoop.hive.cli.TestCliDriver.testCliDriver_show_tblproperties org.apache.hadoop.hive.cli.TestCliDriver.testCliDriver_skewjoin_union_remove_1 org.apache.hadoop.hive.cli.TestCliDriver.testCliDriver_skewjoin_union_remove_2 org.apache.hadoop.hive.cli.TestCliDriver.testCliDriver_stats_list_bucket org.apache.hadoop.hive.cli.TestCliDriver.testCliDriver_stats_partscan_1_23 org.apache.hadoop.hive.cli.TestCliDriver.testCliDriver_symlink_text_input_format org.apache.hadoop.hive.cli.TestCliDriver.testCliDriver_transform_ppr1 org.apache.hadoop.hive.cli.TestCliDriver.testCliDriver_transform_ppr2 org.apache.hadoop.hive.cli.TestCliDriver.testCliDriver_truncate_column_list_bucket org.apache.hadoop.hive.cli.TestCliDriver.testCliDriver_udf_current_database org.apache.hadoop.hive.cli.TestCliDriver.testCliDriver_union_ppr org.apache.hadoop.hive.cli.TestCliDriver.testCliDriver_union_remove_1 org.apache.hadoop.hive.cli.TestCliDriver.testCliDriver_union_remove_10 org.apache.hadoop.hive.cli.TestCliDriver.testCliDriver_union_remove_12 org.apache.hadoop.hive.cli.TestCliDriver.testCliDriver_union_remove_13 org.apache.hadoop.hive.cli.TestCliDriver.testCliDriver_union_remove_14 org.apache.hadoop.hive.cli.TestCliDriver.testCliDriver_union_remove_19 org.apache.hadoop.hive.cli.TestCliDriver.testCliDriver_union_remove_2 org.apache.hadoop.hive.cli.TestCliDriver.testCliDriver_union_remove_20 org.apache.hadoop.hive.cli.TestCliDriver.testCliDriver_union_remove_21 org.apache.hadoop.hive.cli.TestCliDriver.testCliDriver_union_remove_22 org.apache.hadoop.hive.cli.TestCliDriver.testCliDriver_union_remove_23 org.apache.hadoop.hive.cli.TestCliDriver.testCliDriver_union_remove_24 org.apache.hadoop.hive.cli.TestCliDriver.testCliDriver_union_remove_4 org.apache.hadoop.hive.cli.TestCliDriver.testCliDriver_union_remove_5 org.apache.hadoop.hive.cli.TestCliDriver.testCliDriver_union_remove_7 org.apache.hadoop.hive.cli.TestCliDriver.testCliDriver_union_remove_8 org.apache.hadoop.hive.cli.TestCliDriver.testCliDriver_union_remove_9 org.apache.hadoop.hive.cli.TestCliDriver.testCliDriver_unset_table_view_property org.apache.hadoop.hive.cli.TestMiniTezCliDriver.testCliDriver_auto_join0 org.apache.hadoop.hive.cli.TestMiniTezCliDriver.testCliDriver_bucket2 org.apache.hadoop.hive.cli.TestMiniTezCliDriver.testCliDriver_bucket3 org.apache.hadoop.hive.cli.TestMiniTezCliDriver.testCliDriver_bucket4 org.apache.hadoop.hive.cli.TestMiniTezCliDriver.testCliDriver_bucket_map_join_tez1 org.apache.hadoop.hive.cli.TestMiniTezCliDriver.testCliDriver_bucket_map_join_tez2 org.apache.hadoop.hive.cli.TestMiniTezCliDriver.testCliDriver_count org.apache.hadoop.hive.cli.TestMiniTezCliDriver.testCliDriver_cross_join org.apache.hadoop.hive.cli.TestMiniTezCliDriver.testCliDriver_cross_product_check_1 org.apache.hadoop.hive.cli.TestMiniTezCliDriver.testCliDriver_cross_product_check_2 org.apache.hadoop.hive.cli.TestMiniTezCliDriver.testCliDriver_disable_merge_for_bucketing org.apache.hadoop.hive.cli.TestMiniTezCliDriver.testCliDriver_filter_join_breaktask org.apache.hadoop.hive.cli.TestMiniTezCliDriver.testCliDriver_having org.apache.hadoop.hive.cli.TestMiniTezCliDriver.testCliDriver_join0 org.apache.hadoop.hive.cli.TestMiniTezCliDriver.testCliDriver_limit_pushdown org.apache.hadoop.hive.cli.TestMiniTezCliDriver.testCliDriver_load_dyn_part1 org.apache.hadoop.hive.cli.TestMiniTezCliDriver.testCliDriver_mapjoin_decimal org.apache.hadoop.hive.cli.TestMiniTezCliDriver.testCliDriver_mapjoin_mapjoin org.apache.hadoop.hive.cli.TestMiniTezCliDriver.testCliDriver_metadata_only_queries org.apache.hadoop.hive.cli.TestMiniTezCliDriver.testCliDriver_mrr org.apache.hadoop.hive.cli.TestMiniTezCliDriver.testCliDriver_subquery_exists org.apache.hadoop.hive.cli.TestMiniTezCliDriver.testCliDriver_subquery_in org.apache.hadoop.hive.cli.TestMiniTezCliDriver.testCliDriver_tez_join_tests org.apache.hadoop.hive.cli.TestMiniTezCliDriver.testCliDriver_tez_joins_explain org.apache.hadoop.hive.cli.TestMiniTezCliDriver.testCliDriver_tez_union org.apache.hadoop.hive.cli.TestMiniTezCliDriver.testCliDriver_union2 org.apache.hadoop.hive.cli.TestMiniTezCliDriver.testCliDriver_union3 org.apache.hadoop.hive.cli.TestMiniTezCliDriver.testCliDriver_union5 org.apache.hadoop.hive.cli.TestMiniTezCliDriver.testCliDriver_union7 org.apache.hadoop.hive.cli.TestMiniTezCliDriver.testCliDriver_union8 org.apache.hadoop.hive.cli.TestMiniTezCliDriver.testCliDriver_union9 org.apache.hadoop.hive.cli.TestMinimrCliDriver.testCliDriver_bucketizedhiveinputformat org.apache.hadoop.hive.cli.TestMinimrCliDriver.testCliDriver_root_dir_external_table org.apache.hadoop.hive.cli.TestMinimrCliDriver.testCliDriver_stats_counter org.apache.hadoop.hive.cli.TestNegativeCliDriver.testNegativeCliDriver_authorization_part org.apache.hadoop.hive.cli.TestNegativeCliDriver.testNegativeCliDriver_dynamic_partitions_with_whitelist org.apache.hadoop.hive.cli.TestNegativeCliDriver.testNegativeCliDriver_stats_partialscan_autogether org.apache.hadoop.hive.cli.TestNegativeCliDriver.testNegativeCliDriver_unset_table_property Test results: http://ec2-174-129-184-35.compute-1.amazonaws.com/jenkins/job/PreCommit-HIVE-Build/57/testReport Console output: http://ec2-174-129-184-35.compute-1.amazonaws.com/jenkins/job/PreCommit-HIVE-Build/57/console Messages: Executing org.apache.hive.ptest.execution.PrepPhase Executing org.apache.hive.ptest.execution.ExecutionPhase Executing org.apache.hive.ptest.execution.ReportingPhase Tests exited with: TestsFailedException: 103 tests failed This message is automatically generated. ATTACHMENT ID: 12642064
          Xuefu Zhang made changes -
          Attachment HIVE-6901.4.patch [ 12642064 ]
          Hide
          Hive QA added a comment -

          Overall: -1 at least one tests failed

          Here are the results of testing the latest attachment:
          https://issues.apache.org/jira/secure/attachment/12641980/HIVE-6901.3.patch

          ERROR: -1 due to 123 failed/errored test(s), 5418 tests executed
          Failed tests:

          org.apache.hadoop.hive.cli.TestCliDriver.testCliDriver_alter_partition_coltype
          org.apache.hadoop.hive.cli.TestCliDriver.testCliDriver_annotate_stats_filter
          org.apache.hadoop.hive.cli.TestCliDriver.testCliDriver_annotate_stats_part
          org.apache.hadoop.hive.cli.TestCliDriver.testCliDriver_annotate_stats_union
          org.apache.hadoop.hive.cli.TestCliDriver.testCliDriver_auto_join32
          org.apache.hadoop.hive.cli.TestCliDriver.testCliDriver_auto_sortmerge_join_11
          org.apache.hadoop.hive.cli.TestCliDriver.testCliDriver_auto_sortmerge_join_2
          org.apache.hadoop.hive.cli.TestCliDriver.testCliDriver_auto_sortmerge_join_3
          org.apache.hadoop.hive.cli.TestCliDriver.testCliDriver_auto_sortmerge_join_5
          org.apache.hadoop.hive.cli.TestCliDriver.testCliDriver_binarysortable_1
          org.apache.hadoop.hive.cli.TestCliDriver.testCliDriver_bucket2
          org.apache.hadoop.hive.cli.TestCliDriver.testCliDriver_bucket3
          org.apache.hadoop.hive.cli.TestCliDriver.testCliDriver_bucket_map_join_1
          org.apache.hadoop.hive.cli.TestCliDriver.testCliDriver_bucket_map_join_2
          org.apache.hadoop.hive.cli.TestCliDriver.testCliDriver_bucketcontext_1
          org.apache.hadoop.hive.cli.TestCliDriver.testCliDriver_bucketcontext_2
          org.apache.hadoop.hive.cli.TestCliDriver.testCliDriver_bucketcontext_3
          org.apache.hadoop.hive.cli.TestCliDriver.testCliDriver_bucketcontext_4
          org.apache.hadoop.hive.cli.TestCliDriver.testCliDriver_bucketcontext_5
          org.apache.hadoop.hive.cli.TestCliDriver.testCliDriver_bucketmapjoin12
          org.apache.hadoop.hive.cli.TestCliDriver.testCliDriver_bucketmapjoin8
          org.apache.hadoop.hive.cli.TestCliDriver.testCliDriver_bucketmapjoin9
          org.apache.hadoop.hive.cli.TestCliDriver.testCliDriver_combine2
          org.apache.hadoop.hive.cli.TestCliDriver.testCliDriver_filter_join_breaktask
          org.apache.hadoop.hive.cli.TestCliDriver.testCliDriver_filter_numeric
          org.apache.hadoop.hive.cli.TestCliDriver.testCliDriver_groupby2_map_skew
          org.apache.hadoop.hive.cli.TestCliDriver.testCliDriver_groupby_sort_1
          org.apache.hadoop.hive.cli.TestCliDriver.testCliDriver_groupby_sort_skew_1
          org.apache.hadoop.hive.cli.TestCliDriver.testCliDriver_infer_bucket_sort_list_bucket
          org.apache.hadoop.hive.cli.TestCliDriver.testCliDriver_input23
          org.apache.hadoop.hive.cli.TestCliDriver.testCliDriver_input39
          org.apache.hadoop.hive.cli.TestCliDriver.testCliDriver_input42
          org.apache.hadoop.hive.cli.TestCliDriver.testCliDriver_input_part7
          org.apache.hadoop.hive.cli.TestCliDriver.testCliDriver_input_part9
          org.apache.hadoop.hive.cli.TestCliDriver.testCliDriver_join_filters_overlap
          org.apache.hadoop.hive.cli.TestCliDriver.testCliDriver_list_bucket_dml_1
          org.apache.hadoop.hive.cli.TestCliDriver.testCliDriver_list_bucket_dml_11
          org.apache.hadoop.hive.cli.TestCliDriver.testCliDriver_list_bucket_dml_12
          org.apache.hadoop.hive.cli.TestCliDriver.testCliDriver_list_bucket_dml_13
          org.apache.hadoop.hive.cli.TestCliDriver.testCliDriver_list_bucket_dml_2
          org.apache.hadoop.hive.cli.TestCliDriver.testCliDriver_list_bucket_dml_3
          org.apache.hadoop.hive.cli.TestCliDriver.testCliDriver_list_bucket_dml_4
          org.apache.hadoop.hive.cli.TestCliDriver.testCliDriver_list_bucket_dml_5
          org.apache.hadoop.hive.cli.TestCliDriver.testCliDriver_list_bucket_dml_6
          org.apache.hadoop.hive.cli.TestCliDriver.testCliDriver_list_bucket_dml_7
          org.apache.hadoop.hive.cli.TestCliDriver.testCliDriver_list_bucket_dml_8
          org.apache.hadoop.hive.cli.TestCliDriver.testCliDriver_list_bucket_dml_9
          org.apache.hadoop.hive.cli.TestCliDriver.testCliDriver_list_bucket_query_multiskew_1
          org.apache.hadoop.hive.cli.TestCliDriver.testCliDriver_list_bucket_query_multiskew_2
          org.apache.hadoop.hive.cli.TestCliDriver.testCliDriver_list_bucket_query_multiskew_3
          org.apache.hadoop.hive.cli.TestCliDriver.testCliDriver_list_bucket_query_oneskew_1
          org.apache.hadoop.hive.cli.TestCliDriver.testCliDriver_list_bucket_query_oneskew_2
          org.apache.hadoop.hive.cli.TestCliDriver.testCliDriver_list_bucket_query_oneskew_3
          org.apache.hadoop.hive.cli.TestCliDriver.testCliDriver_louter_join_ppr
          org.apache.hadoop.hive.cli.TestCliDriver.testCliDriver_mapjoin_test_outer
          org.apache.hadoop.hive.cli.TestCliDriver.testCliDriver_metadataonly1
          org.apache.hadoop.hive.cli.TestCliDriver.testCliDriver_nullformatCTAS
          org.apache.hadoop.hive.cli.TestCliDriver.testCliDriver_nullgroup3
          org.apache.hadoop.hive.cli.TestCliDriver.testCliDriver_orc_createas1
          org.apache.hadoop.hive.cli.TestCliDriver.testCliDriver_outer_join_ppr
          org.apache.hadoop.hive.cli.TestCliDriver.testCliDriver_pcr
          org.apache.hadoop.hive.cli.TestCliDriver.testCliDriver_ppd_join4
          org.apache.hadoop.hive.cli.TestCliDriver.testCliDriver_ppd_join_filter
          org.apache.hadoop.hive.cli.TestCliDriver.testCliDriver_ppd_vc
          org.apache.hadoop.hive.cli.TestCliDriver.testCliDriver_ppr_allchildsarenull
          org.apache.hadoop.hive.cli.TestCliDriver.testCliDriver_push_or
          org.apache.hadoop.hive.cli.TestCliDriver.testCliDriver_rand_partitionpruner1
          org.apache.hadoop.hive.cli.TestCliDriver.testCliDriver_rand_partitionpruner3
          org.apache.hadoop.hive.cli.TestCliDriver.testCliDriver_regexp_extract
          org.apache.hadoop.hive.cli.TestCliDriver.testCliDriver_router_join_ppr
          org.apache.hadoop.hive.cli.TestCliDriver.testCliDriver_sample10
          org.apache.hadoop.hive.cli.TestCliDriver.testCliDriver_sample6
          org.apache.hadoop.hive.cli.TestCliDriver.testCliDriver_sample8
          org.apache.hadoop.hive.cli.TestCliDriver.testCliDriver_sample9
          org.apache.hadoop.hive.cli.TestCliDriver.testCliDriver_select_dummy_source
          org.apache.hadoop.hive.cli.TestCliDriver.testCliDriver_serde_user_properties
          org.apache.hadoop.hive.cli.TestCliDriver.testCliDriver_show_create_table_alter
          org.apache.hadoop.hive.cli.TestCliDriver.testCliDriver_show_create_table_serde
          org.apache.hadoop.hive.cli.TestCliDriver.testCliDriver_show_tblproperties
          org.apache.hadoop.hive.cli.TestCliDriver.testCliDriver_skewjoin_union_remove_1
          org.apache.hadoop.hive.cli.TestCliDriver.testCliDriver_skewjoin_union_remove_2
          org.apache.hadoop.hive.cli.TestCliDriver.testCliDriver_smb_mapjoin_13
          org.apache.hadoop.hive.cli.TestCliDriver.testCliDriver_smb_mapjoin_15
          org.apache.hadoop.hive.cli.TestCliDriver.testCliDriver_sort_merge_join_desc_5
          org.apache.hadoop.hive.cli.TestCliDriver.testCliDriver_sort_merge_join_desc_6
          org.apache.hadoop.hive.cli.TestCliDriver.testCliDriver_stats_list_bucket
          org.apache.hadoop.hive.cli.TestCliDriver.testCliDriver_stats_partscan_1_23
          org.apache.hadoop.hive.cli.TestCliDriver.testCliDriver_symlink_text_input_format
          org.apache.hadoop.hive.cli.TestCliDriver.testCliDriver_transform_ppr1
          org.apache.hadoop.hive.cli.TestCliDriver.testCliDriver_transform_ppr2
          org.apache.hadoop.hive.cli.TestCliDriver.testCliDriver_truncate_column_list_bucket
          org.apache.hadoop.hive.cli.TestCliDriver.testCliDriver_udf_current_database
          org.apache.hadoop.hive.cli.TestCliDriver.testCliDriver_udf_explode
          org.apache.hadoop.hive.cli.TestCliDriver.testCliDriver_udtf_explode
          org.apache.hadoop.hive.cli.TestCliDriver.testCliDriver_union24
          org.apache.hadoop.hive.cli.TestCliDriver.testCliDriver_union_ppr
          org.apache.hadoop.hive.cli.TestCliDriver.testCliDriver_union_remove_1
          org.apache.hadoop.hive.cli.TestCliDriver.testCliDriver_union_remove_10
          org.apache.hadoop.hive.cli.TestCliDriver.testCliDriver_union_remove_12
          org.apache.hadoop.hive.cli.TestCliDriver.testCliDriver_union_remove_13
          org.apache.hadoop.hive.cli.TestCliDriver.testCliDriver_union_remove_14
          org.apache.hadoop.hive.cli.TestCliDriver.testCliDriver_union_remove_19
          org.apache.hadoop.hive.cli.TestCliDriver.testCliDriver_union_remove_2
          org.apache.hadoop.hive.cli.TestCliDriver.testCliDriver_union_remove_20
          org.apache.hadoop.hive.cli.TestCliDriver.testCliDriver_union_remove_21
          org.apache.hadoop.hive.cli.TestCliDriver.testCliDriver_union_remove_22
          org.apache.hadoop.hive.cli.TestCliDriver.testCliDriver_union_remove_23
          org.apache.hadoop.hive.cli.TestCliDriver.testCliDriver_union_remove_24
          org.apache.hadoop.hive.cli.TestCliDriver.testCliDriver_union_remove_4
          org.apache.hadoop.hive.cli.TestCliDriver.testCliDriver_union_remove_5
          org.apache.hadoop.hive.cli.TestCliDriver.testCliDriver_union_remove_7
          org.apache.hadoop.hive.cli.TestCliDriver.testCliDriver_union_remove_8
          org.apache.hadoop.hive.cli.TestCliDriver.testCliDriver_union_remove_9
          org.apache.hadoop.hive.cli.TestCliDriver.testCliDriver_unset_table_view_property
          org.apache.hadoop.hive.cli.TestMinimrCliDriver.testCliDriver_bucket4
          org.apache.hadoop.hive.cli.TestMinimrCliDriver.testCliDriver_bucketizedhiveinputformat
          org.apache.hadoop.hive.cli.TestMinimrCliDriver.testCliDriver_bucketmapjoin7
          org.apache.hadoop.hive.cli.TestMinimrCliDriver.testCliDriver_disable_merge_for_bucketing
          org.apache.hadoop.hive.cli.TestMinimrCliDriver.testCliDriver_root_dir_external_table
          org.apache.hadoop.hive.cli.TestNegativeCliDriver.testNegativeCliDriver_authorization_part
          org.apache.hadoop.hive.cli.TestNegativeCliDriver.testNegativeCliDriver_dynamic_partitions_with_whitelist
          org.apache.hadoop.hive.cli.TestNegativeCliDriver.testNegativeCliDriver_stats_partialscan_autogether
          org.apache.hadoop.hive.cli.TestNegativeCliDriver.testNegativeCliDriver_unset_table_property
          

          Test results: http://ec2-174-129-184-35.compute-1.amazonaws.com/jenkins/job/PreCommit-HIVE-Build/45/testReport
          Console output: http://ec2-174-129-184-35.compute-1.amazonaws.com/jenkins/job/PreCommit-HIVE-Build/45/console

          Messages:

          Executing org.apache.hive.ptest.execution.PrepPhase
          Executing org.apache.hive.ptest.execution.ExecutionPhase
          Executing org.apache.hive.ptest.execution.ReportingPhase
          Tests exited with: TestsFailedException: 123 tests failed
          

          This message is automatically generated.

          ATTACHMENT ID: 12641980

          Show
          Hive QA added a comment - Overall : -1 at least one tests failed Here are the results of testing the latest attachment: https://issues.apache.org/jira/secure/attachment/12641980/HIVE-6901.3.patch ERROR: -1 due to 123 failed/errored test(s), 5418 tests executed Failed tests: org.apache.hadoop.hive.cli.TestCliDriver.testCliDriver_alter_partition_coltype org.apache.hadoop.hive.cli.TestCliDriver.testCliDriver_annotate_stats_filter org.apache.hadoop.hive.cli.TestCliDriver.testCliDriver_annotate_stats_part org.apache.hadoop.hive.cli.TestCliDriver.testCliDriver_annotate_stats_union org.apache.hadoop.hive.cli.TestCliDriver.testCliDriver_auto_join32 org.apache.hadoop.hive.cli.TestCliDriver.testCliDriver_auto_sortmerge_join_11 org.apache.hadoop.hive.cli.TestCliDriver.testCliDriver_auto_sortmerge_join_2 org.apache.hadoop.hive.cli.TestCliDriver.testCliDriver_auto_sortmerge_join_3 org.apache.hadoop.hive.cli.TestCliDriver.testCliDriver_auto_sortmerge_join_5 org.apache.hadoop.hive.cli.TestCliDriver.testCliDriver_binarysortable_1 org.apache.hadoop.hive.cli.TestCliDriver.testCliDriver_bucket2 org.apache.hadoop.hive.cli.TestCliDriver.testCliDriver_bucket3 org.apache.hadoop.hive.cli.TestCliDriver.testCliDriver_bucket_map_join_1 org.apache.hadoop.hive.cli.TestCliDriver.testCliDriver_bucket_map_join_2 org.apache.hadoop.hive.cli.TestCliDriver.testCliDriver_bucketcontext_1 org.apache.hadoop.hive.cli.TestCliDriver.testCliDriver_bucketcontext_2 org.apache.hadoop.hive.cli.TestCliDriver.testCliDriver_bucketcontext_3 org.apache.hadoop.hive.cli.TestCliDriver.testCliDriver_bucketcontext_4 org.apache.hadoop.hive.cli.TestCliDriver.testCliDriver_bucketcontext_5 org.apache.hadoop.hive.cli.TestCliDriver.testCliDriver_bucketmapjoin12 org.apache.hadoop.hive.cli.TestCliDriver.testCliDriver_bucketmapjoin8 org.apache.hadoop.hive.cli.TestCliDriver.testCliDriver_bucketmapjoin9 org.apache.hadoop.hive.cli.TestCliDriver.testCliDriver_combine2 org.apache.hadoop.hive.cli.TestCliDriver.testCliDriver_filter_join_breaktask org.apache.hadoop.hive.cli.TestCliDriver.testCliDriver_filter_numeric org.apache.hadoop.hive.cli.TestCliDriver.testCliDriver_groupby2_map_skew org.apache.hadoop.hive.cli.TestCliDriver.testCliDriver_groupby_sort_1 org.apache.hadoop.hive.cli.TestCliDriver.testCliDriver_groupby_sort_skew_1 org.apache.hadoop.hive.cli.TestCliDriver.testCliDriver_infer_bucket_sort_list_bucket org.apache.hadoop.hive.cli.TestCliDriver.testCliDriver_input23 org.apache.hadoop.hive.cli.TestCliDriver.testCliDriver_input39 org.apache.hadoop.hive.cli.TestCliDriver.testCliDriver_input42 org.apache.hadoop.hive.cli.TestCliDriver.testCliDriver_input_part7 org.apache.hadoop.hive.cli.TestCliDriver.testCliDriver_input_part9 org.apache.hadoop.hive.cli.TestCliDriver.testCliDriver_join_filters_overlap org.apache.hadoop.hive.cli.TestCliDriver.testCliDriver_list_bucket_dml_1 org.apache.hadoop.hive.cli.TestCliDriver.testCliDriver_list_bucket_dml_11 org.apache.hadoop.hive.cli.TestCliDriver.testCliDriver_list_bucket_dml_12 org.apache.hadoop.hive.cli.TestCliDriver.testCliDriver_list_bucket_dml_13 org.apache.hadoop.hive.cli.TestCliDriver.testCliDriver_list_bucket_dml_2 org.apache.hadoop.hive.cli.TestCliDriver.testCliDriver_list_bucket_dml_3 org.apache.hadoop.hive.cli.TestCliDriver.testCliDriver_list_bucket_dml_4 org.apache.hadoop.hive.cli.TestCliDriver.testCliDriver_list_bucket_dml_5 org.apache.hadoop.hive.cli.TestCliDriver.testCliDriver_list_bucket_dml_6 org.apache.hadoop.hive.cli.TestCliDriver.testCliDriver_list_bucket_dml_7 org.apache.hadoop.hive.cli.TestCliDriver.testCliDriver_list_bucket_dml_8 org.apache.hadoop.hive.cli.TestCliDriver.testCliDriver_list_bucket_dml_9 org.apache.hadoop.hive.cli.TestCliDriver.testCliDriver_list_bucket_query_multiskew_1 org.apache.hadoop.hive.cli.TestCliDriver.testCliDriver_list_bucket_query_multiskew_2 org.apache.hadoop.hive.cli.TestCliDriver.testCliDriver_list_bucket_query_multiskew_3 org.apache.hadoop.hive.cli.TestCliDriver.testCliDriver_list_bucket_query_oneskew_1 org.apache.hadoop.hive.cli.TestCliDriver.testCliDriver_list_bucket_query_oneskew_2 org.apache.hadoop.hive.cli.TestCliDriver.testCliDriver_list_bucket_query_oneskew_3 org.apache.hadoop.hive.cli.TestCliDriver.testCliDriver_louter_join_ppr org.apache.hadoop.hive.cli.TestCliDriver.testCliDriver_mapjoin_test_outer org.apache.hadoop.hive.cli.TestCliDriver.testCliDriver_metadataonly1 org.apache.hadoop.hive.cli.TestCliDriver.testCliDriver_nullformatCTAS org.apache.hadoop.hive.cli.TestCliDriver.testCliDriver_nullgroup3 org.apache.hadoop.hive.cli.TestCliDriver.testCliDriver_orc_createas1 org.apache.hadoop.hive.cli.TestCliDriver.testCliDriver_outer_join_ppr org.apache.hadoop.hive.cli.TestCliDriver.testCliDriver_pcr org.apache.hadoop.hive.cli.TestCliDriver.testCliDriver_ppd_join4 org.apache.hadoop.hive.cli.TestCliDriver.testCliDriver_ppd_join_filter org.apache.hadoop.hive.cli.TestCliDriver.testCliDriver_ppd_vc org.apache.hadoop.hive.cli.TestCliDriver.testCliDriver_ppr_allchildsarenull org.apache.hadoop.hive.cli.TestCliDriver.testCliDriver_push_or org.apache.hadoop.hive.cli.TestCliDriver.testCliDriver_rand_partitionpruner1 org.apache.hadoop.hive.cli.TestCliDriver.testCliDriver_rand_partitionpruner3 org.apache.hadoop.hive.cli.TestCliDriver.testCliDriver_regexp_extract org.apache.hadoop.hive.cli.TestCliDriver.testCliDriver_router_join_ppr org.apache.hadoop.hive.cli.TestCliDriver.testCliDriver_sample10 org.apache.hadoop.hive.cli.TestCliDriver.testCliDriver_sample6 org.apache.hadoop.hive.cli.TestCliDriver.testCliDriver_sample8 org.apache.hadoop.hive.cli.TestCliDriver.testCliDriver_sample9 org.apache.hadoop.hive.cli.TestCliDriver.testCliDriver_select_dummy_source org.apache.hadoop.hive.cli.TestCliDriver.testCliDriver_serde_user_properties org.apache.hadoop.hive.cli.TestCliDriver.testCliDriver_show_create_table_alter org.apache.hadoop.hive.cli.TestCliDriver.testCliDriver_show_create_table_serde org.apache.hadoop.hive.cli.TestCliDriver.testCliDriver_show_tblproperties org.apache.hadoop.hive.cli.TestCliDriver.testCliDriver_skewjoin_union_remove_1 org.apache.hadoop.hive.cli.TestCliDriver.testCliDriver_skewjoin_union_remove_2 org.apache.hadoop.hive.cli.TestCliDriver.testCliDriver_smb_mapjoin_13 org.apache.hadoop.hive.cli.TestCliDriver.testCliDriver_smb_mapjoin_15 org.apache.hadoop.hive.cli.TestCliDriver.testCliDriver_sort_merge_join_desc_5 org.apache.hadoop.hive.cli.TestCliDriver.testCliDriver_sort_merge_join_desc_6 org.apache.hadoop.hive.cli.TestCliDriver.testCliDriver_stats_list_bucket org.apache.hadoop.hive.cli.TestCliDriver.testCliDriver_stats_partscan_1_23 org.apache.hadoop.hive.cli.TestCliDriver.testCliDriver_symlink_text_input_format org.apache.hadoop.hive.cli.TestCliDriver.testCliDriver_transform_ppr1 org.apache.hadoop.hive.cli.TestCliDriver.testCliDriver_transform_ppr2 org.apache.hadoop.hive.cli.TestCliDriver.testCliDriver_truncate_column_list_bucket org.apache.hadoop.hive.cli.TestCliDriver.testCliDriver_udf_current_database org.apache.hadoop.hive.cli.TestCliDriver.testCliDriver_udf_explode org.apache.hadoop.hive.cli.TestCliDriver.testCliDriver_udtf_explode org.apache.hadoop.hive.cli.TestCliDriver.testCliDriver_union24 org.apache.hadoop.hive.cli.TestCliDriver.testCliDriver_union_ppr org.apache.hadoop.hive.cli.TestCliDriver.testCliDriver_union_remove_1 org.apache.hadoop.hive.cli.TestCliDriver.testCliDriver_union_remove_10 org.apache.hadoop.hive.cli.TestCliDriver.testCliDriver_union_remove_12 org.apache.hadoop.hive.cli.TestCliDriver.testCliDriver_union_remove_13 org.apache.hadoop.hive.cli.TestCliDriver.testCliDriver_union_remove_14 org.apache.hadoop.hive.cli.TestCliDriver.testCliDriver_union_remove_19 org.apache.hadoop.hive.cli.TestCliDriver.testCliDriver_union_remove_2 org.apache.hadoop.hive.cli.TestCliDriver.testCliDriver_union_remove_20 org.apache.hadoop.hive.cli.TestCliDriver.testCliDriver_union_remove_21 org.apache.hadoop.hive.cli.TestCliDriver.testCliDriver_union_remove_22 org.apache.hadoop.hive.cli.TestCliDriver.testCliDriver_union_remove_23 org.apache.hadoop.hive.cli.TestCliDriver.testCliDriver_union_remove_24 org.apache.hadoop.hive.cli.TestCliDriver.testCliDriver_union_remove_4 org.apache.hadoop.hive.cli.TestCliDriver.testCliDriver_union_remove_5 org.apache.hadoop.hive.cli.TestCliDriver.testCliDriver_union_remove_7 org.apache.hadoop.hive.cli.TestCliDriver.testCliDriver_union_remove_8 org.apache.hadoop.hive.cli.TestCliDriver.testCliDriver_union_remove_9 org.apache.hadoop.hive.cli.TestCliDriver.testCliDriver_unset_table_view_property org.apache.hadoop.hive.cli.TestMinimrCliDriver.testCliDriver_bucket4 org.apache.hadoop.hive.cli.TestMinimrCliDriver.testCliDriver_bucketizedhiveinputformat org.apache.hadoop.hive.cli.TestMinimrCliDriver.testCliDriver_bucketmapjoin7 org.apache.hadoop.hive.cli.TestMinimrCliDriver.testCliDriver_disable_merge_for_bucketing org.apache.hadoop.hive.cli.TestMinimrCliDriver.testCliDriver_root_dir_external_table org.apache.hadoop.hive.cli.TestNegativeCliDriver.testNegativeCliDriver_authorization_part org.apache.hadoop.hive.cli.TestNegativeCliDriver.testNegativeCliDriver_dynamic_partitions_with_whitelist org.apache.hadoop.hive.cli.TestNegativeCliDriver.testNegativeCliDriver_stats_partialscan_autogether org.apache.hadoop.hive.cli.TestNegativeCliDriver.testNegativeCliDriver_unset_table_property Test results: http://ec2-174-129-184-35.compute-1.amazonaws.com/jenkins/job/PreCommit-HIVE-Build/45/testReport Console output: http://ec2-174-129-184-35.compute-1.amazonaws.com/jenkins/job/PreCommit-HIVE-Build/45/console Messages: Executing org.apache.hive.ptest.execution.PrepPhase Executing org.apache.hive.ptest.execution.ExecutionPhase Executing org.apache.hive.ptest.execution.ReportingPhase Tests exited with: TestsFailedException: 123 tests failed This message is automatically generated. ATTACHMENT ID: 12641980
          Xuefu Zhang made changes -
          Attachment HIVE-6901.2.patch [ 12641974 ]
          Xuefu Zhang made changes -
          Attachment HIVE-6901.2.patch [ 12640920 ]
          Xuefu Zhang made changes -
          Attachment HIVE-6901.2.patch [ 12641106 ]
          Xuefu Zhang made changes -
          Attachment HIVE-6901.2.patch [ 12641390 ]
          Xuefu Zhang made changes -
          Attachment HIVE-6901.3.patch [ 12641980 ]
          Hide
          Hive QA added a comment -

          Overall: -1 no tests executed

          Here are the results of testing the latest attachment:
          https://issues.apache.org/jira/secure/attachment/12641974/HIVE-6901.2.patch

          Test results: http://ec2-174-129-184-35.compute-1.amazonaws.com/jenkins/job/PreCommit-HIVE-Build/42/testReport
          Console output: http://ec2-174-129-184-35.compute-1.amazonaws.com/jenkins/job/PreCommit-HIVE-Build/42/console

          Messages:

          Executing org.apache.hive.ptest.execution.PrepPhase
          Tests exited with: NonZeroExitCodeException
          Command 'bash /data/hive-ptest/working/scratch/source-prep.sh' failed with exit status 1 and output '+ [[ -n '' ]]
          + export 'ANT_OPTS=-Xmx1g -XX:MaxPermSize=256m '
          + ANT_OPTS='-Xmx1g -XX:MaxPermSize=256m '
          + export 'M2_OPTS=-Xmx1g -XX:MaxPermSize=256m -Dhttp.proxyHost=localhost -Dhttp.proxyPort=3128'
          + M2_OPTS='-Xmx1g -XX:MaxPermSize=256m -Dhttp.proxyHost=localhost -Dhttp.proxyPort=3128'
          + cd /data/hive-ptest/working/
          + tee /data/hive-ptest/logs/PreCommit-HIVE-Build-42/source-prep.txt
          + [[ false == \t\r\u\e ]]
          + mkdir -p maven ivy
          + [[ svn = \s\v\n ]]
          + [[ -n '' ]]
          + [[ -d apache-svn-trunk-source ]]
          + [[ ! -d apache-svn-trunk-source/.svn ]]
          + [[ ! -d apache-svn-trunk-source ]]
          + cd apache-svn-trunk-source
          + svn revert -R .
          ++ egrep -v '^X|^Performing status on external'
          ++ awk '{print $2}'
          ++ svn status --no-ignore
          + rm -rf
          + svn update
          
          Fetching external item into 'hcatalog/src/test/e2e/harness'
          External at revision 1590092.
          
          At revision 1590092.
          + patchCommandPath=/data/hive-ptest/working/scratch/smart-apply-patch.sh
          + patchFilePath=/data/hive-ptest/working/scratch/build.patch
          + [[ -f /data/hive-ptest/working/scratch/build.patch ]]
          + chmod +x /data/hive-ptest/working/scratch/smart-apply-patch.sh
          + /data/hive-ptest/working/scratch/smart-apply-patch.sh /data/hive-ptest/working/scratch/build.patch
          The patch does not appear to apply with p0, p1, or p2
          + exit 1
          '
          

          This message is automatically generated.

          ATTACHMENT ID: 12641974

          Show
          Hive QA added a comment - Overall : -1 no tests executed Here are the results of testing the latest attachment: https://issues.apache.org/jira/secure/attachment/12641974/HIVE-6901.2.patch Test results: http://ec2-174-129-184-35.compute-1.amazonaws.com/jenkins/job/PreCommit-HIVE-Build/42/testReport Console output: http://ec2-174-129-184-35.compute-1.amazonaws.com/jenkins/job/PreCommit-HIVE-Build/42/console Messages: Executing org.apache.hive.ptest.execution.PrepPhase Tests exited with: NonZeroExitCodeException Command 'bash /data/hive-ptest/working/scratch/source-prep.sh' failed with exit status 1 and output '+ [[ -n '' ]] + export 'ANT_OPTS=-Xmx1g -XX:MaxPermSize=256m ' + ANT_OPTS='-Xmx1g -XX:MaxPermSize=256m ' + export 'M2_OPTS=-Xmx1g -XX:MaxPermSize=256m -Dhttp.proxyHost=localhost -Dhttp.proxyPort=3128' + M2_OPTS='-Xmx1g -XX:MaxPermSize=256m -Dhttp.proxyHost=localhost -Dhttp.proxyPort=3128' + cd /data/hive-ptest/working/ + tee /data/hive-ptest/logs/PreCommit-HIVE-Build-42/source-prep.txt + [[ false == \t\r\u\e ]] + mkdir -p maven ivy + [[ svn = \s\v\n ]] + [[ -n '' ]] + [[ -d apache-svn-trunk-source ]] + [[ ! -d apache-svn-trunk-source/.svn ]] + [[ ! -d apache-svn-trunk-source ]] + cd apache-svn-trunk-source + svn revert -R . ++ egrep -v '^X|^Performing status on external' ++ awk '{print $2}' ++ svn status --no-ignore + rm -rf + svn update Fetching external item into 'hcatalog/src/test/e2e/harness' External at revision 1590092. At revision 1590092. + patchCommandPath=/data/hive-ptest/working/scratch/smart-apply-patch.sh + patchFilePath=/data/hive-ptest/working/scratch/build.patch + [[ -f /data/hive-ptest/working/scratch/build.patch ]] + chmod +x /data/hive-ptest/working/scratch/smart-apply-patch.sh + /data/hive-ptest/working/scratch/smart-apply-patch.sh /data/hive-ptest/working/scratch/build.patch The patch does not appear to apply with p0, p1, or p2 + exit 1 ' This message is automatically generated. ATTACHMENT ID: 12641974
          Xuefu Zhang made changes -
          Attachment HIVE-6901.2.patch [ 12641974 ]
          Hide
          Hive QA added a comment -

          Overall: -1 no tests executed

          Here are the results of testing the latest attachment:
          https://issues.apache.org/jira/secure/attachment/12641390/HIVE-6901.2.patch

          Test results: http://ec2-174-129-184-35.compute-1.amazonaws.com/jenkins/job/PreCommit-HIVE-Build/21/testReport
          Console output: http://ec2-174-129-184-35.compute-1.amazonaws.com/jenkins/job/PreCommit-HIVE-Build/21/console

          Messages:

          Executing org.apache.hive.ptest.execution.PrepPhase
          Tests exited with: NonZeroExitCodeException
          Command 'bash /data/hive-ptest/working/scratch/source-prep.sh' failed with exit status 1 and output '+ [[ -n '' ]]
          + export 'ANT_OPTS=-Xmx1g -XX:MaxPermSize=256m '
          + ANT_OPTS='-Xmx1g -XX:MaxPermSize=256m '
          + export 'M2_OPTS=-Xmx1g -XX:MaxPermSize=256m -Dhttp.proxyHost=localhost -Dhttp.proxyPort=3128'
          + M2_OPTS='-Xmx1g -XX:MaxPermSize=256m -Dhttp.proxyHost=localhost -Dhttp.proxyPort=3128'
          + cd /data/hive-ptest/working/
          + tee /data/hive-ptest/logs/PreCommit-HIVE-Build-21/source-prep.txt
          + [[ false == \t\r\u\e ]]
          + mkdir -p maven ivy
          + [[ svn = \s\v\n ]]
          + [[ -n '' ]]
          + [[ -d apache-svn-trunk-source ]]
          + [[ ! -d apache-svn-trunk-source/.svn ]]
          + [[ ! -d apache-svn-trunk-source ]]
          + cd apache-svn-trunk-source
          + svn revert -R .
          Reverted 'common/src/java/org/apache/hadoop/hive/conf/HiveConf.java'
          Reverted 'ql/src/java/org/apache/hadoop/hive/ql/exec/mr/MapredLocalTask.java'
          ++ egrep -v '^X|^Performing status on external'
          ++ awk '{print $2}'
          ++ svn status --no-ignore
          + rm -rf target datanucleus.log ant/target shims/target shims/0.20/target shims/0.20S/target shims/0.23/target shims/aggregator/target shims/common/target shims/common-secure/target packaging/target hbase-handler/target testutils/target jdbc/target metastore/target itests/target itests/hcatalog-unit/target itests/test-serde/target itests/qtest/target itests/hive-minikdc/target itests/hive-unit/target itests/custom-serde/target itests/util/target hcatalog/target hcatalog/core/target hcatalog/streaming/target hcatalog/server-extensions/target hcatalog/webhcat/svr/target hcatalog/webhcat/java-client/target hcatalog/hcatalog-pig-adapter/target hwi/target common/target common/src/gen contrib/target service/target serde/target beeline/target odbc/target cli/target ql/dependency-reduced-pom.xml ql/target
          + svn update
          U    ql/src/test/results/clientpositive/drop_partitions_filter2.q.out
          U    ql/src/test/org/apache/hadoop/hive/ql/udf/TestGenericUDFUtils.java
          U    ql/src/test/queries/clientpositive/drop_partitions_filter2.q
          U    ql/src/java/org/apache/hadoop/hive/ql/udf/generic/GenericUDAFMkCollectionEvaluator.java
          U    ql/src/java/org/apache/hadoop/hive/ql/udf/generic/GenericUDFUtils.java
          U    ql/src/java/org/apache/hadoop/hive/ql/parse/DDLSemanticAnalyzer.java
          
          Fetching external item into 'hcatalog/src/test/e2e/harness'
          Updated external to revision 1589561.
          
          Updated to revision 1589561.
          + patchCommandPath=/data/hive-ptest/working/scratch/smart-apply-patch.sh
          + patchFilePath=/data/hive-ptest/working/scratch/build.patch
          + [[ -f /data/hive-ptest/working/scratch/build.patch ]]
          + chmod +x /data/hive-ptest/working/scratch/smart-apply-patch.sh
          + /data/hive-ptest/working/scratch/smart-apply-patch.sh /data/hive-ptest/working/scratch/build.patch
          The patch does not appear to apply with p0, p1, or p2
          + exit 1
          '
          

          This message is automatically generated.

          ATTACHMENT ID: 12641390

          Show
          Hive QA added a comment - Overall : -1 no tests executed Here are the results of testing the latest attachment: https://issues.apache.org/jira/secure/attachment/12641390/HIVE-6901.2.patch Test results: http://ec2-174-129-184-35.compute-1.amazonaws.com/jenkins/job/PreCommit-HIVE-Build/21/testReport Console output: http://ec2-174-129-184-35.compute-1.amazonaws.com/jenkins/job/PreCommit-HIVE-Build/21/console Messages: Executing org.apache.hive.ptest.execution.PrepPhase Tests exited with: NonZeroExitCodeException Command 'bash /data/hive-ptest/working/scratch/source-prep.sh' failed with exit status 1 and output '+ [[ -n '' ]] + export 'ANT_OPTS=-Xmx1g -XX:MaxPermSize=256m ' + ANT_OPTS='-Xmx1g -XX:MaxPermSize=256m ' + export 'M2_OPTS=-Xmx1g -XX:MaxPermSize=256m -Dhttp.proxyHost=localhost -Dhttp.proxyPort=3128' + M2_OPTS='-Xmx1g -XX:MaxPermSize=256m -Dhttp.proxyHost=localhost -Dhttp.proxyPort=3128' + cd /data/hive-ptest/working/ + tee /data/hive-ptest/logs/PreCommit-HIVE-Build-21/source-prep.txt + [[ false == \t\r\u\e ]] + mkdir -p maven ivy + [[ svn = \s\v\n ]] + [[ -n '' ]] + [[ -d apache-svn-trunk-source ]] + [[ ! -d apache-svn-trunk-source/.svn ]] + [[ ! -d apache-svn-trunk-source ]] + cd apache-svn-trunk-source + svn revert -R . Reverted 'common/src/java/org/apache/hadoop/hive/conf/HiveConf.java' Reverted 'ql/src/java/org/apache/hadoop/hive/ql/exec/mr/MapredLocalTask.java' ++ egrep -v '^X|^Performing status on external' ++ awk '{print $2}' ++ svn status --no-ignore + rm -rf target datanucleus.log ant/target shims/target shims/0.20/target shims/0.20S/target shims/0.23/target shims/aggregator/target shims/common/target shims/common-secure/target packaging/target hbase-handler/target testutils/target jdbc/target metastore/target itests/target itests/hcatalog-unit/target itests/test-serde/target itests/qtest/target itests/hive-minikdc/target itests/hive-unit/target itests/custom-serde/target itests/util/target hcatalog/target hcatalog/core/target hcatalog/streaming/target hcatalog/server-extensions/target hcatalog/webhcat/svr/target hcatalog/webhcat/java-client/target hcatalog/hcatalog-pig-adapter/target hwi/target common/target common/src/gen contrib/target service/target serde/target beeline/target odbc/target cli/target ql/dependency-reduced-pom.xml ql/target + svn update U ql/src/test/results/clientpositive/drop_partitions_filter2.q.out U ql/src/test/org/apache/hadoop/hive/ql/udf/TestGenericUDFUtils.java U ql/src/test/queries/clientpositive/drop_partitions_filter2.q U ql/src/java/org/apache/hadoop/hive/ql/udf/generic/GenericUDAFMkCollectionEvaluator.java U ql/src/java/org/apache/hadoop/hive/ql/udf/generic/GenericUDFUtils.java U ql/src/java/org/apache/hadoop/hive/ql/parse/DDLSemanticAnalyzer.java Fetching external item into 'hcatalog/src/test/e2e/harness' Updated external to revision 1589561. Updated to revision 1589561. + patchCommandPath=/data/hive-ptest/working/scratch/smart-apply-patch.sh + patchFilePath=/data/hive-ptest/working/scratch/build.patch + [[ -f /data/hive-ptest/working/scratch/build.patch ]] + chmod +x /data/hive-ptest/working/scratch/smart-apply-patch.sh + /data/hive-ptest/working/scratch/smart-apply-patch.sh /data/hive-ptest/working/scratch/build.patch The patch does not appear to apply with p0, p1, or p2 + exit 1 ' This message is automatically generated. ATTACHMENT ID: 12641390
          Xuefu Zhang made changes -
          Attachment HIVE-6901.2.patch [ 12641390 ]
          Hide
          Hive QA added a comment -

          Overall: -1 at least one tests failed

          Here are the results of testing the latest attachment:
          https://issues.apache.org/jira/secure/attachment/12641113/HIVE-6901.2.patch

          ERROR: -1 due to 122 failed/errored test(s), 5416 tests executed
          Failed tests:

          org.apache.hadoop.hive.cli.TestCliDriver.testCliDriver_annotate_stats_filter
          org.apache.hadoop.hive.cli.TestCliDriver.testCliDriver_annotate_stats_part
          org.apache.hadoop.hive.cli.TestCliDriver.testCliDriver_annotate_stats_union
          org.apache.hadoop.hive.cli.TestCliDriver.testCliDriver_auto_join32
          org.apache.hadoop.hive.cli.TestCliDriver.testCliDriver_auto_sortmerge_join_11
          org.apache.hadoop.hive.cli.TestCliDriver.testCliDriver_auto_sortmerge_join_2
          org.apache.hadoop.hive.cli.TestCliDriver.testCliDriver_auto_sortmerge_join_3
          org.apache.hadoop.hive.cli.TestCliDriver.testCliDriver_auto_sortmerge_join_5
          org.apache.hadoop.hive.cli.TestCliDriver.testCliDriver_binarysortable_1
          org.apache.hadoop.hive.cli.TestCliDriver.testCliDriver_bucket2
          org.apache.hadoop.hive.cli.TestCliDriver.testCliDriver_bucket3
          org.apache.hadoop.hive.cli.TestCliDriver.testCliDriver_bucket_map_join_1
          org.apache.hadoop.hive.cli.TestCliDriver.testCliDriver_bucket_map_join_2
          org.apache.hadoop.hive.cli.TestCliDriver.testCliDriver_bucketcontext_1
          org.apache.hadoop.hive.cli.TestCliDriver.testCliDriver_bucketcontext_2
          org.apache.hadoop.hive.cli.TestCliDriver.testCliDriver_bucketcontext_3
          org.apache.hadoop.hive.cli.TestCliDriver.testCliDriver_bucketcontext_4
          org.apache.hadoop.hive.cli.TestCliDriver.testCliDriver_bucketcontext_5
          org.apache.hadoop.hive.cli.TestCliDriver.testCliDriver_bucketmapjoin12
          org.apache.hadoop.hive.cli.TestCliDriver.testCliDriver_bucketmapjoin8
          org.apache.hadoop.hive.cli.TestCliDriver.testCliDriver_bucketmapjoin9
          org.apache.hadoop.hive.cli.TestCliDriver.testCliDriver_combine2
          org.apache.hadoop.hive.cli.TestCliDriver.testCliDriver_filter_join_breaktask
          org.apache.hadoop.hive.cli.TestCliDriver.testCliDriver_filter_numeric
          org.apache.hadoop.hive.cli.TestCliDriver.testCliDriver_groupby2_map_skew
          org.apache.hadoop.hive.cli.TestCliDriver.testCliDriver_groupby_sort_1
          org.apache.hadoop.hive.cli.TestCliDriver.testCliDriver_groupby_sort_skew_1
          org.apache.hadoop.hive.cli.TestCliDriver.testCliDriver_infer_bucket_sort_list_bucket
          org.apache.hadoop.hive.cli.TestCliDriver.testCliDriver_input23
          org.apache.hadoop.hive.cli.TestCliDriver.testCliDriver_input39
          org.apache.hadoop.hive.cli.TestCliDriver.testCliDriver_input42
          org.apache.hadoop.hive.cli.TestCliDriver.testCliDriver_input_part7
          org.apache.hadoop.hive.cli.TestCliDriver.testCliDriver_input_part9
          org.apache.hadoop.hive.cli.TestCliDriver.testCliDriver_join_filters_overlap
          org.apache.hadoop.hive.cli.TestCliDriver.testCliDriver_list_bucket_dml_1
          org.apache.hadoop.hive.cli.TestCliDriver.testCliDriver_list_bucket_dml_11
          org.apache.hadoop.hive.cli.TestCliDriver.testCliDriver_list_bucket_dml_12
          org.apache.hadoop.hive.cli.TestCliDriver.testCliDriver_list_bucket_dml_13
          org.apache.hadoop.hive.cli.TestCliDriver.testCliDriver_list_bucket_dml_2
          org.apache.hadoop.hive.cli.TestCliDriver.testCliDriver_list_bucket_dml_3
          org.apache.hadoop.hive.cli.TestCliDriver.testCliDriver_list_bucket_dml_4
          org.apache.hadoop.hive.cli.TestCliDriver.testCliDriver_list_bucket_dml_5
          org.apache.hadoop.hive.cli.TestCliDriver.testCliDriver_list_bucket_dml_6
          org.apache.hadoop.hive.cli.TestCliDriver.testCliDriver_list_bucket_dml_7
          org.apache.hadoop.hive.cli.TestCliDriver.testCliDriver_list_bucket_dml_8
          org.apache.hadoop.hive.cli.TestCliDriver.testCliDriver_list_bucket_dml_9
          org.apache.hadoop.hive.cli.TestCliDriver.testCliDriver_list_bucket_query_multiskew_1
          org.apache.hadoop.hive.cli.TestCliDriver.testCliDriver_list_bucket_query_multiskew_2
          org.apache.hadoop.hive.cli.TestCliDriver.testCliDriver_list_bucket_query_multiskew_3
          org.apache.hadoop.hive.cli.TestCliDriver.testCliDriver_list_bucket_query_oneskew_1
          org.apache.hadoop.hive.cli.TestCliDriver.testCliDriver_list_bucket_query_oneskew_2
          org.apache.hadoop.hive.cli.TestCliDriver.testCliDriver_list_bucket_query_oneskew_3
          org.apache.hadoop.hive.cli.TestCliDriver.testCliDriver_louter_join_ppr
          org.apache.hadoop.hive.cli.TestCliDriver.testCliDriver_mapjoin_test_outer
          org.apache.hadoop.hive.cli.TestCliDriver.testCliDriver_metadataonly1
          org.apache.hadoop.hive.cli.TestCliDriver.testCliDriver_nullformatCTAS
          org.apache.hadoop.hive.cli.TestCliDriver.testCliDriver_nullgroup3
          org.apache.hadoop.hive.cli.TestCliDriver.testCliDriver_orc_createas1
          org.apache.hadoop.hive.cli.TestCliDriver.testCliDriver_outer_join_ppr
          org.apache.hadoop.hive.cli.TestCliDriver.testCliDriver_pcr
          org.apache.hadoop.hive.cli.TestCliDriver.testCliDriver_ppd_join4
          org.apache.hadoop.hive.cli.TestCliDriver.testCliDriver_ppd_join_filter
          org.apache.hadoop.hive.cli.TestCliDriver.testCliDriver_ppd_vc
          org.apache.hadoop.hive.cli.TestCliDriver.testCliDriver_ppr_allchildsarenull
          org.apache.hadoop.hive.cli.TestCliDriver.testCliDriver_push_or
          org.apache.hadoop.hive.cli.TestCliDriver.testCliDriver_rand_partitionpruner1
          org.apache.hadoop.hive.cli.TestCliDriver.testCliDriver_rand_partitionpruner3
          org.apache.hadoop.hive.cli.TestCliDriver.testCliDriver_regexp_extract
          org.apache.hadoop.hive.cli.TestCliDriver.testCliDriver_router_join_ppr
          org.apache.hadoop.hive.cli.TestCliDriver.testCliDriver_sample10
          org.apache.hadoop.hive.cli.TestCliDriver.testCliDriver_sample6
          org.apache.hadoop.hive.cli.TestCliDriver.testCliDriver_sample8
          org.apache.hadoop.hive.cli.TestCliDriver.testCliDriver_sample9
          org.apache.hadoop.hive.cli.TestCliDriver.testCliDriver_select_dummy_source
          org.apache.hadoop.hive.cli.TestCliDriver.testCliDriver_serde_user_properties
          org.apache.hadoop.hive.cli.TestCliDriver.testCliDriver_show_create_table_alter
          org.apache.hadoop.hive.cli.TestCliDriver.testCliDriver_show_create_table_serde
          org.apache.hadoop.hive.cli.TestCliDriver.testCliDriver_skewjoin_union_remove_1
          org.apache.hadoop.hive.cli.TestCliDriver.testCliDriver_skewjoin_union_remove_2
          org.apache.hadoop.hive.cli.TestCliDriver.testCliDriver_smb_mapjoin_13
          org.apache.hadoop.hive.cli.TestCliDriver.testCliDriver_smb_mapjoin_15
          org.apache.hadoop.hive.cli.TestCliDriver.testCliDriver_sort_merge_join_desc_5
          org.apache.hadoop.hive.cli.TestCliDriver.testCliDriver_sort_merge_join_desc_6
          org.apache.hadoop.hive.cli.TestCliDriver.testCliDriver_stats_list_bucket
          org.apache.hadoop.hive.cli.TestCliDriver.testCliDriver_stats_partscan_1_23
          org.apache.hadoop.hive.cli.TestCliDriver.testCliDriver_symlink_text_input_format
          org.apache.hadoop.hive.cli.TestCliDriver.testCliDriver_transform_ppr1
          org.apache.hadoop.hive.cli.TestCliDriver.testCliDriver_transform_ppr2
          org.apache.hadoop.hive.cli.TestCliDriver.testCliDriver_truncate_column_list_bucket
          org.apache.hadoop.hive.cli.TestCliDriver.testCliDriver_udf_current_database
          org.apache.hadoop.hive.cli.TestCliDriver.testCliDriver_udf_explode
          org.apache.hadoop.hive.cli.TestCliDriver.testCliDriver_udtf_explode
          org.apache.hadoop.hive.cli.TestCliDriver.testCliDriver_union24
          org.apache.hadoop.hive.cli.TestCliDriver.testCliDriver_union_ppr
          org.apache.hadoop.hive.cli.TestCliDriver.testCliDriver_union_remove_1
          org.apache.hadoop.hive.cli.TestCliDriver.testCliDriver_union_remove_10
          org.apache.hadoop.hive.cli.TestCliDriver.testCliDriver_union_remove_12
          org.apache.hadoop.hive.cli.TestCliDriver.testCliDriver_union_remove_13
          org.apache.hadoop.hive.cli.TestCliDriver.testCliDriver_union_remove_14
          org.apache.hadoop.hive.cli.TestCliDriver.testCliDriver_union_remove_17
          org.apache.hadoop.hive.cli.TestCliDriver.testCliDriver_union_remove_19
          org.apache.hadoop.hive.cli.TestCliDriver.testCliDriver_union_remove_2
          org.apache.hadoop.hive.cli.TestCliDriver.testCliDriver_union_remove_20
          org.apache.hadoop.hive.cli.TestCliDriver.testCliDriver_union_remove_21
          org.apache.hadoop.hive.cli.TestCliDriver.testCliDriver_union_remove_22
          org.apache.hadoop.hive.cli.TestCliDriver.testCliDriver_union_remove_23
          org.apache.hadoop.hive.cli.TestCliDriver.testCliDriver_union_remove_24
          org.apache.hadoop.hive.cli.TestCliDriver.testCliDriver_union_remove_4
          org.apache.hadoop.hive.cli.TestCliDriver.testCliDriver_union_remove_5
          org.apache.hadoop.hive.cli.TestCliDriver.testCliDriver_union_remove_7
          org.apache.hadoop.hive.cli.TestCliDriver.testCliDriver_union_remove_8
          org.apache.hadoop.hive.cli.TestCliDriver.testCliDriver_union_remove_9
          org.apache.hadoop.hive.cli.TestCliDriver.testCliDriver_unset_table_view_property
          org.apache.hadoop.hive.cli.TestMinimrCliDriver.testCliDriver_bucket4
          org.apache.hadoop.hive.cli.TestMinimrCliDriver.testCliDriver_bucketizedhiveinputformat
          org.apache.hadoop.hive.cli.TestMinimrCliDriver.testCliDriver_bucketmapjoin7
          org.apache.hadoop.hive.cli.TestMinimrCliDriver.testCliDriver_disable_merge_for_bucketing
          org.apache.hadoop.hive.cli.TestMinimrCliDriver.testCliDriver_root_dir_external_table
          org.apache.hadoop.hive.cli.TestNegativeCliDriver.testNegativeCliDriver_authorization_part
          org.apache.hadoop.hive.cli.TestNegativeCliDriver.testNegativeCliDriver_dynamic_partitions_with_whitelist
          org.apache.hadoop.hive.cli.TestNegativeCliDriver.testNegativeCliDriver_stats_partialscan_autogether
          org.apache.hadoop.hive.ql.exec.TestExecDriver.testMapRedPlan3
          

          Test results: http://ec2-174-129-184-35.compute-1.amazonaws.com/jenkins/job/precommit-hive/18/testReport
          Console output: http://ec2-174-129-184-35.compute-1.amazonaws.com/jenkins/job/precommit-hive/18/console

          Messages:

          Executing org.apache.hive.ptest.execution.PrepPhase
          Executing org.apache.hive.ptest.execution.ExecutionPhase
          Executing org.apache.hive.ptest.execution.ReportingPhase
          Tests exited with: TestsFailedException: 122 tests failed
          

          This message is automatically generated.

          ATTACHMENT ID: 12641113

          Show
          Hive QA added a comment - Overall : -1 at least one tests failed Here are the results of testing the latest attachment: https://issues.apache.org/jira/secure/attachment/12641113/HIVE-6901.2.patch ERROR: -1 due to 122 failed/errored test(s), 5416 tests executed Failed tests: org.apache.hadoop.hive.cli.TestCliDriver.testCliDriver_annotate_stats_filter org.apache.hadoop.hive.cli.TestCliDriver.testCliDriver_annotate_stats_part org.apache.hadoop.hive.cli.TestCliDriver.testCliDriver_annotate_stats_union org.apache.hadoop.hive.cli.TestCliDriver.testCliDriver_auto_join32 org.apache.hadoop.hive.cli.TestCliDriver.testCliDriver_auto_sortmerge_join_11 org.apache.hadoop.hive.cli.TestCliDriver.testCliDriver_auto_sortmerge_join_2 org.apache.hadoop.hive.cli.TestCliDriver.testCliDriver_auto_sortmerge_join_3 org.apache.hadoop.hive.cli.TestCliDriver.testCliDriver_auto_sortmerge_join_5 org.apache.hadoop.hive.cli.TestCliDriver.testCliDriver_binarysortable_1 org.apache.hadoop.hive.cli.TestCliDriver.testCliDriver_bucket2 org.apache.hadoop.hive.cli.TestCliDriver.testCliDriver_bucket3 org.apache.hadoop.hive.cli.TestCliDriver.testCliDriver_bucket_map_join_1 org.apache.hadoop.hive.cli.TestCliDriver.testCliDriver_bucket_map_join_2 org.apache.hadoop.hive.cli.TestCliDriver.testCliDriver_bucketcontext_1 org.apache.hadoop.hive.cli.TestCliDriver.testCliDriver_bucketcontext_2 org.apache.hadoop.hive.cli.TestCliDriver.testCliDriver_bucketcontext_3 org.apache.hadoop.hive.cli.TestCliDriver.testCliDriver_bucketcontext_4 org.apache.hadoop.hive.cli.TestCliDriver.testCliDriver_bucketcontext_5 org.apache.hadoop.hive.cli.TestCliDriver.testCliDriver_bucketmapjoin12 org.apache.hadoop.hive.cli.TestCliDriver.testCliDriver_bucketmapjoin8 org.apache.hadoop.hive.cli.TestCliDriver.testCliDriver_bucketmapjoin9 org.apache.hadoop.hive.cli.TestCliDriver.testCliDriver_combine2 org.apache.hadoop.hive.cli.TestCliDriver.testCliDriver_filter_join_breaktask org.apache.hadoop.hive.cli.TestCliDriver.testCliDriver_filter_numeric org.apache.hadoop.hive.cli.TestCliDriver.testCliDriver_groupby2_map_skew org.apache.hadoop.hive.cli.TestCliDriver.testCliDriver_groupby_sort_1 org.apache.hadoop.hive.cli.TestCliDriver.testCliDriver_groupby_sort_skew_1 org.apache.hadoop.hive.cli.TestCliDriver.testCliDriver_infer_bucket_sort_list_bucket org.apache.hadoop.hive.cli.TestCliDriver.testCliDriver_input23 org.apache.hadoop.hive.cli.TestCliDriver.testCliDriver_input39 org.apache.hadoop.hive.cli.TestCliDriver.testCliDriver_input42 org.apache.hadoop.hive.cli.TestCliDriver.testCliDriver_input_part7 org.apache.hadoop.hive.cli.TestCliDriver.testCliDriver_input_part9 org.apache.hadoop.hive.cli.TestCliDriver.testCliDriver_join_filters_overlap org.apache.hadoop.hive.cli.TestCliDriver.testCliDriver_list_bucket_dml_1 org.apache.hadoop.hive.cli.TestCliDriver.testCliDriver_list_bucket_dml_11 org.apache.hadoop.hive.cli.TestCliDriver.testCliDriver_list_bucket_dml_12 org.apache.hadoop.hive.cli.TestCliDriver.testCliDriver_list_bucket_dml_13 org.apache.hadoop.hive.cli.TestCliDriver.testCliDriver_list_bucket_dml_2 org.apache.hadoop.hive.cli.TestCliDriver.testCliDriver_list_bucket_dml_3 org.apache.hadoop.hive.cli.TestCliDriver.testCliDriver_list_bucket_dml_4 org.apache.hadoop.hive.cli.TestCliDriver.testCliDriver_list_bucket_dml_5 org.apache.hadoop.hive.cli.TestCliDriver.testCliDriver_list_bucket_dml_6 org.apache.hadoop.hive.cli.TestCliDriver.testCliDriver_list_bucket_dml_7 org.apache.hadoop.hive.cli.TestCliDriver.testCliDriver_list_bucket_dml_8 org.apache.hadoop.hive.cli.TestCliDriver.testCliDriver_list_bucket_dml_9 org.apache.hadoop.hive.cli.TestCliDriver.testCliDriver_list_bucket_query_multiskew_1 org.apache.hadoop.hive.cli.TestCliDriver.testCliDriver_list_bucket_query_multiskew_2 org.apache.hadoop.hive.cli.TestCliDriver.testCliDriver_list_bucket_query_multiskew_3 org.apache.hadoop.hive.cli.TestCliDriver.testCliDriver_list_bucket_query_oneskew_1 org.apache.hadoop.hive.cli.TestCliDriver.testCliDriver_list_bucket_query_oneskew_2 org.apache.hadoop.hive.cli.TestCliDriver.testCliDriver_list_bucket_query_oneskew_3 org.apache.hadoop.hive.cli.TestCliDriver.testCliDriver_louter_join_ppr org.apache.hadoop.hive.cli.TestCliDriver.testCliDriver_mapjoin_test_outer org.apache.hadoop.hive.cli.TestCliDriver.testCliDriver_metadataonly1 org.apache.hadoop.hive.cli.TestCliDriver.testCliDriver_nullformatCTAS org.apache.hadoop.hive.cli.TestCliDriver.testCliDriver_nullgroup3 org.apache.hadoop.hive.cli.TestCliDriver.testCliDriver_orc_createas1 org.apache.hadoop.hive.cli.TestCliDriver.testCliDriver_outer_join_ppr org.apache.hadoop.hive.cli.TestCliDriver.testCliDriver_pcr org.apache.hadoop.hive.cli.TestCliDriver.testCliDriver_ppd_join4 org.apache.hadoop.hive.cli.TestCliDriver.testCliDriver_ppd_join_filter org.apache.hadoop.hive.cli.TestCliDriver.testCliDriver_ppd_vc org.apache.hadoop.hive.cli.TestCliDriver.testCliDriver_ppr_allchildsarenull org.apache.hadoop.hive.cli.TestCliDriver.testCliDriver_push_or org.apache.hadoop.hive.cli.TestCliDriver.testCliDriver_rand_partitionpruner1 org.apache.hadoop.hive.cli.TestCliDriver.testCliDriver_rand_partitionpruner3 org.apache.hadoop.hive.cli.TestCliDriver.testCliDriver_regexp_extract org.apache.hadoop.hive.cli.TestCliDriver.testCliDriver_router_join_ppr org.apache.hadoop.hive.cli.TestCliDriver.testCliDriver_sample10 org.apache.hadoop.hive.cli.TestCliDriver.testCliDriver_sample6 org.apache.hadoop.hive.cli.TestCliDriver.testCliDriver_sample8 org.apache.hadoop.hive.cli.TestCliDriver.testCliDriver_sample9 org.apache.hadoop.hive.cli.TestCliDriver.testCliDriver_select_dummy_source org.apache.hadoop.hive.cli.TestCliDriver.testCliDriver_serde_user_properties org.apache.hadoop.hive.cli.TestCliDriver.testCliDriver_show_create_table_alter org.apache.hadoop.hive.cli.TestCliDriver.testCliDriver_show_create_table_serde org.apache.hadoop.hive.cli.TestCliDriver.testCliDriver_skewjoin_union_remove_1 org.apache.hadoop.hive.cli.TestCliDriver.testCliDriver_skewjoin_union_remove_2 org.apache.hadoop.hive.cli.TestCliDriver.testCliDriver_smb_mapjoin_13 org.apache.hadoop.hive.cli.TestCliDriver.testCliDriver_smb_mapjoin_15 org.apache.hadoop.hive.cli.TestCliDriver.testCliDriver_sort_merge_join_desc_5 org.apache.hadoop.hive.cli.TestCliDriver.testCliDriver_sort_merge_join_desc_6 org.apache.hadoop.hive.cli.TestCliDriver.testCliDriver_stats_list_bucket org.apache.hadoop.hive.cli.TestCliDriver.testCliDriver_stats_partscan_1_23 org.apache.hadoop.hive.cli.TestCliDriver.testCliDriver_symlink_text_input_format org.apache.hadoop.hive.cli.TestCliDriver.testCliDriver_transform_ppr1 org.apache.hadoop.hive.cli.TestCliDriver.testCliDriver_transform_ppr2 org.apache.hadoop.hive.cli.TestCliDriver.testCliDriver_truncate_column_list_bucket org.apache.hadoop.hive.cli.TestCliDriver.testCliDriver_udf_current_database org.apache.hadoop.hive.cli.TestCliDriver.testCliDriver_udf_explode org.apache.hadoop.hive.cli.TestCliDriver.testCliDriver_udtf_explode org.apache.hadoop.hive.cli.TestCliDriver.testCliDriver_union24 org.apache.hadoop.hive.cli.TestCliDriver.testCliDriver_union_ppr org.apache.hadoop.hive.cli.TestCliDriver.testCliDriver_union_remove_1 org.apache.hadoop.hive.cli.TestCliDriver.testCliDriver_union_remove_10 org.apache.hadoop.hive.cli.TestCliDriver.testCliDriver_union_remove_12 org.apache.hadoop.hive.cli.TestCliDriver.testCliDriver_union_remove_13 org.apache.hadoop.hive.cli.TestCliDriver.testCliDriver_union_remove_14 org.apache.hadoop.hive.cli.TestCliDriver.testCliDriver_union_remove_17 org.apache.hadoop.hive.cli.TestCliDriver.testCliDriver_union_remove_19 org.apache.hadoop.hive.cli.TestCliDriver.testCliDriver_union_remove_2 org.apache.hadoop.hive.cli.TestCliDriver.testCliDriver_union_remove_20 org.apache.hadoop.hive.cli.TestCliDriver.testCliDriver_union_remove_21 org.apache.hadoop.hive.cli.TestCliDriver.testCliDriver_union_remove_22 org.apache.hadoop.hive.cli.TestCliDriver.testCliDriver_union_remove_23 org.apache.hadoop.hive.cli.TestCliDriver.testCliDriver_union_remove_24 org.apache.hadoop.hive.cli.TestCliDriver.testCliDriver_union_remove_4 org.apache.hadoop.hive.cli.TestCliDriver.testCliDriver_union_remove_5 org.apache.hadoop.hive.cli.TestCliDriver.testCliDriver_union_remove_7 org.apache.hadoop.hive.cli.TestCliDriver.testCliDriver_union_remove_8 org.apache.hadoop.hive.cli.TestCliDriver.testCliDriver_union_remove_9 org.apache.hadoop.hive.cli.TestCliDriver.testCliDriver_unset_table_view_property org.apache.hadoop.hive.cli.TestMinimrCliDriver.testCliDriver_bucket4 org.apache.hadoop.hive.cli.TestMinimrCliDriver.testCliDriver_bucketizedhiveinputformat org.apache.hadoop.hive.cli.TestMinimrCliDriver.testCliDriver_bucketmapjoin7 org.apache.hadoop.hive.cli.TestMinimrCliDriver.testCliDriver_disable_merge_for_bucketing org.apache.hadoop.hive.cli.TestMinimrCliDriver.testCliDriver_root_dir_external_table org.apache.hadoop.hive.cli.TestNegativeCliDriver.testNegativeCliDriver_authorization_part org.apache.hadoop.hive.cli.TestNegativeCliDriver.testNegativeCliDriver_dynamic_partitions_with_whitelist org.apache.hadoop.hive.cli.TestNegativeCliDriver.testNegativeCliDriver_stats_partialscan_autogether org.apache.hadoop.hive.ql.exec.TestExecDriver.testMapRedPlan3 Test results: http://ec2-174-129-184-35.compute-1.amazonaws.com/jenkins/job/precommit-hive/18/testReport Console output: http://ec2-174-129-184-35.compute-1.amazonaws.com/jenkins/job/precommit-hive/18/console Messages: Executing org.apache.hive.ptest.execution.PrepPhase Executing org.apache.hive.ptest.execution.ExecutionPhase Executing org.apache.hive.ptest.execution.ReportingPhase Tests exited with: TestsFailedException: 122 tests failed This message is automatically generated. ATTACHMENT ID: 12641113
          Szehon Ho made changes -
          Attachment HIVE-6901.2.patch [ 12641113 ]
          Hide
          Szehon Ho added a comment -

          Sorry about that, there was a problem with the hadoop-2 test-property file on the build machine, I'll re-submit this.

          Show
          Szehon Ho added a comment - Sorry about that, there was a problem with the hadoop-2 test-property file on the build machine, I'll re-submit this.
          Hide
          Hive QA added a comment -

          Overall: -1 no tests executed

          Here are the results of testing the latest attachment:
          https://issues.apache.org/jira/secure/attachment/12641106/HIVE-6901.2.patch

          Test results: http://ec2-174-129-184-35.compute-1.amazonaws.com/jenkins/job/precommit-hive/17/testReport
          Console output: http://ec2-174-129-184-35.compute-1.amazonaws.com/jenkins/job/precommit-hive/17/console

          Messages:

          Executing org.apache.hive.ptest.execution.PrepPhase
          Executing org.apache.hive.ptest.execution.ExecutionPhase
          Tests exited with: NullPointerException: driver
          

          This message is automatically generated.

          ATTACHMENT ID: 12641106

          Show
          Hive QA added a comment - Overall : -1 no tests executed Here are the results of testing the latest attachment: https://issues.apache.org/jira/secure/attachment/12641106/HIVE-6901.2.patch Test results: http://ec2-174-129-184-35.compute-1.amazonaws.com/jenkins/job/precommit-hive/17/testReport Console output: http://ec2-174-129-184-35.compute-1.amazonaws.com/jenkins/job/precommit-hive/17/console Messages: Executing org.apache.hive.ptest.execution.PrepPhase Executing org.apache.hive.ptest.execution.ExecutionPhase Tests exited with: NullPointerException: driver This message is automatically generated. ATTACHMENT ID: 12641106
          Xuefu Zhang made changes -
          Attachment HIVE-6901.2.patch [ 12641106 ]
          Hide
          Hive QA added a comment -

          Overall: -1 at least one tests failed

          Here are the results of testing the latest attachment:
          https://issues.apache.org/jira/secure/attachment/12640920/HIVE-6901.2.patch

          ERROR: -1 due to 64 failed/errored test(s), 5406 tests executed
          Failed tests:

          org.apache.hadoop.hive.cli.TestCliDriver.testCliDriver_annotate_stats_filter
          org.apache.hadoop.hive.cli.TestCliDriver.testCliDriver_annotate_stats_part
          org.apache.hadoop.hive.cli.TestCliDriver.testCliDriver_annotate_stats_union
          org.apache.hadoop.hive.cli.TestCliDriver.testCliDriver_auto_sortmerge_join_11
          org.apache.hadoop.hive.cli.TestCliDriver.testCliDriver_auto_sortmerge_join_2
          org.apache.hadoop.hive.cli.TestCliDriver.testCliDriver_auto_sortmerge_join_3
          org.apache.hadoop.hive.cli.TestCliDriver.testCliDriver_auto_sortmerge_join_5
          org.apache.hadoop.hive.cli.TestCliDriver.testCliDriver_binarysortable_1
          org.apache.hadoop.hive.cli.TestCliDriver.testCliDriver_bucket2
          org.apache.hadoop.hive.cli.TestCliDriver.testCliDriver_bucket3
          org.apache.hadoop.hive.cli.TestCliDriver.testCliDriver_bucket_map_join_1
          org.apache.hadoop.hive.cli.TestCliDriver.testCliDriver_bucket_map_join_2
          org.apache.hadoop.hive.cli.TestCliDriver.testCliDriver_bucketcontext_1
          org.apache.hadoop.hive.cli.TestCliDriver.testCliDriver_bucketcontext_2
          org.apache.hadoop.hive.cli.TestCliDriver.testCliDriver_bucketcontext_3
          org.apache.hadoop.hive.cli.TestCliDriver.testCliDriver_bucketcontext_4
          org.apache.hadoop.hive.cli.TestCliDriver.testCliDriver_bucketcontext_5
          org.apache.hadoop.hive.cli.TestCliDriver.testCliDriver_bucketmapjoin12
          org.apache.hadoop.hive.cli.TestCliDriver.testCliDriver_bucketmapjoin8
          org.apache.hadoop.hive.cli.TestCliDriver.testCliDriver_bucketmapjoin9
          org.apache.hadoop.hive.cli.TestCliDriver.testCliDriver_filter_join_breaktask
          org.apache.hadoop.hive.cli.TestCliDriver.testCliDriver_groupby_sort_1
          org.apache.hadoop.hive.cli.TestCliDriver.testCliDriver_groupby_sort_skew_1
          org.apache.hadoop.hive.cli.TestCliDriver.testCliDriver_input23
          org.apache.hadoop.hive.cli.TestCliDriver.testCliDriver_input42
          org.apache.hadoop.hive.cli.TestCliDriver.testCliDriver_input_part7
          org.apache.hadoop.hive.cli.TestCliDriver.testCliDriver_input_part9
          org.apache.hadoop.hive.cli.TestCliDriver.testCliDriver_join_filters_overlap
          org.apache.hadoop.hive.cli.TestCliDriver.testCliDriver_louter_join_ppr
          org.apache.hadoop.hive.cli.TestCliDriver.testCliDriver_metadataonly1
          org.apache.hadoop.hive.cli.TestCliDriver.testCliDriver_nullformatCTAS
          org.apache.hadoop.hive.cli.TestCliDriver.testCliDriver_outer_join_ppr
          org.apache.hadoop.hive.cli.TestCliDriver.testCliDriver_pcr
          org.apache.hadoop.hive.cli.TestCliDriver.testCliDriver_ppd_join_filter
          org.apache.hadoop.hive.cli.TestCliDriver.testCliDriver_ppd_vc
          org.apache.hadoop.hive.cli.TestCliDriver.testCliDriver_ppr_allchildsarenull
          org.apache.hadoop.hive.cli.TestCliDriver.testCliDriver_push_or
          org.apache.hadoop.hive.cli.TestCliDriver.testCliDriver_rand_partitionpruner1
          org.apache.hadoop.hive.cli.TestCliDriver.testCliDriver_rand_partitionpruner3
          org.apache.hadoop.hive.cli.TestCliDriver.testCliDriver_regexp_extract
          org.apache.hadoop.hive.cli.TestCliDriver.testCliDriver_router_join_ppr
          org.apache.hadoop.hive.cli.TestCliDriver.testCliDriver_sample10
          org.apache.hadoop.hive.cli.TestCliDriver.testCliDriver_sample6
          org.apache.hadoop.hive.cli.TestCliDriver.testCliDriver_sample8
          org.apache.hadoop.hive.cli.TestCliDriver.testCliDriver_sample9
          org.apache.hadoop.hive.cli.TestCliDriver.testCliDriver_serde_user_properties
          org.apache.hadoop.hive.cli.TestCliDriver.testCliDriver_show_create_table_alter
          org.apache.hadoop.hive.cli.TestCliDriver.testCliDriver_show_create_table_serde
          org.apache.hadoop.hive.cli.TestCliDriver.testCliDriver_smb_mapjoin_13
          org.apache.hadoop.hive.cli.TestCliDriver.testCliDriver_smb_mapjoin_15
          org.apache.hadoop.hive.cli.TestCliDriver.testCliDriver_sort_merge_join_desc_5
          org.apache.hadoop.hive.cli.TestCliDriver.testCliDriver_sort_merge_join_desc_6
          org.apache.hadoop.hive.cli.TestCliDriver.testCliDriver_transform_ppr1
          org.apache.hadoop.hive.cli.TestCliDriver.testCliDriver_transform_ppr2
          org.apache.hadoop.hive.cli.TestCliDriver.testCliDriver_udf_explode
          org.apache.hadoop.hive.cli.TestCliDriver.testCliDriver_udtf_explode
          org.apache.hadoop.hive.cli.TestCliDriver.testCliDriver_union24
          org.apache.hadoop.hive.cli.TestCliDriver.testCliDriver_union_ppr
          org.apache.hadoop.hive.cli.TestCliDriver.testCliDriver_unset_table_view_property
          org.apache.hadoop.hive.cli.TestMinimrCliDriver.testCliDriver_bucket4
          org.apache.hadoop.hive.cli.TestMinimrCliDriver.testCliDriver_bucketmapjoin6
          org.apache.hadoop.hive.cli.TestMinimrCliDriver.testCliDriver_bucketmapjoin7
          org.apache.hadoop.hive.cli.TestMinimrCliDriver.testCliDriver_disable_merge_for_bucketing
          org.apache.hadoop.hive.cli.TestNegativeCliDriver.testNegativeCliDriver_authorization_part
          

          Test results: http://bigtop01.cloudera.org:8080/job/precommit-hive/24/testReport
          Console output: http://bigtop01.cloudera.org:8080/job/precommit-hive/24/console

          Messages:

          Executing org.apache.hive.ptest.execution.PrepPhase
          Executing org.apache.hive.ptest.execution.ExecutionPhase
          Executing org.apache.hive.ptest.execution.ReportingPhase
          Tests exited with: TestsFailedException: 64 tests failed
          

          This message is automatically generated.

          ATTACHMENT ID: 12640920

          Show
          Hive QA added a comment - Overall : -1 at least one tests failed Here are the results of testing the latest attachment: https://issues.apache.org/jira/secure/attachment/12640920/HIVE-6901.2.patch ERROR: -1 due to 64 failed/errored test(s), 5406 tests executed Failed tests: org.apache.hadoop.hive.cli.TestCliDriver.testCliDriver_annotate_stats_filter org.apache.hadoop.hive.cli.TestCliDriver.testCliDriver_annotate_stats_part org.apache.hadoop.hive.cli.TestCliDriver.testCliDriver_annotate_stats_union org.apache.hadoop.hive.cli.TestCliDriver.testCliDriver_auto_sortmerge_join_11 org.apache.hadoop.hive.cli.TestCliDriver.testCliDriver_auto_sortmerge_join_2 org.apache.hadoop.hive.cli.TestCliDriver.testCliDriver_auto_sortmerge_join_3 org.apache.hadoop.hive.cli.TestCliDriver.testCliDriver_auto_sortmerge_join_5 org.apache.hadoop.hive.cli.TestCliDriver.testCliDriver_binarysortable_1 org.apache.hadoop.hive.cli.TestCliDriver.testCliDriver_bucket2 org.apache.hadoop.hive.cli.TestCliDriver.testCliDriver_bucket3 org.apache.hadoop.hive.cli.TestCliDriver.testCliDriver_bucket_map_join_1 org.apache.hadoop.hive.cli.TestCliDriver.testCliDriver_bucket_map_join_2 org.apache.hadoop.hive.cli.TestCliDriver.testCliDriver_bucketcontext_1 org.apache.hadoop.hive.cli.TestCliDriver.testCliDriver_bucketcontext_2 org.apache.hadoop.hive.cli.TestCliDriver.testCliDriver_bucketcontext_3 org.apache.hadoop.hive.cli.TestCliDriver.testCliDriver_bucketcontext_4 org.apache.hadoop.hive.cli.TestCliDriver.testCliDriver_bucketcontext_5 org.apache.hadoop.hive.cli.TestCliDriver.testCliDriver_bucketmapjoin12 org.apache.hadoop.hive.cli.TestCliDriver.testCliDriver_bucketmapjoin8 org.apache.hadoop.hive.cli.TestCliDriver.testCliDriver_bucketmapjoin9 org.apache.hadoop.hive.cli.TestCliDriver.testCliDriver_filter_join_breaktask org.apache.hadoop.hive.cli.TestCliDriver.testCliDriver_groupby_sort_1 org.apache.hadoop.hive.cli.TestCliDriver.testCliDriver_groupby_sort_skew_1 org.apache.hadoop.hive.cli.TestCliDriver.testCliDriver_input23 org.apache.hadoop.hive.cli.TestCliDriver.testCliDriver_input42 org.apache.hadoop.hive.cli.TestCliDriver.testCliDriver_input_part7 org.apache.hadoop.hive.cli.TestCliDriver.testCliDriver_input_part9 org.apache.hadoop.hive.cli.TestCliDriver.testCliDriver_join_filters_overlap org.apache.hadoop.hive.cli.TestCliDriver.testCliDriver_louter_join_ppr org.apache.hadoop.hive.cli.TestCliDriver.testCliDriver_metadataonly1 org.apache.hadoop.hive.cli.TestCliDriver.testCliDriver_nullformatCTAS org.apache.hadoop.hive.cli.TestCliDriver.testCliDriver_outer_join_ppr org.apache.hadoop.hive.cli.TestCliDriver.testCliDriver_pcr org.apache.hadoop.hive.cli.TestCliDriver.testCliDriver_ppd_join_filter org.apache.hadoop.hive.cli.TestCliDriver.testCliDriver_ppd_vc org.apache.hadoop.hive.cli.TestCliDriver.testCliDriver_ppr_allchildsarenull org.apache.hadoop.hive.cli.TestCliDriver.testCliDriver_push_or org.apache.hadoop.hive.cli.TestCliDriver.testCliDriver_rand_partitionpruner1 org.apache.hadoop.hive.cli.TestCliDriver.testCliDriver_rand_partitionpruner3 org.apache.hadoop.hive.cli.TestCliDriver.testCliDriver_regexp_extract org.apache.hadoop.hive.cli.TestCliDriver.testCliDriver_router_join_ppr org.apache.hadoop.hive.cli.TestCliDriver.testCliDriver_sample10 org.apache.hadoop.hive.cli.TestCliDriver.testCliDriver_sample6 org.apache.hadoop.hive.cli.TestCliDriver.testCliDriver_sample8 org.apache.hadoop.hive.cli.TestCliDriver.testCliDriver_sample9 org.apache.hadoop.hive.cli.TestCliDriver.testCliDriver_serde_user_properties org.apache.hadoop.hive.cli.TestCliDriver.testCliDriver_show_create_table_alter org.apache.hadoop.hive.cli.TestCliDriver.testCliDriver_show_create_table_serde org.apache.hadoop.hive.cli.TestCliDriver.testCliDriver_smb_mapjoin_13 org.apache.hadoop.hive.cli.TestCliDriver.testCliDriver_smb_mapjoin_15 org.apache.hadoop.hive.cli.TestCliDriver.testCliDriver_sort_merge_join_desc_5 org.apache.hadoop.hive.cli.TestCliDriver.testCliDriver_sort_merge_join_desc_6 org.apache.hadoop.hive.cli.TestCliDriver.testCliDriver_transform_ppr1 org.apache.hadoop.hive.cli.TestCliDriver.testCliDriver_transform_ppr2 org.apache.hadoop.hive.cli.TestCliDriver.testCliDriver_udf_explode org.apache.hadoop.hive.cli.TestCliDriver.testCliDriver_udtf_explode org.apache.hadoop.hive.cli.TestCliDriver.testCliDriver_union24 org.apache.hadoop.hive.cli.TestCliDriver.testCliDriver_union_ppr org.apache.hadoop.hive.cli.TestCliDriver.testCliDriver_unset_table_view_property org.apache.hadoop.hive.cli.TestMinimrCliDriver.testCliDriver_bucket4 org.apache.hadoop.hive.cli.TestMinimrCliDriver.testCliDriver_bucketmapjoin6 org.apache.hadoop.hive.cli.TestMinimrCliDriver.testCliDriver_bucketmapjoin7 org.apache.hadoop.hive.cli.TestMinimrCliDriver.testCliDriver_disable_merge_for_bucketing org.apache.hadoop.hive.cli.TestNegativeCliDriver.testNegativeCliDriver_authorization_part Test results: http://bigtop01.cloudera.org:8080/job/precommit-hive/24/testReport Console output: http://bigtop01.cloudera.org:8080/job/precommit-hive/24/console Messages: Executing org.apache.hive.ptest.execution.PrepPhase Executing org.apache.hive.ptest.execution.ExecutionPhase Executing org.apache.hive.ptest.execution.ReportingPhase Tests exited with: TestsFailedException: 64 tests failed This message is automatically generated. ATTACHMENT ID: 12640920
          Xuefu Zhang made changes -
          Attachment HIVE-6901.2.patch [ 12640920 ]
          Hide
          Xuefu Zhang added a comment -

          Patch#1 seems having some issue in the generated test output file. Attach patch#2 as another attempt.

          Show
          Xuefu Zhang added a comment - Patch#1 seems having some issue in the generated test output file. Attach patch#2 as another attempt.
          Hide
          Hive QA added a comment -

          Overall: -1 at least one tests failed

          Here are the results of testing the latest attachment:
          https://issues.apache.org/jira/secure/attachment/12640079/HIVE-6901.1.patch

          ERROR: -1 due to 65 failed/errored test(s), 5401 tests executed
          Failed tests:

          org.apache.hadoop.hive.cli.TestCliDriver.testCliDriver_annotate_stats_filter
          org.apache.hadoop.hive.cli.TestCliDriver.testCliDriver_annotate_stats_part
          org.apache.hadoop.hive.cli.TestCliDriver.testCliDriver_annotate_stats_union
          org.apache.hadoop.hive.cli.TestCliDriver.testCliDriver_auto_sortmerge_join_11
          org.apache.hadoop.hive.cli.TestCliDriver.testCliDriver_auto_sortmerge_join_2
          org.apache.hadoop.hive.cli.TestCliDriver.testCliDriver_auto_sortmerge_join_3
          org.apache.hadoop.hive.cli.TestCliDriver.testCliDriver_auto_sortmerge_join_5
          org.apache.hadoop.hive.cli.TestCliDriver.testCliDriver_binarysortable_1
          org.apache.hadoop.hive.cli.TestCliDriver.testCliDriver_bucket2
          org.apache.hadoop.hive.cli.TestCliDriver.testCliDriver_bucket3
          org.apache.hadoop.hive.cli.TestCliDriver.testCliDriver_bucket_map_join_1
          org.apache.hadoop.hive.cli.TestCliDriver.testCliDriver_bucket_map_join_2
          org.apache.hadoop.hive.cli.TestCliDriver.testCliDriver_bucketcontext_1
          org.apache.hadoop.hive.cli.TestCliDriver.testCliDriver_bucketcontext_2
          org.apache.hadoop.hive.cli.TestCliDriver.testCliDriver_bucketcontext_3
          org.apache.hadoop.hive.cli.TestCliDriver.testCliDriver_bucketcontext_4
          org.apache.hadoop.hive.cli.TestCliDriver.testCliDriver_bucketcontext_5
          org.apache.hadoop.hive.cli.TestCliDriver.testCliDriver_bucketmapjoin12
          org.apache.hadoop.hive.cli.TestCliDriver.testCliDriver_bucketmapjoin8
          org.apache.hadoop.hive.cli.TestCliDriver.testCliDriver_bucketmapjoin9
          org.apache.hadoop.hive.cli.TestCliDriver.testCliDriver_create_like_view
          org.apache.hadoop.hive.cli.TestCliDriver.testCliDriver_filter_join_breaktask
          org.apache.hadoop.hive.cli.TestCliDriver.testCliDriver_groupby_sort_1
          org.apache.hadoop.hive.cli.TestCliDriver.testCliDriver_groupby_sort_skew_1
          org.apache.hadoop.hive.cli.TestCliDriver.testCliDriver_input23
          org.apache.hadoop.hive.cli.TestCliDriver.testCliDriver_input42
          org.apache.hadoop.hive.cli.TestCliDriver.testCliDriver_input_part7
          org.apache.hadoop.hive.cli.TestCliDriver.testCliDriver_input_part9
          org.apache.hadoop.hive.cli.TestCliDriver.testCliDriver_join_filters_overlap
          org.apache.hadoop.hive.cli.TestCliDriver.testCliDriver_louter_join_ppr
          org.apache.hadoop.hive.cli.TestCliDriver.testCliDriver_metadataonly1
          org.apache.hadoop.hive.cli.TestCliDriver.testCliDriver_nullformatCTAS
          org.apache.hadoop.hive.cli.TestCliDriver.testCliDriver_outer_join_ppr
          org.apache.hadoop.hive.cli.TestCliDriver.testCliDriver_pcr
          org.apache.hadoop.hive.cli.TestCliDriver.testCliDriver_ppd_join_filter
          org.apache.hadoop.hive.cli.TestCliDriver.testCliDriver_ppd_vc
          org.apache.hadoop.hive.cli.TestCliDriver.testCliDriver_ppr_allchildsarenull
          org.apache.hadoop.hive.cli.TestCliDriver.testCliDriver_push_or
          org.apache.hadoop.hive.cli.TestCliDriver.testCliDriver_rand_partitionpruner1
          org.apache.hadoop.hive.cli.TestCliDriver.testCliDriver_rand_partitionpruner3
          org.apache.hadoop.hive.cli.TestCliDriver.testCliDriver_regexp_extract
          org.apache.hadoop.hive.cli.TestCliDriver.testCliDriver_router_join_ppr
          org.apache.hadoop.hive.cli.TestCliDriver.testCliDriver_sample10
          org.apache.hadoop.hive.cli.TestCliDriver.testCliDriver_sample6
          org.apache.hadoop.hive.cli.TestCliDriver.testCliDriver_sample8
          org.apache.hadoop.hive.cli.TestCliDriver.testCliDriver_sample9
          org.apache.hadoop.hive.cli.TestCliDriver.testCliDriver_serde_user_properties
          org.apache.hadoop.hive.cli.TestCliDriver.testCliDriver_show_create_table_alter
          org.apache.hadoop.hive.cli.TestCliDriver.testCliDriver_show_create_table_serde
          org.apache.hadoop.hive.cli.TestCliDriver.testCliDriver_smb_mapjoin_13
          org.apache.hadoop.hive.cli.TestCliDriver.testCliDriver_smb_mapjoin_15
          org.apache.hadoop.hive.cli.TestCliDriver.testCliDriver_sort_merge_join_desc_5
          org.apache.hadoop.hive.cli.TestCliDriver.testCliDriver_sort_merge_join_desc_6
          org.apache.hadoop.hive.cli.TestCliDriver.testCliDriver_transform_ppr1
          org.apache.hadoop.hive.cli.TestCliDriver.testCliDriver_transform_ppr2
          org.apache.hadoop.hive.cli.TestCliDriver.testCliDriver_udf_explode
          org.apache.hadoop.hive.cli.TestCliDriver.testCliDriver_udtf_explode
          org.apache.hadoop.hive.cli.TestCliDriver.testCliDriver_union24
          org.apache.hadoop.hive.cli.TestCliDriver.testCliDriver_union_ppr
          org.apache.hadoop.hive.cli.TestCliDriver.testCliDriver_unset_table_view_property
          org.apache.hadoop.hive.cli.TestMinimrCliDriver.testCliDriver_bucket4
          org.apache.hadoop.hive.cli.TestMinimrCliDriver.testCliDriver_bucketmapjoin7
          org.apache.hadoop.hive.cli.TestMinimrCliDriver.testCliDriver_disable_merge_for_bucketing
          org.apache.hadoop.hive.cli.TestNegativeCliDriver.testNegativeCliDriver_authorization_part
          org.apache.hive.jdbc.TestJdbcDriver2.testNewConnectionConfiguration
          

          Test results: http://bigtop01.cloudera.org:8080/job/precommit-hive/12/testReport
          Console output: http://bigtop01.cloudera.org:8080/job/precommit-hive/12/console

          Messages:

          Executing org.apache.hive.ptest.execution.PrepPhase
          Executing org.apache.hive.ptest.execution.ExecutionPhase
          Executing org.apache.hive.ptest.execution.ReportingPhase
          Tests exited with: TestsFailedException: 65 tests failed
          

          This message is automatically generated.

          ATTACHMENT ID: 12640079

          Show
          Hive QA added a comment - Overall : -1 at least one tests failed Here are the results of testing the latest attachment: https://issues.apache.org/jira/secure/attachment/12640079/HIVE-6901.1.patch ERROR: -1 due to 65 failed/errored test(s), 5401 tests executed Failed tests: org.apache.hadoop.hive.cli.TestCliDriver.testCliDriver_annotate_stats_filter org.apache.hadoop.hive.cli.TestCliDriver.testCliDriver_annotate_stats_part org.apache.hadoop.hive.cli.TestCliDriver.testCliDriver_annotate_stats_union org.apache.hadoop.hive.cli.TestCliDriver.testCliDriver_auto_sortmerge_join_11 org.apache.hadoop.hive.cli.TestCliDriver.testCliDriver_auto_sortmerge_join_2 org.apache.hadoop.hive.cli.TestCliDriver.testCliDriver_auto_sortmerge_join_3 org.apache.hadoop.hive.cli.TestCliDriver.testCliDriver_auto_sortmerge_join_5 org.apache.hadoop.hive.cli.TestCliDriver.testCliDriver_binarysortable_1 org.apache.hadoop.hive.cli.TestCliDriver.testCliDriver_bucket2 org.apache.hadoop.hive.cli.TestCliDriver.testCliDriver_bucket3 org.apache.hadoop.hive.cli.TestCliDriver.testCliDriver_bucket_map_join_1 org.apache.hadoop.hive.cli.TestCliDriver.testCliDriver_bucket_map_join_2 org.apache.hadoop.hive.cli.TestCliDriver.testCliDriver_bucketcontext_1 org.apache.hadoop.hive.cli.TestCliDriver.testCliDriver_bucketcontext_2 org.apache.hadoop.hive.cli.TestCliDriver.testCliDriver_bucketcontext_3 org.apache.hadoop.hive.cli.TestCliDriver.testCliDriver_bucketcontext_4 org.apache.hadoop.hive.cli.TestCliDriver.testCliDriver_bucketcontext_5 org.apache.hadoop.hive.cli.TestCliDriver.testCliDriver_bucketmapjoin12 org.apache.hadoop.hive.cli.TestCliDriver.testCliDriver_bucketmapjoin8 org.apache.hadoop.hive.cli.TestCliDriver.testCliDriver_bucketmapjoin9 org.apache.hadoop.hive.cli.TestCliDriver.testCliDriver_create_like_view org.apache.hadoop.hive.cli.TestCliDriver.testCliDriver_filter_join_breaktask org.apache.hadoop.hive.cli.TestCliDriver.testCliDriver_groupby_sort_1 org.apache.hadoop.hive.cli.TestCliDriver.testCliDriver_groupby_sort_skew_1 org.apache.hadoop.hive.cli.TestCliDriver.testCliDriver_input23 org.apache.hadoop.hive.cli.TestCliDriver.testCliDriver_input42 org.apache.hadoop.hive.cli.TestCliDriver.testCliDriver_input_part7 org.apache.hadoop.hive.cli.TestCliDriver.testCliDriver_input_part9 org.apache.hadoop.hive.cli.TestCliDriver.testCliDriver_join_filters_overlap org.apache.hadoop.hive.cli.TestCliDriver.testCliDriver_louter_join_ppr org.apache.hadoop.hive.cli.TestCliDriver.testCliDriver_metadataonly1 org.apache.hadoop.hive.cli.TestCliDriver.testCliDriver_nullformatCTAS org.apache.hadoop.hive.cli.TestCliDriver.testCliDriver_outer_join_ppr org.apache.hadoop.hive.cli.TestCliDriver.testCliDriver_pcr org.apache.hadoop.hive.cli.TestCliDriver.testCliDriver_ppd_join_filter org.apache.hadoop.hive.cli.TestCliDriver.testCliDriver_ppd_vc org.apache.hadoop.hive.cli.TestCliDriver.testCliDriver_ppr_allchildsarenull org.apache.hadoop.hive.cli.TestCliDriver.testCliDriver_push_or org.apache.hadoop.hive.cli.TestCliDriver.testCliDriver_rand_partitionpruner1 org.apache.hadoop.hive.cli.TestCliDriver.testCliDriver_rand_partitionpruner3 org.apache.hadoop.hive.cli.TestCliDriver.testCliDriver_regexp_extract org.apache.hadoop.hive.cli.TestCliDriver.testCliDriver_router_join_ppr org.apache.hadoop.hive.cli.TestCliDriver.testCliDriver_sample10 org.apache.hadoop.hive.cli.TestCliDriver.testCliDriver_sample6 org.apache.hadoop.hive.cli.TestCliDriver.testCliDriver_sample8 org.apache.hadoop.hive.cli.TestCliDriver.testCliDriver_sample9 org.apache.hadoop.hive.cli.TestCliDriver.testCliDriver_serde_user_properties org.apache.hadoop.hive.cli.TestCliDriver.testCliDriver_show_create_table_alter org.apache.hadoop.hive.cli.TestCliDriver.testCliDriver_show_create_table_serde org.apache.hadoop.hive.cli.TestCliDriver.testCliDriver_smb_mapjoin_13 org.apache.hadoop.hive.cli.TestCliDriver.testCliDriver_smb_mapjoin_15 org.apache.hadoop.hive.cli.TestCliDriver.testCliDriver_sort_merge_join_desc_5 org.apache.hadoop.hive.cli.TestCliDriver.testCliDriver_sort_merge_join_desc_6 org.apache.hadoop.hive.cli.TestCliDriver.testCliDriver_transform_ppr1 org.apache.hadoop.hive.cli.TestCliDriver.testCliDriver_transform_ppr2 org.apache.hadoop.hive.cli.TestCliDriver.testCliDriver_udf_explode org.apache.hadoop.hive.cli.TestCliDriver.testCliDriver_udtf_explode org.apache.hadoop.hive.cli.TestCliDriver.testCliDriver_union24 org.apache.hadoop.hive.cli.TestCliDriver.testCliDriver_union_ppr org.apache.hadoop.hive.cli.TestCliDriver.testCliDriver_unset_table_view_property org.apache.hadoop.hive.cli.TestMinimrCliDriver.testCliDriver_bucket4 org.apache.hadoop.hive.cli.TestMinimrCliDriver.testCliDriver_bucketmapjoin7 org.apache.hadoop.hive.cli.TestMinimrCliDriver.testCliDriver_disable_merge_for_bucketing org.apache.hadoop.hive.cli.TestNegativeCliDriver.testNegativeCliDriver_authorization_part org.apache.hive.jdbc.TestJdbcDriver2.testNewConnectionConfiguration Test results: http://bigtop01.cloudera.org:8080/job/precommit-hive/12/testReport Console output: http://bigtop01.cloudera.org:8080/job/precommit-hive/12/console Messages: Executing org.apache.hive.ptest.execution.PrepPhase Executing org.apache.hive.ptest.execution.ExecutionPhase Executing org.apache.hive.ptest.execution.ReportingPhase Tests exited with: TestsFailedException: 65 tests failed This message is automatically generated. ATTACHMENT ID: 12640079
          Xuefu Zhang made changes -
          Link This issue is related to HIVE-3925 [ HIVE-3925 ]
          Hide
          Xuefu Zhang added a comment -

          Actually HIVE-3925, while closely related to this, is concerned with stage dependency. This JIRA is concerned with the plan manifesting for the fetch stage. Thus, they seem orthogonal to each other.

          It's nice to have both though.

          Show
          Xuefu Zhang added a comment - Actually HIVE-3925 , while closely related to this, is concerned with stage dependency. This JIRA is concerned with the plan manifesting for the fetch stage. Thus, they seem orthogonal to each other. It's nice to have both though.
          Hide
          Ashutosh Chauhan added a comment -

          Dupe of HIVE-3925 ?

          Show
          Ashutosh Chauhan added a comment - Dupe of HIVE-3925 ?
          Xuefu Zhang made changes -
          Attachment HIVE-6901.1.patch [ 12640079 ]
          Hide
          Xuefu Zhang added a comment -

          Patch #1 regenerated some test outputs.

          Show
          Xuefu Zhang added a comment - Patch #1 regenerated some test outputs.
          Hide
          Hive QA added a comment -

          Overall: -1 at least one tests failed

          Here are the results of testing the latest attachment:
          https://issues.apache.org/jira/secure/attachment/12639911/HIVE-6901.patch

          ERROR: -1 due to 476 failed/errored test(s), 5615 tests executed
          Failed tests:

          org.apache.hadoop.hive.cli.TestCliDriver.testCliDriver_alias_casted_column
          org.apache.hadoop.hive.cli.TestCliDriver.testCliDriver_allcolref_in_udf
          org.apache.hadoop.hive.cli.TestCliDriver.testCliDriver_ambiguous_col
          org.apache.hadoop.hive.cli.TestCliDriver.testCliDriver_annotate_stats_filter
          org.apache.hadoop.hive.cli.TestCliDriver.testCliDriver_annotate_stats_groupby
          org.apache.hadoop.hive.cli.TestCliDriver.testCliDriver_annotate_stats_join
          org.apache.hadoop.hive.cli.TestCliDriver.testCliDriver_annotate_stats_part
          org.apache.hadoop.hive.cli.TestCliDriver.testCliDriver_annotate_stats_select
          org.apache.hadoop.hive.cli.TestCliDriver.testCliDriver_annotate_stats_table
          org.apache.hadoop.hive.cli.TestCliDriver.testCliDriver_annotate_stats_union
          org.apache.hadoop.hive.cli.TestCliDriver.testCliDriver_ansi_sql_arithmetic
          org.apache.hadoop.hive.cli.TestCliDriver.testCliDriver_auto_join0
          org.apache.hadoop.hive.cli.TestCliDriver.testCliDriver_auto_join10
          org.apache.hadoop.hive.cli.TestCliDriver.testCliDriver_auto_join11
          org.apache.hadoop.hive.cli.TestCliDriver.testCliDriver_auto_join12
          org.apache.hadoop.hive.cli.TestCliDriver.testCliDriver_auto_join13
          org.apache.hadoop.hive.cli.TestCliDriver.testCliDriver_auto_join15
          org.apache.hadoop.hive.cli.TestCliDriver.testCliDriver_auto_join16
          org.apache.hadoop.hive.cli.TestCliDriver.testCliDriver_auto_join18
          org.apache.hadoop.hive.cli.TestCliDriver.testCliDriver_auto_join18_multi_distinct
          org.apache.hadoop.hive.cli.TestCliDriver.testCliDriver_auto_join20
          org.apache.hadoop.hive.cli.TestCliDriver.testCliDriver_auto_join21
          org.apache.hadoop.hive.cli.TestCliDriver.testCliDriver_auto_join22
          org.apache.hadoop.hive.cli.TestCliDriver.testCliDriver_auto_join23
          org.apache.hadoop.hive.cli.TestCliDriver.testCliDriver_auto_join24
          org.apache.hadoop.hive.cli.TestCliDriver.testCliDriver_auto_join27
          org.apache.hadoop.hive.cli.TestCliDriver.testCliDriver_auto_join28
          org.apache.hadoop.hive.cli.TestCliDriver.testCliDriver_auto_join29
          org.apache.hadoop.hive.cli.TestCliDriver.testCliDriver_auto_join30
          org.apache.hadoop.hive.cli.TestCliDriver.testCliDriver_auto_join31
          org.apache.hadoop.hive.cli.TestCliDriver.testCliDriver_auto_join32
          org.apache.hadoop.hive.cli.TestCliDriver.testCliDriver_auto_join_reordering_values
          org.apache.hadoop.hive.cli.TestCliDriver.testCliDriver_auto_join_without_localtask
          org.apache.hadoop.hive.cli.TestCliDriver.testCliDriver_auto_smb_mapjoin_14
          org.apache.hadoop.hive.cli.TestCliDriver.testCliDriver_auto_sortmerge_join_1
          org.apache.hadoop.hive.cli.TestCliDriver.testCliDriver_auto_sortmerge_join_10
          org.apache.hadoop.hive.cli.TestCliDriver.testCliDriver_auto_sortmerge_join_11
          org.apache.hadoop.hive.cli.TestCliDriver.testCliDriver_auto_sortmerge_join_12
          org.apache.hadoop.hive.cli.TestCliDriver.testCliDriver_auto_sortmerge_join_14
          org.apache.hadoop.hive.cli.TestCliDriver.testCliDriver_auto_sortmerge_join_15
          org.apache.hadoop.hive.cli.TestCliDriver.testCliDriver_auto_sortmerge_join_2
          org.apache.hadoop.hive.cli.TestCliDriver.testCliDriver_auto_sortmerge_join_3
          org.apache.hadoop.hive.cli.TestCliDriver.testCliDriver_auto_sortmerge_join_4
          org.apache.hadoop.hive.cli.TestCliDriver.testCliDriver_auto_sortmerge_join_5
          org.apache.hadoop.hive.cli.TestCliDriver.testCliDriver_auto_sortmerge_join_6
          org.apache.hadoop.hive.cli.TestCliDriver.testCliDriver_auto_sortmerge_join_7
          org.apache.hadoop.hive.cli.TestCliDriver.testCliDriver_auto_sortmerge_join_8
          org.apache.hadoop.hive.cli.TestCliDriver.testCliDriver_auto_sortmerge_join_9
          org.apache.hadoop.hive.cli.TestCliDriver.testCliDriver_binarysortable_1
          org.apache.hadoop.hive.cli.TestCliDriver.testCliDriver_bucket2
          org.apache.hadoop.hive.cli.TestCliDriver.testCliDriver_bucket3
          org.apache.hadoop.hive.cli.TestCliDriver.testCliDriver_bucket_groupby
          org.apache.hadoop.hive.cli.TestCliDriver.testCliDriver_bucket_map_join_1
          org.apache.hadoop.hive.cli.TestCliDriver.testCliDriver_bucket_map_join_2
          org.apache.hadoop.hive.cli.TestCliDriver.testCliDriver_bucketcontext_1
          org.apache.hadoop.hive.cli.TestCliDriver.testCliDriver_bucketcontext_2
          org.apache.hadoop.hive.cli.TestCliDriver.testCliDriver_bucketcontext_3
          org.apache.hadoop.hive.cli.TestCliDriver.testCliDriver_bucketcontext_4
          org.apache.hadoop.hive.cli.TestCliDriver.testCliDriver_bucketcontext_5
          org.apache.hadoop.hive.cli.TestCliDriver.testCliDriver_bucketcontext_6
          org.apache.hadoop.hive.cli.TestCliDriver.testCliDriver_bucketcontext_7
          org.apache.hadoop.hive.cli.TestCliDriver.testCliDriver_bucketcontext_8
          org.apache.hadoop.hive.cli.TestCliDriver.testCliDriver_bucketmapjoin1
          org.apache.hadoop.hive.cli.TestCliDriver.testCliDriver_bucketmapjoin10
          org.apache.hadoop.hive.cli.TestCliDriver.testCliDriver_bucketmapjoin11
          org.apache.hadoop.hive.cli.TestCliDriver.testCliDriver_bucketmapjoin12
          org.apache.hadoop.hive.cli.TestCliDriver.testCliDriver_bucketmapjoin13
          org.apache.hadoop.hive.cli.TestCliDriver.testCliDriver_bucketmapjoin8
          org.apache.hadoop.hive.cli.TestCliDriver.testCliDriver_bucketmapjoin9
          org.apache.hadoop.hive.cli.TestCliDriver.testCliDriver_bucketmapjoin_negative3
          org.apache.hadoop.hive.cli.TestCliDriver.testCliDriver_cluster
          org.apache.hadoop.hive.cli.TestCliDriver.testCliDriver_column_access_stats
          org.apache.hadoop.hive.cli.TestCliDriver.testCliDriver_combine2_hadoop20
          org.apache.hadoop.hive.cli.TestCliDriver.testCliDriver_correlationoptimizer1
          org.apache.hadoop.hive.cli.TestCliDriver.testCliDriver_correlationoptimizer10
          org.apache.hadoop.hive.cli.TestCliDriver.testCliDriver_correlationoptimizer11
          org.apache.hadoop.hive.cli.TestCliDriver.testCliDriver_correlationoptimizer12
          org.apache.hadoop.hive.cli.TestCliDriver.testCliDriver_correlationoptimizer13
          org.apache.hadoop.hive.cli.TestCliDriver.testCliDriver_correlationoptimizer14
          org.apache.hadoop.hive.cli.TestCliDriver.testCliDriver_correlationoptimizer15
          org.apache.hadoop.hive.cli.TestCliDriver.testCliDriver_correlationoptimizer2
          org.apache.hadoop.hive.cli.TestCliDriver.testCliDriver_correlationoptimizer3
          org.apache.hadoop.hive.cli.TestCliDriver.testCliDriver_correlationoptimizer4
          org.apache.hadoop.hive.cli.TestCliDriver.testCliDriver_correlationoptimizer6
          org.apache.hadoop.hive.cli.TestCliDriver.testCliDriver_correlationoptimizer7
          org.apache.hadoop.hive.cli.TestCliDriver.testCliDriver_correlationoptimizer8
          org.apache.hadoop.hive.cli.TestCliDriver.testCliDriver_correlationoptimizer9
          org.apache.hadoop.hive.cli.TestCliDriver.testCliDriver_count
          org.apache.hadoop.hive.cli.TestCliDriver.testCliDriver_create_genericudaf
          org.apache.hadoop.hive.cli.TestCliDriver.testCliDriver_create_view
          org.apache.hadoop.hive.cli.TestCliDriver.testCliDriver_cross_join
          org.apache.hadoop.hive.cli.TestCliDriver.testCliDriver_cross_product_check_1
          org.apache.hadoop.hive.cli.TestCliDriver.testCliDriver_cross_product_check_2
          org.apache.hadoop.hive.cli.TestCliDriver.testCliDriver_cte_1
          org.apache.hadoop.hive.cli.TestCliDriver.testCliDriver_decimal_precision
          org.apache.hadoop.hive.cli.TestCliDriver.testCliDriver_decimal_udf
          org.apache.hadoop.hive.cli.TestCliDriver.testCliDriver_distinct_stats
          org.apache.hadoop.hive.cli.TestCliDriver.testCliDriver_dynamic_partition_skip_default
          org.apache.hadoop.hive.cli.TestCliDriver.testCliDriver_escape_clusterby1
          org.apache.hadoop.hive.cli.TestCliDriver.testCliDriver_escape_distributeby1
          org.apache.hadoop.hive.cli.TestCliDriver.testCliDriver_escape_orderby1
          org.apache.hadoop.hive.cli.TestCliDriver.testCliDriver_escape_sortby1
          org.apache.hadoop.hive.cli.TestCliDriver.testCliDriver_explain_rearrange
          org.apache.hadoop.hive.cli.TestCliDriver.testCliDriver_filter_join_breaktask
          org.apache.hadoop.hive.cli.TestCliDriver.testCliDriver_filter_numeric
          org.apache.hadoop.hive.cli.TestCliDriver.testCliDriver_groupby2_limit
          org.apache.hadoop.hive.cli.TestCliDriver.testCliDriver_groupby_cube1
          org.apache.hadoop.hive.cli.TestCliDriver.testCliDriver_groupby_distinct_samekey
          org.apache.hadoop.hive.cli.TestCliDriver.testCliDriver_groupby_grouping_sets2
          org.apache.hadoop.hive.cli.TestCliDriver.testCliDriver_groupby_grouping_sets3
          org.apache.hadoop.hive.cli.TestCliDriver.testCliDriver_groupby_grouping_sets4
          org.apache.hadoop.hive.cli.TestCliDriver.testCliDriver_groupby_grouping_sets5
          org.apache.hadoop.hive.cli.TestCliDriver.testCliDriver_groupby_position
          org.apache.hadoop.hive.cli.TestCliDriver.testCliDriver_groupby_ppd
          org.apache.hadoop.hive.cli.TestCliDriver.testCliDriver_groupby_resolution
          org.apache.hadoop.hive.cli.TestCliDriver.testCliDriver_groupby_rollup1
          org.apache.hadoop.hive.cli.TestCliDriver.testCliDriver_groupby_sort_1
          org.apache.hadoop.hive.cli.TestCliDriver.testCliDriver_groupby_sort_10
          org.apache.hadoop.hive.cli.TestCliDriver.testCliDriver_groupby_sort_11
          org.apache.hadoop.hive.cli.TestCliDriver.testCliDriver_groupby_sort_8
          org.apache.hadoop.hive.cli.TestCliDriver.testCliDriver_groupby_sort_9
          org.apache.hadoop.hive.cli.TestCliDriver.testCliDriver_groupby_sort_skew_1
          org.apache.hadoop.hive.cli.TestCliDriver.testCliDriver_having
          org.apache.hadoop.hive.cli.TestCliDriver.testCliDriver_implicit_cast1
          org.apache.hadoop.hive.cli.TestCliDriver.testCliDriver_index_auto
          org.apache.hadoop.hive.cli.TestCliDriver.testCliDriver_index_auto_empty
          org.apache.hadoop.hive.cli.TestCliDriver.testCliDriver_index_auto_file_format
          org.apache.hadoop.hive.cli.TestCliDriver.testCliDriver_index_auto_mult_tables
          org.apache.hadoop.hive.cli.TestCliDriver.testCliDriver_index_auto_mult_tables_compact
          org.apache.hadoop.hive.cli.TestCliDriver.testCliDriver_index_auto_multiple
          org.apache.hadoop.hive.cli.TestCliDriver.testCliDriver_index_auto_partitioned
          org.apache.hadoop.hive.cli.TestCliDriver.testCliDriver_index_auto_self_join
          org.apache.hadoop.hive.cli.TestCliDriver.testCliDriver_index_auto_unused
          org.apache.hadoop.hive.cli.TestCliDriver.testCliDriver_index_auto_update
          org.apache.hadoop.hive.cli.TestCliDriver.testCliDriver_index_bitmap_auto_partitioned
          org.apache.hadoop.hive.cli.TestCliDriver.testCliDriver_index_bitmap_compression
          org.apache.hadoop.hive.cli.TestCliDriver.testCliDriver_index_compression
          org.apache.hadoop.hive.cli.TestCliDriver.testCliDriver_index_serde
          org.apache.hadoop.hive.cli.TestCliDriver.testCliDriver_index_stale
          org.apache.hadoop.hive.cli.TestCliDriver.testCliDriver_index_stale_partitioned
          org.apache.hadoop.hive.cli.TestCliDriver.testCliDriver_infer_const_type
          org.apache.hadoop.hive.cli.TestCliDriver.testCliDriver_innerjoin
          org.apache.hadoop.hive.cli.TestCliDriver.testCliDriver_input1
          org.apache.hadoop.hive.cli.TestCliDriver.testCliDriver_input10
          org.apache.hadoop.hive.cli.TestCliDriver.testCliDriver_input2
          org.apache.hadoop.hive.cli.TestCliDriver.testCliDriver_input21
          org.apache.hadoop.hive.cli.TestCliDriver.testCliDriver_input22
          org.apache.hadoop.hive.cli.TestCliDriver.testCliDriver_input23
          org.apache.hadoop.hive.cli.TestCliDriver.testCliDriver_input24
          org.apache.hadoop.hive.cli.TestCliDriver.testCliDriver_input25
          org.apache.hadoop.hive.cli.TestCliDriver.testCliDriver_input26
          org.apache.hadoop.hive.cli.TestCliDriver.testCliDriver_input2_limit
          org.apache.hadoop.hive.cli.TestCliDriver.testCliDriver_input39_hadoop20
          org.apache.hadoop.hive.cli.TestCliDriver.testCliDriver_input4
          org.apache.hadoop.hive.cli.TestCliDriver.testCliDriver_input42
          org.apache.hadoop.hive.cli.TestCliDriver.testCliDriver_input4_limit
          org.apache.hadoop.hive.cli.TestCliDriver.testCliDriver_input_part6
          org.apache.hadoop.hive.cli.TestCliDriver.testCliDriver_input_part7
          org.apache.hadoop.hive.cli.TestCliDriver.testCliDriver_input_part9
          org.apache.hadoop.hive.cli.TestCliDriver.testCliDriver_input_testxpath3
          org.apache.hadoop.hive.cli.TestCliDriver.testCliDriver_input_testxpath4
          org.apache.hadoop.hive.cli.TestCliDriver.testCliDriver_inputddl6
          org.apache.hadoop.hive.cli.TestCliDriver.testCliDriver_join0
          org.apache.hadoop.hive.cli.TestCliDriver.testCliDriver_join10
          org.apache.hadoop.hive.cli.TestCliDriver.testCliDriver_join11
          org.apache.hadoop.hive.cli.TestCliDriver.testCliDriver_join12
          org.apache.hadoop.hive.cli.TestCliDriver.testCliDriver_join13
          org.apache.hadoop.hive.cli.TestCliDriver.testCliDriver_join15
          org.apache.hadoop.hive.cli.TestCliDriver.testCliDriver_join16
          org.apache.hadoop.hive.cli.TestCliDriver.testCliDriver_join18
          org.apache.hadoop.hive.cli.TestCliDriver.testCliDriver_join18_multi_distinct
          org.apache.hadoop.hive.cli.TestCliDriver.testCliDriver_join19
          org.apache.hadoop.hive.cli.TestCliDriver.testCliDriver_join20
          org.apache.hadoop.hive.cli.TestCliDriver.testCliDriver_join21
          org.apache.hadoop.hive.cli.TestCliDriver.testCliDriver_join22
          org.apache.hadoop.hive.cli.TestCliDriver.testCliDriver_join23
          org.apache.hadoop.hive.cli.TestCliDriver.testCliDriver_join38
          org.apache.hadoop.hive.cli.TestCliDriver.testCliDriver_join40
          org.apache.hadoop.hive.cli.TestCliDriver.testCliDriver_join41
          org.apache.hadoop.hive.cli.TestCliDriver.testCliDriver_join_alt_syntax
          org.apache.hadoop.hive.cli.TestCliDriver.testCliDriver_join_cond_pushdown_1
          org.apache.hadoop.hive.cli.TestCliDriver.testCliDriver_join_cond_pushdown_2
          org.apache.hadoop.hive.cli.TestCliDriver.testCliDriver_join_cond_pushdown_3
          org.apache.hadoop.hive.cli.TestCliDriver.testCliDriver_join_cond_pushdown_4
          org.apache.hadoop.hive.cli.TestCliDriver.testCliDriver_join_cond_pushdown_unqual1
          org.apache.hadoop.hive.cli.TestCliDriver.testCliDriver_join_cond_pushdown_unqual2
          org.apache.hadoop.hive.cli.TestCliDriver.testCliDriver_join_cond_pushdown_unqual3
          org.apache.hadoop.hive.cli.TestCliDriver.testCliDriver_join_cond_pushdown_unqual4
          org.apache.hadoop.hive.cli.TestCliDriver.testCliDriver_join_filters_overlap
          org.apache.hadoop.hive.cli.TestCliDriver.testCliDriver_join_hive_626
          org.apache.hadoop.hive.cli.TestCliDriver.testCliDriver_join_merging
          org.apache.hadoop.hive.cli.TestCliDriver.testCliDriver_join_nullsafe
          org.apache.hadoop.hive.cli.TestCliDriver.testCliDriver_join_rc
          org.apache.hadoop.hive.cli.TestCliDriver.testCliDriver_join_reorder
          org.apache.hadoop.hive.cli.TestCliDriver.testCliDriver_join_reorder2
          org.apache.hadoop.hive.cli.TestCliDriver.testCliDriver_join_reorder3
          org.apache.hadoop.hive.cli.TestCliDriver.testCliDriver_join_reorder4
          org.apache.hadoop.hive.cli.TestCliDriver.testCliDriver_join_star
          org.apache.hadoop.hive.cli.TestCliDriver.testCliDriver_join_thrift
          org.apache.hadoop.hive.cli.TestCliDriver.testCliDriver_join_vc
          org.apache.hadoop.hive.cli.TestCliDriver.testCliDriver_join_view
          org.apache.hadoop.hive.cli.TestCliDriver.testCliDriver_keyword_1
          org.apache.hadoop.hive.cli.TestCliDriver.testCliDriver_lateral_view
          org.apache.hadoop.hive.cli.TestCliDriver.testCliDriver_lateral_view_cp
          org.apache.hadoop.hive.cli.TestCliDriver.testCliDriver_lateral_view_noalias
          org.apache.hadoop.hive.cli.TestCliDriver.testCliDriver_lateral_view_outer
          org.apache.hadoop.hive.cli.TestCliDriver.testCliDriver_lateral_view_ppd
          org.apache.hadoop.hive.cli.TestCliDriver.testCliDriver_limit_partition_metadataonly
          org.apache.hadoop.hive.cli.TestCliDriver.testCliDriver_limit_pushdown
          org.apache.hadoop.hive.cli.TestCliDriver.testCliDriver_limit_pushdown_negative
          org.apache.hadoop.hive.cli.TestCliDriver.testCliDriver_louter_join_ppr
          org.apache.hadoop.hive.cli.TestCliDriver.testCliDriver_mapjoin1
          org.apache.hadoop.hive.cli.TestCliDriver.testCliDriver_mapjoin_distinct
          org.apache.hadoop.hive.cli.TestCliDriver.testCliDriver_mapjoin_filter_on_outerjoin
          org.apache.hadoop.hive.cli.TestCliDriver.testCliDriver_mapjoin_mapjoin
          org.apache.hadoop.hive.cli.TestCliDriver.testCliDriver_mapjoin_memcheck
          org.apache.hadoop.hive.cli.TestCliDriver.testCliDriver_mapjoin_subquery
          org.apache.hadoop.hive.cli.TestCliDriver.testCliDriver_mapjoin_subquery2
          org.apache.hadoop.hive.cli.TestCliDriver.testCliDriver_mapjoin_test_outer
          org.apache.hadoop.hive.cli.TestCliDriver.testCliDriver_mergejoins
          org.apache.hadoop.hive.cli.TestCliDriver.testCliDriver_mergejoins_mixed
          org.apache.hadoop.hive.cli.TestCliDriver.testCliDriver_metadata_only_queries
          org.apache.hadoop.hive.cli.TestCliDriver.testCliDriver_metadata_only_queries_with_filters
          org.apache.hadoop.hive.cli.TestCliDriver.testCliDriver_metadataonly1
          org.apache.hadoop.hive.cli.TestCliDriver.testCliDriver_multiMapJoin1
          org.apache.hadoop.hive.cli.TestCliDriver.testCliDriver_multiMapJoin2
          org.apache.hadoop.hive.cli.TestCliDriver.testCliDriver_multi_join_union
          org.apache.hadoop.hive.cli.TestCliDriver.testCliDriver_no_hooks
          org.apache.hadoop.hive.cli.TestCliDriver.testCliDriver_noalias_subq1
          org.apache.hadoop.hive.cli.TestCliDriver.testCliDriver_nonblock_op_deduplicate
          org.apache.hadoop.hive.cli.TestCliDriver.testCliDriver_nonmr_fetch
          org.apache.hadoop.hive.cli.TestCliDriver.testCliDriver_nonmr_fetch_threshold
          org.apache.hadoop.hive.cli.TestCliDriver.testCliDriver_null_cast
          org.apache.hadoop.hive.cli.TestCliDriver.testCliDriver_nullgroup
          org.apache.hadoop.hive.cli.TestCliDriver.testCliDriver_nullgroup2
          org.apache.hadoop.hive.cli.TestCliDriver.testCliDriver_nullgroup3
          org.apache.hadoop.hive.cli.TestCliDriver.testCliDriver_nullgroup4
          org.apache.hadoop.hive.cli.TestCliDriver.testCliDriver_nullgroup4_multi_distinct
          org.apache.hadoop.hive.cli.TestCliDriver.testCliDriver_nullgroup5
          org.apache.hadoop.hive.cli.TestCliDriver.testCliDriver_nullscript
          org.apache.hadoop.hive.cli.TestCliDriver.testCliDriver_optional_outer
          org.apache.hadoop.hive.cli.TestCliDriver.testCliDriver_orc_createas1
          org.apache.hadoop.hive.cli.TestCliDriver.testCliDriver_orc_predicate_pushdown
          org.apache.hadoop.hive.cli.TestCliDriver.testCliDriver_order
          org.apache.hadoop.hive.cli.TestCliDriver.testCliDriver_order2
          org.apache.hadoop.hive.cli.TestCliDriver.testCliDriver_outer_join_ppr
          org.apache.hadoop.hive.cli.TestCliDriver.testCliDriver_partition_wise_fileformat2
          org.apache.hadoop.hive.cli.TestCliDriver.testCliDriver_pcr
          org.apache.hadoop.hive.cli.TestCliDriver.testCliDriver_plan_json
          org.apache.hadoop.hive.cli.TestCliDriver.testCliDriver_ppd1
          org.apache.hadoop.hive.cli.TestCliDriver.testCliDriver_ppd2
          org.apache.hadoop.hive.cli.TestCliDriver.testCliDriver_ppd_clusterby
          org.apache.hadoop.hive.cli.TestCliDriver.testCliDriver_ppd_constant_where
          org.apache.hadoop.hive.cli.TestCliDriver.testCliDriver_ppd_gby
          org.apache.hadoop.hive.cli.TestCliDriver.testCliDriver_ppd_gby2
          org.apache.hadoop.hive.cli.TestCliDriver.testCliDriver_ppd_gby_join
          org.apache.hadoop.hive.cli.TestCliDriver.testCliDriver_ppd_join
          org.apache.hadoop.hive.cli.TestCliDriver.testCliDriver_ppd_join2
          org.apache.hadoop.hive.cli.TestCliDriver.testCliDriver_ppd_join3
          org.apache.hadoop.hive.cli.TestCliDriver.testCliDriver_ppd_join4
          org.apache.hadoop.hive.cli.TestCliDriver.testCliDriver_ppd_join_filter
          org.apache.hadoop.hive.cli.TestCliDriver.testCliDriver_ppd_outer_join1
          org.apache.hadoop.hive.cli.TestCliDriver.testCliDriver_ppd_outer_join2
          org.apache.hadoop.hive.cli.TestCliDriver.testCliDriver_ppd_outer_join3
          org.apache.hadoop.hive.cli.TestCliDriver.testCliDriver_ppd_outer_join4
          org.apache.hadoop.hive.cli.TestCliDriver.testCliDriver_ppd_outer_join5
          org.apache.hadoop.hive.cli.TestCliDriver.testCliDriver_ppd_random
          org.apache.hadoop.hive.cli.TestCliDriver.testCliDriver_ppd_repeated_alias
          org.apache.hadoop.hive.cli.TestCliDriver.testCliDriver_ppd_transform
          org.apache.hadoop.hive.cli.TestCliDriver.testCliDriver_ppd_udf_case
          org.apache.hadoop.hive.cli.TestCliDriver.testCliDriver_ppd_udf_col
          org.apache.hadoop.hive.cli.TestCliDriver.testCliDriver_ppd_udtf
          org.apache.hadoop.hive.cli.TestCliDriver.testCliDriver_ppd_union
          org.apache.hadoop.hive.cli.TestCliDriver.testCliDriver_ppd_union_view
          org.apache.hadoop.hive.cli.TestCliDriver.testCliDriver_ppd_vc
          org.apache.hadoop.hive.cli.TestCliDriver.testCliDriver_ppr_allchildsarenull
          org.apache.hadoop.hive.cli.TestCliDriver.testCliDriver_ppr_pushdown3
          org.apache.hadoop.hive.cli.TestCliDriver.testCliDriver_push_or
          org.apache.hadoop.hive.cli.TestCliDriver.testCliDriver_query_result_fileformat
          org.apache.hadoop.hive.cli.TestCliDriver.testCliDriver_quote1
          org.apache.hadoop.hive.cli.TestCliDriver.testCliDriver_quotedid_basic
          org.apache.hadoop.hive.cli.TestCliDriver.testCliDriver_quotedid_partition
          org.apache.hadoop.hive.cli.TestCliDriver.testCliDriver_quotedid_skew
          org.apache.hadoop.hive.cli.TestCliDriver.testCliDriver_rand_partitionpruner1
          org.apache.hadoop.hive.cli.TestCliDriver.testCliDriver_rand_partitionpruner3
          org.apache.hadoop.hive.cli.TestCliDriver.testCliDriver_reduce_deduplicate_exclude_join
          org.apache.hadoop.hive.cli.TestCliDriver.testCliDriver_reduce_deduplicate_extended
          org.apache.hadoop.hive.cli.TestCliDriver.testCliDriver_regex_col
          org.apache.hadoop.hive.cli.TestCliDriver.testCliDriver_regexp_extract
          org.apache.hadoop.hive.cli.TestCliDriver.testCliDriver_router_join_ppr
          org.apache.hadoop.hive.cli.TestCliDriver.testCliDriver_sample10
          org.apache.hadoop.hive.cli.TestCliDriver.testCliDriver_sample3
          org.apache.hadoop.hive.cli.TestCliDriver.testCliDriver_sample6
          org.apache.hadoop.hive.cli.TestCliDriver.testCliDriver_sample8
          org.apache.hadoop.hive.cli.TestCliDriver.testCliDriver_sample9
          org.apache.hadoop.hive.cli.TestCliDriver.testCliDriver_script_pipe
          org.apache.hadoop.hive.cli.TestCliDriver.testCliDriver_select_as_omitted
          org.apache.hadoop.hive.cli.TestCliDriver.testCliDriver_select_dummy_source
          org.apache.hadoop.hive.cli.TestCliDriver.testCliDriver_select_transform_hint
          org.apache.hadoop.hive.cli.TestCliDriver.testCliDriver_select_unquote_and
          org.apache.hadoop.hive.cli.TestCliDriver.testCliDriver_select_unquote_not
          org.apache.hadoop.hive.cli.TestCliDriver.testCliDriver_select_unquote_or
          org.apache.hadoop.hive.cli.TestCliDriver.testCliDriver_semijoin
          org.apache.hadoop.hive.cli.TestCliDriver.testCliDriver_serde_user_properties
          org.apache.hadoop.hive.cli.TestCliDriver.testCliDriver_set_processor_namespaces
          org.apache.hadoop.hive.cli.TestCliDriver.testCliDriver_set_variable_sub
          org.apache.hadoop.hive.cli.TestCliDriver.testCliDriver_show_columns
          org.apache.hadoop.hive.cli.TestCliDriver.testCliDriver_show_indexes_edge_cases
          org.apache.hadoop.hive.cli.TestCliDriver.testCliDriver_show_indexes_syntax
          org.apache.hadoop.hive.cli.TestCliDriver.testCliDriver_show_tables
          org.apache.hadoop.hive.cli.TestCliDriver.testCliDriver_show_tablestatus
          org.apache.hadoop.hive.cli.TestCliDriver.testCliDriver_showparts
          org.apache.hadoop.hive.cli.TestCliDriver.testCliDriver_skewjoin
          org.apache.hadoop.hive.cli.TestCliDriver.testCliDriver_skewjoinopt1
          org.apache.hadoop.hive.cli.TestCliDriver.testCliDriver_skewjoinopt10
          org.apache.hadoop.hive.cli.TestCliDriver.testCliDriver_skewjoinopt11
          org.apache.hadoop.hive.cli.TestCliDriver.testCliDriver_skewjoinopt12
          org.apache.hadoop.hive.cli.TestCliDriver.testCliDriver_skewjoinopt13
          org.apache.hadoop.hive.cli.TestCliDriver.testCliDriver_skewjoinopt14
          org.apache.hadoop.hive.cli.TestCliDriver.testCliDriver_skewjoinopt15
          org.apache.hadoop.hive.cli.TestCliDriver.testCliDriver_skewjoinopt16
          org.apache.hadoop.hive.cli.TestCliDriver.testCliDriver_skewjoinopt17
          org.apache.hadoop.hive.cli.TestCliDriver.testCliDriver_skewjoinopt18
          org.apache.hadoop.hive.cli.TestCliDriver.testCliDriver_skewjoinopt19
          org.apache.hadoop.hive.cli.TestCliDriver.testCliDriver_skewjoinopt2
          org.apache.hadoop.hive.cli.TestCliDriver.testCliDriver_skewjoinopt20
          org.apache.hadoop.hive.cli.TestCliDriver.testCliDriver_skewjoinopt3
          org.apache.hadoop.hive.cli.TestCliDriver.testCliDriver_skewjoinopt4
          org.apache.hadoop.hive.cli.TestCliDriver.testCliDriver_skewjoinopt5
          org.apache.hadoop.hive.cli.TestCliDriver.testCliDriver_skewjoinopt6
          org.apache.hadoop.hive.cli.TestCliDriver.testCliDriver_skewjoinopt7
          org.apache.hadoop.hive.cli.TestCliDriver.testCliDriver_skewjoinopt8
          org.apache.hadoop.hive.cli.TestCliDriver.testCliDriver_skewjoinopt9
          org.apache.hadoop.hive.cli.TestCliDriver.testCliDriver_smb_mapjoin9
          org.apache.hadoop.hive.cli.TestCliDriver.testCliDriver_smb_mapjoin_1
          org.apache.hadoop.hive.cli.TestCliDriver.testCliDriver_smb_mapjoin_10
          org.apache.hadoop.hive.cli.TestCliDriver.testCliDriver_smb_mapjoin_13
          org.apache.hadoop.hive.cli.TestCliDriver.testCliDriver_smb_mapjoin_14
          org.apache.hadoop.hive.cli.TestCliDriver.testCliDriver_smb_mapjoin_15
          org.apache.hadoop.hive.cli.TestCliDriver.testCliDriver_smb_mapjoin_16
          org.apache.hadoop.hive.cli.TestCliDriver.testCliDriver_smb_mapjoin_17
          org.apache.hadoop.hive.cli.TestCliDriver.testCliDriver_smb_mapjoin_2
          org.apache.hadoop.hive.cli.TestCliDriver.testCliDriver_smb_mapjoin_25
          org.apache.hadoop.hive.cli.TestCliDriver.testCliDriver_smb_mapjoin_3
          org.apache.hadoop.hive.cli.TestCliDriver.testCliDriver_smb_mapjoin_4
          org.apache.hadoop.hive.cli.TestCliDriver.testCliDriver_smb_mapjoin_5
          org.apache.hadoop.hive.cli.TestCliDriver.testCliDriver_smb_mapjoin_6
          org.apache.hadoop.hive.cli.TestCliDriver.testCliDriver_sort
          org.apache.hadoop.hive.cli.TestCliDriver.testCliDriver_sort_merge_join_desc_1
          org.apache.hadoop.hive.cli.TestCliDriver.testCliDriver_sort_merge_join_desc_2
          org.apache.hadoop.hive.cli.TestCliDriver.testCliDriver_sort_merge_join_desc_3
          org.apache.hadoop.hive.cli.TestCliDriver.testCliDriver_sort_merge_join_desc_4
          org.apache.hadoop.hive.cli.TestCliDriver.testCliDriver_sort_merge_join_desc_5
          org.apache.hadoop.hive.cli.TestCliDriver.testCliDriver_sort_merge_join_desc_6
          org.apache.hadoop.hive.cli.TestCliDriver.testCliDriver_sort_merge_join_desc_7
          org.apache.hadoop.hive.cli.TestCliDriver.testCliDriver_stats_only_null
          org.apache.hadoop.hive.cli.TestCliDriver.testCliDriver_str_to_map
          org.apache.hadoop.hive.cli.TestCliDriver.testCliDriver_subq2
          org.apache.hadoop.hive.cli.TestCliDriver.testCliDriver_subq_where_serialization
          org.apache.hadoop.hive.cli.TestCliDriver.testCliDriver_subquery_alias
          org.apache.hadoop.hive.cli.TestCliDriver.testCliDriver_subquery_exists
          org.apache.hadoop.hive.cli.TestCliDriver.testCliDriver_subquery_exists_having
          org.apache.hadoop.hive.cli.TestCliDriver.testCliDriver_subquery_in
          org.apache.hadoop.hive.cli.TestCliDriver.testCliDriver_subquery_in_having
          org.apache.hadoop.hive.cli.TestCliDriver.testCliDriver_subquery_notexists
          org.apache.hadoop.hive.cli.TestCliDriver.testCliDriver_subquery_notexists_having
          org.apache.hadoop.hive.cli.TestCliDriver.testCliDriver_subquery_notin
          org.apache.hadoop.hive.cli.TestCliDriver.testCliDriver_subquery_notin_having
          org.apache.hadoop.hive.cli.TestCliDriver.testCliDriver_subquery_unqualcolumnrefs
          org.apache.hadoop.hive.cli.TestCliDriver.testCliDriver_symlink_text_input_format
          org.apache.hadoop.hive.cli.TestCliDriver.testCliDriver_transform1
          org.apache.hadoop.hive.cli.TestCliDriver.testCliDriver_transform_ppr1
          org.apache.hadoop.hive.cli.TestCliDriver.testCliDriver_transform_ppr2
          org.apache.hadoop.hive.cli.TestCliDriver.testCliDriver_type_widening
          org.apache.hadoop.hive.cli.TestCliDriver.testCliDriver_udaf_number_format
          org.apache.hadoop.hive.cli.TestCliDriver.testCliDriver_udf2
          org.apache.hadoop.hive.cli.TestCliDriver.testCliDriver_udf4
          org.apache.hadoop.hive.cli.TestCliDriver.testCliDriver_udf5
          org.apache.hadoop.hive.cli.TestCliDriver.testCliDriver_udf6
          org.apache.hadoop.hive.cli.TestCliDriver.testCliDriver_udf7
          org.apache.hadoop.hive.cli.TestCliDriver.testCliDriver_udf8
          org.apache.hadoop.hive.cli.TestCliDriver.testCliDriver_udf9
          org.apache.hadoop.hive.cli.TestCliDriver.testCliDriver_udf_case_column_pruning
          org.apache.hadoop.hive.cli.TestCliDriver.testCliDriver_udf_count
          org.apache.hadoop.hive.cli.TestCliDriver.testCliDriver_udf_current_database
          org.apache.hadoop.hive.cli.TestCliDriver.testCliDriver_udf_explode
          org.apache.hadoop.hive.cli.TestCliDriver.testCliDriver_udf_in_file
          org.apache.hadoop.hive.cli.TestCliDriver.testCliDriver_udf_inline
          org.apache.hadoop.hive.cli.TestCliDriver.testCliDriver_udf_lower
          org.apache.hadoop.hive.cli.TestCliDriver.testCliDriver_udf_minute
          org.apache.hadoop.hive.cli.TestCliDriver.testCliDriver_udf_parse_url
          org.apache.hadoop.hive.cli.TestCliDriver.testCliDriver_udf_reflect2
          org.apache.hadoop.hive.cli.TestCliDriver.testCliDriver_udf_to_unix_timestamp
          org.apache.hadoop.hive.cli.TestCliDriver.testCliDriver_udtf_explode
          org.apache.hadoop.hive.cli.TestCliDriver.testCliDriver_udtf_json_tuple
          org.apache.hadoop.hive.cli.TestCliDriver.testCliDriver_udtf_parse_url_tuple
          org.apache.hadoop.hive.cli.TestCliDriver.testCliDriver_udtf_stack
          org.apache.hadoop.hive.cli.TestCliDriver.testCliDriver_union11
          org.apache.hadoop.hive.cli.TestCliDriver.testCliDriver_union13
          org.apache.hadoop.hive.cli.TestCliDriver.testCliDriver_union14
          org.apache.hadoop.hive.cli.TestCliDriver.testCliDriver_union15
          org.apache.hadoop.hive.cli.TestCliDriver.testCliDriver_union16
          org.apache.hadoop.hive.cli.TestCliDriver.testCliDriver_union2
          org.apache.hadoop.hive.cli.TestCliDriver.testCliDriver_union20
          org.apache.hadoop.hive.cli.TestCliDriver.testCliDriver_union21
          org.apache.hadoop.hive.cli.TestCliDriver.testCliDriver_union23
          org.apache.hadoop.hive.cli.TestCliDriver.testCliDriver_union24
          org.apache.hadoop.hive.cli.TestCliDriver.testCliDriver_union26
          org.apache.hadoop.hive.cli.TestCliDriver.testCliDriver_union3
          org.apache.hadoop.hive.cli.TestCliDriver.testCliDriver_union32
          org.apache.hadoop.hive.cli.TestCliDriver.testCliDriver_union34
          org.apache.hadoop.hive.cli.TestCliDriver.testCliDriver_union5
          org.apache.hadoop.hive.cli.TestCliDriver.testCliDriver_union7
          org.apache.hadoop.hive.cli.TestCliDriver.testCliDriver_union8
          org.apache.hadoop.hive.cli.TestCliDriver.testCliDriver_union9
          org.apache.hadoop.hive.cli.TestCliDriver.testCliDriver_union_ppr
          org.apache.hadoop.hive.cli.TestCliDriver.testCliDriver_union_top_level
          org.apache.hadoop.hive.cli.TestCliDriver.testCliDriver_union_view
          org.apache.hadoop.hive.cli.TestCliDriver.testCliDriver_vector_between_in
          org.apache.hadoop.hive.cli.TestCliDriver.testCliDriver_vector_coalesce
          org.apache.hadoop.hive.cli.TestCliDriver.testCliDriver_vector_decimal_aggregate
          org.apache.hadoop.hive.cli.TestCliDriver.testCliDriver_vector_decimal_cast
          org.apache.hadoop.hive.cli.TestCliDriver.testCliDriver_vector_decimal_expressions
          org.apache.hadoop.hive.cli.TestCliDriver.testCliDriver_vector_decimal_mapjoin
          org.apache.hadoop.hive.cli.TestCliDriver.testCliDriver_vector_decimal_math_funcs
          org.apache.hadoop.hive.cli.TestCliDriver.testCliDriver_vector_left_outer_join
          org.apache.hadoop.hive.cli.TestCliDriver.testCliDriver_vector_non_string_partition
          org.apache.hadoop.hive.cli.TestCliDriver.testCliDriver_vectorization_decimal_date
          org.apache.hadoop.hive.cli.TestCliDriver.testCliDriver_vectorization_div0
          org.apache.hadoop.hive.cli.TestCliDriver.testCliDriver_vectorization_limit
          org.apache.hadoop.hive.cli.TestCliDriver.testCliDriver_vectorization_part_project
          org.apache.hadoop.hive.cli.TestCliDriver.testCliDriver_vectorization_pushdown
          org.apache.hadoop.hive.cli.TestCliDriver.testCliDriver_vectorization_short_regress
          org.apache.hadoop.hive.cli.TestCliDriver.testCliDriver_vectorized_bucketmapjoin1
          org.apache.hadoop.hive.cli.TestCliDriver.testCliDriver_vectorized_case
          org.apache.hadoop.hive.cli.TestCliDriver.testCliDriver_vectorized_casts
          org.apache.hadoop.hive.cli.TestCliDriver.testCliDriver_vectorized_context
          org.apache.hadoop.hive.cli.TestCliDriver.testCliDriver_vectorized_date_funcs
          org.apache.hadoop.hive.cli.TestCliDriver.testCliDriver_vectorized_distinct_gby
          org.apache.hadoop.hive.cli.TestCliDriver.testCliDriver_vectorized_mapjoin
          org.apache.hadoop.hive.cli.TestCliDriver.testCliDriver_vectorized_math_funcs
          org.apache.hadoop.hive.cli.TestCliDriver.testCliDriver_vectorized_nested_mapjoin
          org.apache.hadoop.hive.cli.TestCliDriver.testCliDriver_vectorized_parquet
          org.apache.hadoop.hive.cli.TestCliDriver.testCliDriver_vectorized_shufflejoin
          org.apache.hadoop.hive.cli.TestCliDriver.testCliDriver_vectorized_string_funcs
          org.apache.hadoop.hive.cli.TestCliDriver.testCliDriver_vectorized_timestamp_funcs
          org.apache.hadoop.hive.cli.TestContribCliDriver.testCliDriver_dboutput
          org.apache.hadoop.hive.cli.TestContribCliDriver.testCliDriver_udaf_example_avg
          org.apache.hadoop.hive.cli.TestContribCliDriver.testCliDriver_udaf_example_group_concat
          org.apache.hadoop.hive.cli.TestContribCliDriver.testCliDriver_udaf_example_max
          org.apache.hadoop.hive.cli.TestContribCliDriver.testCliDriver_udaf_example_max_n
          org.apache.hadoop.hive.cli.TestContribCliDriver.testCliDriver_udaf_example_min
          org.apache.hadoop.hive.cli.TestContribCliDriver.testCliDriver_udaf_example_min_n
          org.apache.hadoop.hive.cli.TestContribCliDriver.testCliDriver_udf_example_add
          org.apache.hadoop.hive.cli.TestContribCliDriver.testCliDriver_udf_example_arraymapstruct
          org.apache.hadoop.hive.cli.TestContribCliDriver.testCliDriver_udf_example_format
          org.apache.hadoop.hive.cli.TestContribCliDriver.testCliDriver_udf_row_sequence
          org.apache.hadoop.hive.cli.TestHBaseCliDriver.testCliDriver_external_table_ppd
          org.apache.hadoop.hive.cli.TestHBaseCliDriver.testCliDriver_hbase_ppd_key_range
          org.apache.hadoop.hive.cli.TestHBaseCliDriver.testCliDriver_hbase_pushdown
          org.apache.hadoop.hive.cli.TestHBaseCliDriver.testCliDriver_hbase_queries
          org.apache.hadoop.hive.cli.TestHBaseCliDriver.testCliDriver_ppd_key_ranges
          org.apache.hadoop.hive.cli.TestMinimrCliDriver.testCliDriver_auto_sortmerge_join_16
          org.apache.hadoop.hive.cli.TestMinimrCliDriver.testCliDriver_bucket4
          org.apache.hadoop.hive.cli.TestMinimrCliDriver.testCliDriver_bucketizedhiveinputformat
          org.apache.hadoop.hive.cli.TestMinimrCliDriver.testCliDriver_bucketmapjoin6
          org.apache.hadoop.hive.cli.TestMinimrCliDriver.testCliDriver_bucketmapjoin7
          org.apache.hadoop.hive.cli.TestMinimrCliDriver.testCliDriver_disable_merge_for_bucketing
          org.apache.hadoop.hive.cli.TestNegativeCliDriver.testNegativeCliDriver_bucket_mapjoin_mismatch1
          org.apache.hadoop.hive.cli.TestNegativeCliDriver.testNegativeCliDriver_limit_partition_stats
          org.apache.hadoop.hive.cli.TestNegativeCliDriver.testNegativeCliDriver_script_error
          org.apache.hadoop.hive.cli.TestNegativeCliDriver.testNegativeCliDriver_sortmerge_mapjoin_mismatch_1
          org.apache.hadoop.hive.cli.TestNegativeCliDriver.testNegativeCliDriver_udf_assert_true
          org.apache.hadoop.hive.cli.TestNegativeCliDriver.testNegativeCliDriver_udf_assert_true2
          org.apache.hadoop.hive.cli.TestNegativeMinimrCliDriver.testNegativeCliDriver_mapreduce_stack_trace_hadoop20
          org.apache.hadoop.hive.ql.TestMTQueries.testMTQueries1
          

          Test results: http://bigtop01.cloudera.org:8080/job/PreCommit-HIVE-Build/2233/testReport
          Console output: http://bigtop01.cloudera.org:8080/job/PreCommit-HIVE-Build/2233/console

          Messages:

          Executing org.apache.hive.ptest.execution.PrepPhase
          Executing org.apache.hive.ptest.execution.ExecutionPhase
          Executing org.apache.hive.ptest.execution.ReportingPhase
          Tests exited with: TestsFailedException: 476 tests failed
          

          This message is automatically generated.

          ATTACHMENT ID: 12639911

          Show
          Hive QA added a comment - Overall : -1 at least one tests failed Here are the results of testing the latest attachment: https://issues.apache.org/jira/secure/attachment/12639911/HIVE-6901.patch ERROR: -1 due to 476 failed/errored test(s), 5615 tests executed Failed tests: org.apache.hadoop.hive.cli.TestCliDriver.testCliDriver_alias_casted_column org.apache.hadoop.hive.cli.TestCliDriver.testCliDriver_allcolref_in_udf org.apache.hadoop.hive.cli.TestCliDriver.testCliDriver_ambiguous_col org.apache.hadoop.hive.cli.TestCliDriver.testCliDriver_annotate_stats_filter org.apache.hadoop.hive.cli.TestCliDriver.testCliDriver_annotate_stats_groupby org.apache.hadoop.hive.cli.TestCliDriver.testCliDriver_annotate_stats_join org.apache.hadoop.hive.cli.TestCliDriver.testCliDriver_annotate_stats_part org.apache.hadoop.hive.cli.TestCliDriver.testCliDriver_annotate_stats_select org.apache.hadoop.hive.cli.TestCliDriver.testCliDriver_annotate_stats_table org.apache.hadoop.hive.cli.TestCliDriver.testCliDriver_annotate_stats_union org.apache.hadoop.hive.cli.TestCliDriver.testCliDriver_ansi_sql_arithmetic org.apache.hadoop.hive.cli.TestCliDriver.testCliDriver_auto_join0 org.apache.hadoop.hive.cli.TestCliDriver.testCliDriver_auto_join10 org.apache.hadoop.hive.cli.TestCliDriver.testCliDriver_auto_join11 org.apache.hadoop.hive.cli.TestCliDriver.testCliDriver_auto_join12 org.apache.hadoop.hive.cli.TestCliDriver.testCliDriver_auto_join13 org.apache.hadoop.hive.cli.TestCliDriver.testCliDriver_auto_join15 org.apache.hadoop.hive.cli.TestCliDriver.testCliDriver_auto_join16 org.apache.hadoop.hive.cli.TestCliDriver.testCliDriver_auto_join18 org.apache.hadoop.hive.cli.TestCliDriver.testCliDriver_auto_join18_multi_distinct org.apache.hadoop.hive.cli.TestCliDriver.testCliDriver_auto_join20 org.apache.hadoop.hive.cli.TestCliDriver.testCliDriver_auto_join21 org.apache.hadoop.hive.cli.TestCliDriver.testCliDriver_auto_join22 org.apache.hadoop.hive.cli.TestCliDriver.testCliDriver_auto_join23 org.apache.hadoop.hive.cli.TestCliDriver.testCliDriver_auto_join24 org.apache.hadoop.hive.cli.TestCliDriver.testCliDriver_auto_join27 org.apache.hadoop.hive.cli.TestCliDriver.testCliDriver_auto_join28 org.apache.hadoop.hive.cli.TestCliDriver.testCliDriver_auto_join29 org.apache.hadoop.hive.cli.TestCliDriver.testCliDriver_auto_join30 org.apache.hadoop.hive.cli.TestCliDriver.testCliDriver_auto_join31 org.apache.hadoop.hive.cli.TestCliDriver.testCliDriver_auto_join32 org.apache.hadoop.hive.cli.TestCliDriver.testCliDriver_auto_join_reordering_values org.apache.hadoop.hive.cli.TestCliDriver.testCliDriver_auto_join_without_localtask org.apache.hadoop.hive.cli.TestCliDriver.testCliDriver_auto_smb_mapjoin_14 org.apache.hadoop.hive.cli.TestCliDriver.testCliDriver_auto_sortmerge_join_1 org.apache.hadoop.hive.cli.TestCliDriver.testCliDriver_auto_sortmerge_join_10 org.apache.hadoop.hive.cli.TestCliDriver.testCliDriver_auto_sortmerge_join_11 org.apache.hadoop.hive.cli.TestCliDriver.testCliDriver_auto_sortmerge_join_12 org.apache.hadoop.hive.cli.TestCliDriver.testCliDriver_auto_sortmerge_join_14 org.apache.hadoop.hive.cli.TestCliDriver.testCliDriver_auto_sortmerge_join_15 org.apache.hadoop.hive.cli.TestCliDriver.testCliDriver_auto_sortmerge_join_2 org.apache.hadoop.hive.cli.TestCliDriver.testCliDriver_auto_sortmerge_join_3 org.apache.hadoop.hive.cli.TestCliDriver.testCliDriver_auto_sortmerge_join_4 org.apache.hadoop.hive.cli.TestCliDriver.testCliDriver_auto_sortmerge_join_5 org.apache.hadoop.hive.cli.TestCliDriver.testCliDriver_auto_sortmerge_join_6 org.apache.hadoop.hive.cli.TestCliDriver.testCliDriver_auto_sortmerge_join_7 org.apache.hadoop.hive.cli.TestCliDriver.testCliDriver_auto_sortmerge_join_8 org.apache.hadoop.hive.cli.TestCliDriver.testCliDriver_auto_sortmerge_join_9 org.apache.hadoop.hive.cli.TestCliDriver.testCliDriver_binarysortable_1 org.apache.hadoop.hive.cli.TestCliDriver.testCliDriver_bucket2 org.apache.hadoop.hive.cli.TestCliDriver.testCliDriver_bucket3 org.apache.hadoop.hive.cli.TestCliDriver.testCliDriver_bucket_groupby org.apache.hadoop.hive.cli.TestCliDriver.testCliDriver_bucket_map_join_1 org.apache.hadoop.hive.cli.TestCliDriver.testCliDriver_bucket_map_join_2 org.apache.hadoop.hive.cli.TestCliDriver.testCliDriver_bucketcontext_1 org.apache.hadoop.hive.cli.TestCliDriver.testCliDriver_bucketcontext_2 org.apache.hadoop.hive.cli.TestCliDriver.testCliDriver_bucketcontext_3 org.apache.hadoop.hive.cli.TestCliDriver.testCliDriver_bucketcontext_4 org.apache.hadoop.hive.cli.TestCliDriver.testCliDriver_bucketcontext_5 org.apache.hadoop.hive.cli.TestCliDriver.testCliDriver_bucketcontext_6 org.apache.hadoop.hive.cli.TestCliDriver.testCliDriver_bucketcontext_7 org.apache.hadoop.hive.cli.TestCliDriver.testCliDriver_bucketcontext_8 org.apache.hadoop.hive.cli.TestCliDriver.testCliDriver_bucketmapjoin1 org.apache.hadoop.hive.cli.TestCliDriver.testCliDriver_bucketmapjoin10 org.apache.hadoop.hive.cli.TestCliDriver.testCliDriver_bucketmapjoin11 org.apache.hadoop.hive.cli.TestCliDriver.testCliDriver_bucketmapjoin12 org.apache.hadoop.hive.cli.TestCliDriver.testCliDriver_bucketmapjoin13 org.apache.hadoop.hive.cli.TestCliDriver.testCliDriver_bucketmapjoin8 org.apache.hadoop.hive.cli.TestCliDriver.testCliDriver_bucketmapjoin9 org.apache.hadoop.hive.cli.TestCliDriver.testCliDriver_bucketmapjoin_negative3 org.apache.hadoop.hive.cli.TestCliDriver.testCliDriver_cluster org.apache.hadoop.hive.cli.TestCliDriver.testCliDriver_column_access_stats org.apache.hadoop.hive.cli.TestCliDriver.testCliDriver_combine2_hadoop20 org.apache.hadoop.hive.cli.TestCliDriver.testCliDriver_correlationoptimizer1 org.apache.hadoop.hive.cli.TestCliDriver.testCliDriver_correlationoptimizer10 org.apache.hadoop.hive.cli.TestCliDriver.testCliDriver_correlationoptimizer11 org.apache.hadoop.hive.cli.TestCliDriver.testCliDriver_correlationoptimizer12 org.apache.hadoop.hive.cli.TestCliDriver.testCliDriver_correlationoptimizer13 org.apache.hadoop.hive.cli.TestCliDriver.testCliDriver_correlationoptimizer14 org.apache.hadoop.hive.cli.TestCliDriver.testCliDriver_correlationoptimizer15 org.apache.hadoop.hive.cli.TestCliDriver.testCliDriver_correlationoptimizer2 org.apache.hadoop.hive.cli.TestCliDriver.testCliDriver_correlationoptimizer3 org.apache.hadoop.hive.cli.TestCliDriver.testCliDriver_correlationoptimizer4 org.apache.hadoop.hive.cli.TestCliDriver.testCliDriver_correlationoptimizer6 org.apache.hadoop.hive.cli.TestCliDriver.testCliDriver_correlationoptimizer7 org.apache.hadoop.hive.cli.TestCliDriver.testCliDriver_correlationoptimizer8 org.apache.hadoop.hive.cli.TestCliDriver.testCliDriver_correlationoptimizer9 org.apache.hadoop.hive.cli.TestCliDriver.testCliDriver_count org.apache.hadoop.hive.cli.TestCliDriver.testCliDriver_create_genericudaf org.apache.hadoop.hive.cli.TestCliDriver.testCliDriver_create_view org.apache.hadoop.hive.cli.TestCliDriver.testCliDriver_cross_join org.apache.hadoop.hive.cli.TestCliDriver.testCliDriver_cross_product_check_1 org.apache.hadoop.hive.cli.TestCliDriver.testCliDriver_cross_product_check_2 org.apache.hadoop.hive.cli.TestCliDriver.testCliDriver_cte_1 org.apache.hadoop.hive.cli.TestCliDriver.testCliDriver_decimal_precision org.apache.hadoop.hive.cli.TestCliDriver.testCliDriver_decimal_udf org.apache.hadoop.hive.cli.TestCliDriver.testCliDriver_distinct_stats org.apache.hadoop.hive.cli.TestCliDriver.testCliDriver_dynamic_partition_skip_default org.apache.hadoop.hive.cli.TestCliDriver.testCliDriver_escape_clusterby1 org.apache.hadoop.hive.cli.TestCliDriver.testCliDriver_escape_distributeby1 org.apache.hadoop.hive.cli.TestCliDriver.testCliDriver_escape_orderby1 org.apache.hadoop.hive.cli.TestCliDriver.testCliDriver_escape_sortby1 org.apache.hadoop.hive.cli.TestCliDriver.testCliDriver_explain_rearrange org.apache.hadoop.hive.cli.TestCliDriver.testCliDriver_filter_join_breaktask org.apache.hadoop.hive.cli.TestCliDriver.testCliDriver_filter_numeric org.apache.hadoop.hive.cli.TestCliDriver.testCliDriver_groupby2_limit org.apache.hadoop.hive.cli.TestCliDriver.testCliDriver_groupby_cube1 org.apache.hadoop.hive.cli.TestCliDriver.testCliDriver_groupby_distinct_samekey org.apache.hadoop.hive.cli.TestCliDriver.testCliDriver_groupby_grouping_sets2 org.apache.hadoop.hive.cli.TestCliDriver.testCliDriver_groupby_grouping_sets3 org.apache.hadoop.hive.cli.TestCliDriver.testCliDriver_groupby_grouping_sets4 org.apache.hadoop.hive.cli.TestCliDriver.testCliDriver_groupby_grouping_sets5 org.apache.hadoop.hive.cli.TestCliDriver.testCliDriver_groupby_position org.apache.hadoop.hive.cli.TestCliDriver.testCliDriver_groupby_ppd org.apache.hadoop.hive.cli.TestCliDriver.testCliDriver_groupby_resolution org.apache.hadoop.hive.cli.TestCliDriver.testCliDriver_groupby_rollup1 org.apache.hadoop.hive.cli.TestCliDriver.testCliDriver_groupby_sort_1 org.apache.hadoop.hive.cli.TestCliDriver.testCliDriver_groupby_sort_10 org.apache.hadoop.hive.cli.TestCliDriver.testCliDriver_groupby_sort_11 org.apache.hadoop.hive.cli.TestCliDriver.testCliDriver_groupby_sort_8 org.apache.hadoop.hive.cli.TestCliDriver.testCliDriver_groupby_sort_9 org.apache.hadoop.hive.cli.TestCliDriver.testCliDriver_groupby_sort_skew_1 org.apache.hadoop.hive.cli.TestCliDriver.testCliDriver_having org.apache.hadoop.hive.cli.TestCliDriver.testCliDriver_implicit_cast1 org.apache.hadoop.hive.cli.TestCliDriver.testCliDriver_index_auto org.apache.hadoop.hive.cli.TestCliDriver.testCliDriver_index_auto_empty org.apache.hadoop.hive.cli.TestCliDriver.testCliDriver_index_auto_file_format org.apache.hadoop.hive.cli.TestCliDriver.testCliDriver_index_auto_mult_tables org.apache.hadoop.hive.cli.TestCliDriver.testCliDriver_index_auto_mult_tables_compact org.apache.hadoop.hive.cli.TestCliDriver.testCliDriver_index_auto_multiple org.apache.hadoop.hive.cli.TestCliDriver.testCliDriver_index_auto_partitioned org.apache.hadoop.hive.cli.TestCliDriver.testCliDriver_index_auto_self_join org.apache.hadoop.hive.cli.TestCliDriver.testCliDriver_index_auto_unused org.apache.hadoop.hive.cli.TestCliDriver.testCliDriver_index_auto_update org.apache.hadoop.hive.cli.TestCliDriver.testCliDriver_index_bitmap_auto_partitioned org.apache.hadoop.hive.cli.TestCliDriver.testCliDriver_index_bitmap_compression org.apache.hadoop.hive.cli.TestCliDriver.testCliDriver_index_compression org.apache.hadoop.hive.cli.TestCliDriver.testCliDriver_index_serde org.apache.hadoop.hive.cli.TestCliDriver.testCliDriver_index_stale org.apache.hadoop.hive.cli.TestCliDriver.testCliDriver_index_stale_partitioned org.apache.hadoop.hive.cli.TestCliDriver.testCliDriver_infer_const_type org.apache.hadoop.hive.cli.TestCliDriver.testCliDriver_innerjoin org.apache.hadoop.hive.cli.TestCliDriver.testCliDriver_input1 org.apache.hadoop.hive.cli.TestCliDriver.testCliDriver_input10 org.apache.hadoop.hive.cli.TestCliDriver.testCliDriver_input2 org.apache.hadoop.hive.cli.TestCliDriver.testCliDriver_input21 org.apache.hadoop.hive.cli.TestCliDriver.testCliDriver_input22 org.apache.hadoop.hive.cli.TestCliDriver.testCliDriver_input23 org.apache.hadoop.hive.cli.TestCliDriver.testCliDriver_input24 org.apache.hadoop.hive.cli.TestCliDriver.testCliDriver_input25 org.apache.hadoop.hive.cli.TestCliDriver.testCliDriver_input26 org.apache.hadoop.hive.cli.TestCliDriver.testCliDriver_input2_limit org.apache.hadoop.hive.cli.TestCliDriver.testCliDriver_input39_hadoop20 org.apache.hadoop.hive.cli.TestCliDriver.testCliDriver_input4 org.apache.hadoop.hive.cli.TestCliDriver.testCliDriver_input42 org.apache.hadoop.hive.cli.TestCliDriver.testCliDriver_input4_limit org.apache.hadoop.hive.cli.TestCliDriver.testCliDriver_input_part6 org.apache.hadoop.hive.cli.TestCliDriver.testCliDriver_input_part7 org.apache.hadoop.hive.cli.TestCliDriver.testCliDriver_input_part9 org.apache.hadoop.hive.cli.TestCliDriver.testCliDriver_input_testxpath3 org.apache.hadoop.hive.cli.TestCliDriver.testCliDriver_input_testxpath4 org.apache.hadoop.hive.cli.TestCliDriver.testCliDriver_inputddl6 org.apache.hadoop.hive.cli.TestCliDriver.testCliDriver_join0 org.apache.hadoop.hive.cli.TestCliDriver.testCliDriver_join10 org.apache.hadoop.hive.cli.TestCliDriver.testCliDriver_join11 org.apache.hadoop.hive.cli.TestCliDriver.testCliDriver_join12 org.apache.hadoop.hive.cli.TestCliDriver.testCliDriver_join13 org.apache.hadoop.hive.cli.TestCliDriver.testCliDriver_join15 org.apache.hadoop.hive.cli.TestCliDriver.testCliDriver_join16 org.apache.hadoop.hive.cli.TestCliDriver.testCliDriver_join18 org.apache.hadoop.hive.cli.TestCliDriver.testCliDriver_join18_multi_distinct org.apache.hadoop.hive.cli.TestCliDriver.testCliDriver_join19 org.apache.hadoop.hive.cli.TestCliDriver.testCliDriver_join20 org.apache.hadoop.hive.cli.TestCliDriver.testCliDriver_join21 org.apache.hadoop.hive.cli.TestCliDriver.testCliDriver_join22 org.apache.hadoop.hive.cli.TestCliDriver.testCliDriver_join23 org.apache.hadoop.hive.cli.TestCliDriver.testCliDriver_join38 org.apache.hadoop.hive.cli.TestCliDriver.testCliDriver_join40 org.apache.hadoop.hive.cli.TestCliDriver.testCliDriver_join41 org.apache.hadoop.hive.cli.TestCliDriver.testCliDriver_join_alt_syntax org.apache.hadoop.hive.cli.TestCliDriver.testCliDriver_join_cond_pushdown_1 org.apache.hadoop.hive.cli.TestCliDriver.testCliDriver_join_cond_pushdown_2 org.apache.hadoop.hive.cli.TestCliDriver.testCliDriver_join_cond_pushdown_3 org.apache.hadoop.hive.cli.TestCliDriver.testCliDriver_join_cond_pushdown_4 org.apache.hadoop.hive.cli.TestCliDriver.testCliDriver_join_cond_pushdown_unqual1 org.apache.hadoop.hive.cli.TestCliDriver.testCliDriver_join_cond_pushdown_unqual2 org.apache.hadoop.hive.cli.TestCliDriver.testCliDriver_join_cond_pushdown_unqual3 org.apache.hadoop.hive.cli.TestCliDriver.testCliDriver_join_cond_pushdown_unqual4 org.apache.hadoop.hive.cli.TestCliDriver.testCliDriver_join_filters_overlap org.apache.hadoop.hive.cli.TestCliDriver.testCliDriver_join_hive_626 org.apache.hadoop.hive.cli.TestCliDriver.testCliDriver_join_merging org.apache.hadoop.hive.cli.TestCliDriver.testCliDriver_join_nullsafe org.apache.hadoop.hive.cli.TestCliDriver.testCliDriver_join_rc org.apache.hadoop.hive.cli.TestCliDriver.testCliDriver_join_reorder org.apache.hadoop.hive.cli.TestCliDriver.testCliDriver_join_reorder2 org.apache.hadoop.hive.cli.TestCliDriver.testCliDriver_join_reorder3 org.apache.hadoop.hive.cli.TestCliDriver.testCliDriver_join_reorder4 org.apache.hadoop.hive.cli.TestCliDriver.testCliDriver_join_star org.apache.hadoop.hive.cli.TestCliDriver.testCliDriver_join_thrift org.apache.hadoop.hive.cli.TestCliDriver.testCliDriver_join_vc org.apache.hadoop.hive.cli.TestCliDriver.testCliDriver_join_view org.apache.hadoop.hive.cli.TestCliDriver.testCliDriver_keyword_1 org.apache.hadoop.hive.cli.TestCliDriver.testCliDriver_lateral_view org.apache.hadoop.hive.cli.TestCliDriver.testCliDriver_lateral_view_cp org.apache.hadoop.hive.cli.TestCliDriver.testCliDriver_lateral_view_noalias org.apache.hadoop.hive.cli.TestCliDriver.testCliDriver_lateral_view_outer org.apache.hadoop.hive.cli.TestCliDriver.testCliDriver_lateral_view_ppd org.apache.hadoop.hive.cli.TestCliDriver.testCliDriver_limit_partition_metadataonly org.apache.hadoop.hive.cli.TestCliDriver.testCliDriver_limit_pushdown org.apache.hadoop.hive.cli.TestCliDriver.testCliDriver_limit_pushdown_negative org.apache.hadoop.hive.cli.TestCliDriver.testCliDriver_louter_join_ppr org.apache.hadoop.hive.cli.TestCliDriver.testCliDriver_mapjoin1 org.apache.hadoop.hive.cli.TestCliDriver.testCliDriver_mapjoin_distinct org.apache.hadoop.hive.cli.TestCliDriver.testCliDriver_mapjoin_filter_on_outerjoin org.apache.hadoop.hive.cli.TestCliDriver.testCliDriver_mapjoin_mapjoin org.apache.hadoop.hive.cli.TestCliDriver.testCliDriver_mapjoin_memcheck org.apache.hadoop.hive.cli.TestCliDriver.testCliDriver_mapjoin_subquery org.apache.hadoop.hive.cli.TestCliDriver.testCliDriver_mapjoin_subquery2 org.apache.hadoop.hive.cli.TestCliDriver.testCliDriver_mapjoin_test_outer org.apache.hadoop.hive.cli.TestCliDriver.testCliDriver_mergejoins org.apache.hadoop.hive.cli.TestCliDriver.testCliDriver_mergejoins_mixed org.apache.hadoop.hive.cli.TestCliDriver.testCliDriver_metadata_only_queries org.apache.hadoop.hive.cli.TestCliDriver.testCliDriver_metadata_only_queries_with_filters org.apache.hadoop.hive.cli.TestCliDriver.testCliDriver_metadataonly1 org.apache.hadoop.hive.cli.TestCliDriver.testCliDriver_multiMapJoin1 org.apache.hadoop.hive.cli.TestCliDriver.testCliDriver_multiMapJoin2 org.apache.hadoop.hive.cli.TestCliDriver.testCliDriver_multi_join_union org.apache.hadoop.hive.cli.TestCliDriver.testCliDriver_no_hooks org.apache.hadoop.hive.cli.TestCliDriver.testCliDriver_noalias_subq1 org.apache.hadoop.hive.cli.TestCliDriver.testCliDriver_nonblock_op_deduplicate org.apache.hadoop.hive.cli.TestCliDriver.testCliDriver_nonmr_fetch org.apache.hadoop.hive.cli.TestCliDriver.testCliDriver_nonmr_fetch_threshold org.apache.hadoop.hive.cli.TestCliDriver.testCliDriver_null_cast org.apache.hadoop.hive.cli.TestCliDriver.testCliDriver_nullgroup org.apache.hadoop.hive.cli.TestCliDriver.testCliDriver_nullgroup2 org.apache.hadoop.hive.cli.TestCliDriver.testCliDriver_nullgroup3 org.apache.hadoop.hive.cli.TestCliDriver.testCliDriver_nullgroup4 org.apache.hadoop.hive.cli.TestCliDriver.testCliDriver_nullgroup4_multi_distinct org.apache.hadoop.hive.cli.TestCliDriver.testCliDriver_nullgroup5 org.apache.hadoop.hive.cli.TestCliDriver.testCliDriver_nullscript org.apache.hadoop.hive.cli.TestCliDriver.testCliDriver_optional_outer org.apache.hadoop.hive.cli.TestCliDriver.testCliDriver_orc_createas1 org.apache.hadoop.hive.cli.TestCliDriver.testCliDriver_orc_predicate_pushdown org.apache.hadoop.hive.cli.TestCliDriver.testCliDriver_order org.apache.hadoop.hive.cli.TestCliDriver.testCliDriver_order2 org.apache.hadoop.hive.cli.TestCliDriver.testCliDriver_outer_join_ppr org.apache.hadoop.hive.cli.TestCliDriver.testCliDriver_partition_wise_fileformat2 org.apache.hadoop.hive.cli.TestCliDriver.testCliDriver_pcr org.apache.hadoop.hive.cli.TestCliDriver.testCliDriver_plan_json org.apache.hadoop.hive.cli.TestCliDriver.testCliDriver_ppd1 org.apache.hadoop.hive.cli.TestCliDriver.testCliDriver_ppd2 org.apache.hadoop.hive.cli.TestCliDriver.testCliDriver_ppd_clusterby org.apache.hadoop.hive.cli.TestCliDriver.testCliDriver_ppd_constant_where org.apache.hadoop.hive.cli.TestCliDriver.testCliDriver_ppd_gby org.apache.hadoop.hive.cli.TestCliDriver.testCliDriver_ppd_gby2 org.apache.hadoop.hive.cli.TestCliDriver.testCliDriver_ppd_gby_join org.apache.hadoop.hive.cli.TestCliDriver.testCliDriver_ppd_join org.apache.hadoop.hive.cli.TestCliDriver.testCliDriver_ppd_join2 org.apache.hadoop.hive.cli.TestCliDriver.testCliDriver_ppd_join3 org.apache.hadoop.hive.cli.TestCliDriver.testCliDriver_ppd_join4 org.apache.hadoop.hive.cli.TestCliDriver.testCliDriver_ppd_join_filter org.apache.hadoop.hive.cli.TestCliDriver.testCliDriver_ppd_outer_join1 org.apache.hadoop.hive.cli.TestCliDriver.testCliDriver_ppd_outer_join2 org.apache.hadoop.hive.cli.TestCliDriver.testCliDriver_ppd_outer_join3 org.apache.hadoop.hive.cli.TestCliDriver.testCliDriver_ppd_outer_join4 org.apache.hadoop.hive.cli.TestCliDriver.testCliDriver_ppd_outer_join5 org.apache.hadoop.hive.cli.TestCliDriver.testCliDriver_ppd_random org.apache.hadoop.hive.cli.TestCliDriver.testCliDriver_ppd_repeated_alias org.apache.hadoop.hive.cli.TestCliDriver.testCliDriver_ppd_transform org.apache.hadoop.hive.cli.TestCliDriver.testCliDriver_ppd_udf_case org.apache.hadoop.hive.cli.TestCliDriver.testCliDriver_ppd_udf_col org.apache.hadoop.hive.cli.TestCliDriver.testCliDriver_ppd_udtf org.apache.hadoop.hive.cli.TestCliDriver.testCliDriver_ppd_union org.apache.hadoop.hive.cli.TestCliDriver.testCliDriver_ppd_union_view org.apache.hadoop.hive.cli.TestCliDriver.testCliDriver_ppd_vc org.apache.hadoop.hive.cli.TestCliDriver.testCliDriver_ppr_allchildsarenull org.apache.hadoop.hive.cli.TestCliDriver.testCliDriver_ppr_pushdown3 org.apache.hadoop.hive.cli.TestCliDriver.testCliDriver_push_or org.apache.hadoop.hive.cli.TestCliDriver.testCliDriver_query_result_fileformat org.apache.hadoop.hive.cli.TestCliDriver.testCliDriver_quote1 org.apache.hadoop.hive.cli.TestCliDriver.testCliDriver_quotedid_basic org.apache.hadoop.hive.cli.TestCliDriver.testCliDriver_quotedid_partition org.apache.hadoop.hive.cli.TestCliDriver.testCliDriver_quotedid_skew org.apache.hadoop.hive.cli.TestCliDriver.testCliDriver_rand_partitionpruner1 org.apache.hadoop.hive.cli.TestCliDriver.testCliDriver_rand_partitionpruner3 org.apache.hadoop.hive.cli.TestCliDriver.testCliDriver_reduce_deduplicate_exclude_join org.apache.hadoop.hive.cli.TestCliDriver.testCliDriver_reduce_deduplicate_extended org.apache.hadoop.hive.cli.TestCliDriver.testCliDriver_regex_col org.apache.hadoop.hive.cli.TestCliDriver.testCliDriver_regexp_extract org.apache.hadoop.hive.cli.TestCliDriver.testCliDriver_router_join_ppr org.apache.hadoop.hive.cli.TestCliDriver.testCliDriver_sample10 org.apache.hadoop.hive.cli.TestCliDriver.testCliDriver_sample3 org.apache.hadoop.hive.cli.TestCliDriver.testCliDriver_sample6 org.apache.hadoop.hive.cli.TestCliDriver.testCliDriver_sample8 org.apache.hadoop.hive.cli.TestCliDriver.testCliDriver_sample9 org.apache.hadoop.hive.cli.TestCliDriver.testCliDriver_script_pipe org.apache.hadoop.hive.cli.TestCliDriver.testCliDriver_select_as_omitted org.apache.hadoop.hive.cli.TestCliDriver.testCliDriver_select_dummy_source org.apache.hadoop.hive.cli.TestCliDriver.testCliDriver_select_transform_hint org.apache.hadoop.hive.cli.TestCliDriver.testCliDriver_select_unquote_and org.apache.hadoop.hive.cli.TestCliDriver.testCliDriver_select_unquote_not org.apache.hadoop.hive.cli.TestCliDriver.testCliDriver_select_unquote_or org.apache.hadoop.hive.cli.TestCliDriver.testCliDriver_semijoin org.apache.hadoop.hive.cli.TestCliDriver.testCliDriver_serde_user_properties org.apache.hadoop.hive.cli.TestCliDriver.testCliDriver_set_processor_namespaces org.apache.hadoop.hive.cli.TestCliDriver.testCliDriver_set_variable_sub org.apache.hadoop.hive.cli.TestCliDriver.testCliDriver_show_columns org.apache.hadoop.hive.cli.TestCliDriver.testCliDriver_show_indexes_edge_cases org.apache.hadoop.hive.cli.TestCliDriver.testCliDriver_show_indexes_syntax org.apache.hadoop.hive.cli.TestCliDriver.testCliDriver_show_tables org.apache.hadoop.hive.cli.TestCliDriver.testCliDriver_show_tablestatus org.apache.hadoop.hive.cli.TestCliDriver.testCliDriver_showparts org.apache.hadoop.hive.cli.TestCliDriver.testCliDriver_skewjoin org.apache.hadoop.hive.cli.TestCliDriver.testCliDriver_skewjoinopt1 org.apache.hadoop.hive.cli.TestCliDriver.testCliDriver_skewjoinopt10 org.apache.hadoop.hive.cli.TestCliDriver.testCliDriver_skewjoinopt11 org.apache.hadoop.hive.cli.TestCliDriver.testCliDriver_skewjoinopt12 org.apache.hadoop.hive.cli.TestCliDriver.testCliDriver_skewjoinopt13 org.apache.hadoop.hive.cli.TestCliDriver.testCliDriver_skewjoinopt14 org.apache.hadoop.hive.cli.TestCliDriver.testCliDriver_skewjoinopt15 org.apache.hadoop.hive.cli.TestCliDriver.testCliDriver_skewjoinopt16 org.apache.hadoop.hive.cli.TestCliDriver.testCliDriver_skewjoinopt17 org.apache.hadoop.hive.cli.TestCliDriver.testCliDriver_skewjoinopt18 org.apache.hadoop.hive.cli.TestCliDriver.testCliDriver_skewjoinopt19 org.apache.hadoop.hive.cli.TestCliDriver.testCliDriver_skewjoinopt2 org.apache.hadoop.hive.cli.TestCliDriver.testCliDriver_skewjoinopt20 org.apache.hadoop.hive.cli.TestCliDriver.testCliDriver_skewjoinopt3 org.apache.hadoop.hive.cli.TestCliDriver.testCliDriver_skewjoinopt4 org.apache.hadoop.hive.cli.TestCliDriver.testCliDriver_skewjoinopt5 org.apache.hadoop.hive.cli.TestCliDriver.testCliDriver_skewjoinopt6 org.apache.hadoop.hive.cli.TestCliDriver.testCliDriver_skewjoinopt7 org.apache.hadoop.hive.cli.TestCliDriver.testCliDriver_skewjoinopt8 org.apache.hadoop.hive.cli.TestCliDriver.testCliDriver_skewjoinopt9 org.apache.hadoop.hive.cli.TestCliDriver.testCliDriver_smb_mapjoin9 org.apache.hadoop.hive.cli.TestCliDriver.testCliDriver_smb_mapjoin_1 org.apache.hadoop.hive.cli.TestCliDriver.testCliDriver_smb_mapjoin_10 org.apache.hadoop.hive.cli.TestCliDriver.testCliDriver_smb_mapjoin_13 org.apache.hadoop.hive.cli.TestCliDriver.testCliDriver_smb_mapjoin_14 org.apache.hadoop.hive.cli.TestCliDriver.testCliDriver_smb_mapjoin_15 org.apache.hadoop.hive.cli.TestCliDriver.testCliDriver_smb_mapjoin_16 org.apache.hadoop.hive.cli.TestCliDriver.testCliDriver_smb_mapjoin_17 org.apache.hadoop.hive.cli.TestCliDriver.testCliDriver_smb_mapjoin_2 org.apache.hadoop.hive.cli.TestCliDriver.testCliDriver_smb_mapjoin_25 org.apache.hadoop.hive.cli.TestCliDriver.testCliDriver_smb_mapjoin_3 org.apache.hadoop.hive.cli.TestCliDriver.testCliDriver_smb_mapjoin_4 org.apache.hadoop.hive.cli.TestCliDriver.testCliDriver_smb_mapjoin_5 org.apache.hadoop.hive.cli.TestCliDriver.testCliDriver_smb_mapjoin_6 org.apache.hadoop.hive.cli.TestCliDriver.testCliDriver_sort org.apache.hadoop.hive.cli.TestCliDriver.testCliDriver_sort_merge_join_desc_1 org.apache.hadoop.hive.cli.TestCliDriver.testCliDriver_sort_merge_join_desc_2 org.apache.hadoop.hive.cli.TestCliDriver.testCliDriver_sort_merge_join_desc_3 org.apache.hadoop.hive.cli.TestCliDriver.testCliDriver_sort_merge_join_desc_4 org.apache.hadoop.hive.cli.TestCliDriver.testCliDriver_sort_merge_join_desc_5 org.apache.hadoop.hive.cli.TestCliDriver.testCliDriver_sort_merge_join_desc_6 org.apache.hadoop.hive.cli.TestCliDriver.testCliDriver_sort_merge_join_desc_7 org.apache.hadoop.hive.cli.TestCliDriver.testCliDriver_stats_only_null org.apache.hadoop.hive.cli.TestCliDriver.testCliDriver_str_to_map org.apache.hadoop.hive.cli.TestCliDriver.testCliDriver_subq2 org.apache.hadoop.hive.cli.TestCliDriver.testCliDriver_subq_where_serialization org.apache.hadoop.hive.cli.TestCliDriver.testCliDriver_subquery_alias org.apache.hadoop.hive.cli.TestCliDriver.testCliDriver_subquery_exists org.apache.hadoop.hive.cli.TestCliDriver.testCliDriver_subquery_exists_having org.apache.hadoop.hive.cli.TestCliDriver.testCliDriver_subquery_in org.apache.hadoop.hive.cli.TestCliDriver.testCliDriver_subquery_in_having org.apache.hadoop.hive.cli.TestCliDriver.testCliDriver_subquery_notexists org.apache.hadoop.hive.cli.TestCliDriver.testCliDriver_subquery_notexists_having org.apache.hadoop.hive.cli.TestCliDriver.testCliDriver_subquery_notin org.apache.hadoop.hive.cli.TestCliDriver.testCliDriver_subquery_notin_having org.apache.hadoop.hive.cli.TestCliDriver.testCliDriver_subquery_unqualcolumnrefs org.apache.hadoop.hive.cli.TestCliDriver.testCliDriver_symlink_text_input_format org.apache.hadoop.hive.cli.TestCliDriver.testCliDriver_transform1 org.apache.hadoop.hive.cli.TestCliDriver.testCliDriver_transform_ppr1 org.apache.hadoop.hive.cli.TestCliDriver.testCliDriver_transform_ppr2 org.apache.hadoop.hive.cli.TestCliDriver.testCliDriver_type_widening org.apache.hadoop.hive.cli.TestCliDriver.testCliDriver_udaf_number_format org.apache.hadoop.hive.cli.TestCliDriver.testCliDriver_udf2 org.apache.hadoop.hive.cli.TestCliDriver.testCliDriver_udf4 org.apache.hadoop.hive.cli.TestCliDriver.testCliDriver_udf5 org.apache.hadoop.hive.cli.TestCliDriver.testCliDriver_udf6 org.apache.hadoop.hive.cli.TestCliDriver.testCliDriver_udf7 org.apache.hadoop.hive.cli.TestCliDriver.testCliDriver_udf8 org.apache.hadoop.hive.cli.TestCliDriver.testCliDriver_udf9 org.apache.hadoop.hive.cli.TestCliDriver.testCliDriver_udf_case_column_pruning org.apache.hadoop.hive.cli.TestCliDriver.testCliDriver_udf_count org.apache.hadoop.hive.cli.TestCliDriver.testCliDriver_udf_current_database org.apache.hadoop.hive.cli.TestCliDriver.testCliDriver_udf_explode org.apache.hadoop.hive.cli.TestCliDriver.testCliDriver_udf_in_file org.apache.hadoop.hive.cli.TestCliDriver.testCliDriver_udf_inline org.apache.hadoop.hive.cli.TestCliDriver.testCliDriver_udf_lower org.apache.hadoop.hive.cli.TestCliDriver.testCliDriver_udf_minute org.apache.hadoop.hive.cli.TestCliDriver.testCliDriver_udf_parse_url org.apache.hadoop.hive.cli.TestCliDriver.testCliDriver_udf_reflect2 org.apache.hadoop.hive.cli.TestCliDriver.testCliDriver_udf_to_unix_timestamp org.apache.hadoop.hive.cli.TestCliDriver.testCliDriver_udtf_explode org.apache.hadoop.hive.cli.TestCliDriver.testCliDriver_udtf_json_tuple org.apache.hadoop.hive.cli.TestCliDriver.testCliDriver_udtf_parse_url_tuple org.apache.hadoop.hive.cli.TestCliDriver.testCliDriver_udtf_stack org.apache.hadoop.hive.cli.TestCliDriver.testCliDriver_union11 org.apache.hadoop.hive.cli.TestCliDriver.testCliDriver_union13 org.apache.hadoop.hive.cli.TestCliDriver.testCliDriver_union14 org.apache.hadoop.hive.cli.TestCliDriver.testCliDriver_union15 org.apache.hadoop.hive.cli.TestCliDriver.testCliDriver_union16 org.apache.hadoop.hive.cli.TestCliDriver.testCliDriver_union2 org.apache.hadoop.hive.cli.TestCliDriver.testCliDriver_union20 org.apache.hadoop.hive.cli.TestCliDriver.testCliDriver_union21 org.apache.hadoop.hive.cli.TestCliDriver.testCliDriver_union23 org.apache.hadoop.hive.cli.TestCliDriver.testCliDriver_union24 org.apache.hadoop.hive.cli.TestCliDriver.testCliDriver_union26 org.apache.hadoop.hive.cli.TestCliDriver.testCliDriver_union3 org.apache.hadoop.hive.cli.TestCliDriver.testCliDriver_union32 org.apache.hadoop.hive.cli.TestCliDriver.testCliDriver_union34 org.apache.hadoop.hive.cli.TestCliDriver.testCliDriver_union5 org.apache.hadoop.hive.cli.TestCliDriver.testCliDriver_union7 org.apache.hadoop.hive.cli.TestCliDriver.testCliDriver_union8 org.apache.hadoop.hive.cli.TestCliDriver.testCliDriver_union9 org.apache.hadoop.hive.cli.TestCliDriver.testCliDriver_union_ppr org.apache.hadoop.hive.cli.TestCliDriver.testCliDriver_union_top_level org.apache.hadoop.hive.cli.TestCliDriver.testCliDriver_union_view org.apache.hadoop.hive.cli.TestCliDriver.testCliDriver_vector_between_in org.apache.hadoop.hive.cli.TestCliDriver.testCliDriver_vector_coalesce org.apache.hadoop.hive.cli.TestCliDriver.testCliDriver_vector_decimal_aggregate org.apache.hadoop.hive.cli.TestCliDriver.testCliDriver_vector_decimal_cast org.apache.hadoop.hive.cli.TestCliDriver.testCliDriver_vector_decimal_expressions org.apache.hadoop.hive.cli.TestCliDriver.testCliDriver_vector_decimal_mapjoin org.apache.hadoop.hive.cli.TestCliDriver.testCliDriver_vector_decimal_math_funcs org.apache.hadoop.hive.cli.TestCliDriver.testCliDriver_vector_left_outer_join org.apache.hadoop.hive.cli.TestCliDriver.testCliDriver_vector_non_string_partition org.apache.hadoop.hive.cli.TestCliDriver.testCliDriver_vectorization_decimal_date org.apache.hadoop.hive.cli.TestCliDriver.testCliDriver_vectorization_div0 org.apache.hadoop.hive.cli.TestCliDriver.testCliDriver_vectorization_limit org.apache.hadoop.hive.cli.TestCliDriver.testCliDriver_vectorization_part_project org.apache.hadoop.hive.cli.TestCliDriver.testCliDriver_vectorization_pushdown org.apache.hadoop.hive.cli.TestCliDriver.testCliDriver_vectorization_short_regress org.apache.hadoop.hive.cli.TestCliDriver.testCliDriver_vectorized_bucketmapjoin1 org.apache.hadoop.hive.cli.TestCliDriver.testCliDriver_vectorized_case org.apache.hadoop.hive.cli.TestCliDriver.testCliDriver_vectorized_casts org.apache.hadoop.hive.cli.TestCliDriver.testCliDriver_vectorized_context org.apache.hadoop.hive.cli.TestCliDriver.testCliDriver_vectorized_date_funcs org.apache.hadoop.hive.cli.TestCliDriver.testCliDriver_vectorized_distinct_gby org.apache.hadoop.hive.cli.TestCliDriver.testCliDriver_vectorized_mapjoin org.apache.hadoop.hive.cli.TestCliDriver.testCliDriver_vectorized_math_funcs org.apache.hadoop.hive.cli.TestCliDriver.testCliDriver_vectorized_nested_mapjoin org.apache.hadoop.hive.cli.TestCliDriver.testCliDriver_vectorized_parquet org.apache.hadoop.hive.cli.TestCliDriver.testCliDriver_vectorized_shufflejoin org.apache.hadoop.hive.cli.TestCliDriver.testCliDriver_vectorized_string_funcs org.apache.hadoop.hive.cli.TestCliDriver.testCliDriver_vectorized_timestamp_funcs org.apache.hadoop.hive.cli.TestContribCliDriver.testCliDriver_dboutput org.apache.hadoop.hive.cli.TestContribCliDriver.testCliDriver_udaf_example_avg org.apache.hadoop.hive.cli.TestContribCliDriver.testCliDriver_udaf_example_group_concat org.apache.hadoop.hive.cli.TestContribCliDriver.testCliDriver_udaf_example_max org.apache.hadoop.hive.cli.TestContribCliDriver.testCliDriver_udaf_example_max_n org.apache.hadoop.hive.cli.TestContribCliDriver.testCliDriver_udaf_example_min org.apache.hadoop.hive.cli.TestContribCliDriver.testCliDriver_udaf_example_min_n org.apache.hadoop.hive.cli.TestContribCliDriver.testCliDriver_udf_example_add org.apache.hadoop.hive.cli.TestContribCliDriver.testCliDriver_udf_example_arraymapstruct org.apache.hadoop.hive.cli.TestContribCliDriver.testCliDriver_udf_example_format org.apache.hadoop.hive.cli.TestContribCliDriver.testCliDriver_udf_row_sequence org.apache.hadoop.hive.cli.TestHBaseCliDriver.testCliDriver_external_table_ppd org.apache.hadoop.hive.cli.TestHBaseCliDriver.testCliDriver_hbase_ppd_key_range org.apache.hadoop.hive.cli.TestHBaseCliDriver.testCliDriver_hbase_pushdown org.apache.hadoop.hive.cli.TestHBaseCliDriver.testCliDriver_hbase_queries org.apache.hadoop.hive.cli.TestHBaseCliDriver.testCliDriver_ppd_key_ranges org.apache.hadoop.hive.cli.TestMinimrCliDriver.testCliDriver_auto_sortmerge_join_16 org.apache.hadoop.hive.cli.TestMinimrCliDriver.testCliDriver_bucket4 org.apache.hadoop.hive.cli.TestMinimrCliDriver.testCliDriver_bucketizedhiveinputformat org.apache.hadoop.hive.cli.TestMinimrCliDriver.testCliDriver_bucketmapjoin6 org.apache.hadoop.hive.cli.TestMinimrCliDriver.testCliDriver_bucketmapjoin7 org.apache.hadoop.hive.cli.TestMinimrCliDriver.testCliDriver_disable_merge_for_bucketing org.apache.hadoop.hive.cli.TestNegativeCliDriver.testNegativeCliDriver_bucket_mapjoin_mismatch1 org.apache.hadoop.hive.cli.TestNegativeCliDriver.testNegativeCliDriver_limit_partition_stats org.apache.hadoop.hive.cli.TestNegativeCliDriver.testNegativeCliDriver_script_error org.apache.hadoop.hive.cli.TestNegativeCliDriver.testNegativeCliDriver_sortmerge_mapjoin_mismatch_1 org.apache.hadoop.hive.cli.TestNegativeCliDriver.testNegativeCliDriver_udf_assert_true org.apache.hadoop.hive.cli.TestNegativeCliDriver.testNegativeCliDriver_udf_assert_true2 org.apache.hadoop.hive.cli.TestNegativeMinimrCliDriver.testNegativeCliDriver_mapreduce_stack_trace_hadoop20 org.apache.hadoop.hive.ql.TestMTQueries.testMTQueries1 Test results: http://bigtop01.cloudera.org:8080/job/PreCommit-HIVE-Build/2233/testReport Console output: http://bigtop01.cloudera.org:8080/job/PreCommit-HIVE-Build/2233/console Messages: Executing org.apache.hive.ptest.execution.PrepPhase Executing org.apache.hive.ptest.execution.ExecutionPhase Executing org.apache.hive.ptest.execution.ReportingPhase Tests exited with: TestsFailedException: 476 tests failed This message is automatically generated. ATTACHMENT ID: 12639911
          Xuefu Zhang made changes -
          Status Open [ 1 ] Patch Available [ 10002 ]
          Xuefu Zhang made changes -
          Attachment HIVE-6901.patch [ 12639911 ]
          Hide
          Xuefu Zhang added a comment -

          With the patch attached, the following will be shown instead:

            Stage: Stage-0
              Fetch Operator
                limit: -1
                Processor Tree:
                  ListSink
          

          Expecting test output diffs.

          Show
          Xuefu Zhang added a comment - With the patch attached, the following will be shown instead: Stage: Stage-0 Fetch Operator limit: -1 Processor Tree: ListSink Expecting test output diffs.
          Xuefu Zhang made changes -
          Field Original Value New Value
          Description Explaining a simple select query that involves a MR phase doesn't show complete processor tree for the fetch operator.
          {code}
          hive> explain select d from test;
          OK
          STAGE DEPENDENCIES:
            Stage-1 is a root stage
            Stage-0 is a root stage

          STAGE PLANS:
            Stage: Stage-1
              Map Reduce
                Map Operator Tree:
          ...
            Stage: Stage-0
              Fetch Operator
                limit: -1
          {code}

          It would be nice if the operator tree is shown even if there is only one node.

          Please note that in local execution, the operator tree is complete:
          {code}
          hive> explain select * from test;
          OK
          STAGE DEPENDENCIES:
            Stage-0 is a root stage

          STAGE PLANS:
            Stage: Stage-0
              Fetch Operator
                limit: -1
                Processor Tree:
                  TableScan
                    alias: test
                    Statistics: Num rows: 8 Data size: 34 Basic stats: COMPLETE Column stats: NONE
                    Select Operator
                      expressions: d (type: int)
                      outputColumnNames: _col0
                      Statistics: Num rows: 8 Data size: 34 Basic stats: COMPLETE Column stats: NONE
                      ListSink
          {code}
          Explaining a simple select query that involves a MR phase doesn't show processor tree for the fetch operator.
          {code}
          hive> explain select d from test;
          OK
          STAGE DEPENDENCIES:
            Stage-1 is a root stage
            Stage-0 is a root stage

          STAGE PLANS:
            Stage: Stage-1
              Map Reduce
                Map Operator Tree:
          ...
            Stage: Stage-0
              Fetch Operator
                limit: -1
          {code}

          It would be nice if the operator tree is shown even if there is only one node.

          Please note that in local execution, the operator tree is complete:
          {code}
          hive> explain select * from test;
          OK
          STAGE DEPENDENCIES:
            Stage-0 is a root stage

          STAGE PLANS:
            Stage: Stage-0
              Fetch Operator
                limit: -1
                Processor Tree:
                  TableScan
                    alias: test
                    Statistics: Num rows: 8 Data size: 34 Basic stats: COMPLETE Column stats: NONE
                    Select Operator
                      expressions: d (type: int)
                      outputColumnNames: _col0
                      Statistics: Num rows: 8 Data size: 34 Basic stats: COMPLETE Column stats: NONE
                      ListSink
          {code}
          Xuefu Zhang created issue -

            People

            • Assignee:
              Xuefu Zhang
              Reporter:
              Xuefu Zhang
            • Votes:
              0 Vote for this issue
              Watchers:
              3 Start watching this issue

              Dates

              • Created:
                Updated:
                Resolved:

                Development