Hive
  1. Hive
  2. HIVE-6680

Decimal128#update(Decimal128 o, short scale) should adjust the unscaled value.

    Details

    • Type: Bug Bug
    • Status: Resolved
    • Priority: Major Major
    • Resolution: Fixed
    • Affects Version/s: None
    • Fix Version/s: 0.13.0
    • Component/s: None
    • Labels:
      None

      Description

      Decimal128#update(Decimal128 o, short scale) should adjust the unscaled value.

      1. HIVE-6680.1.patch
        4 kB
        Jitendra Nath Pandey
      2. HIVE-6680.1.patch
        4 kB
        Jitendra Nath Pandey

        Activity

        Hide
        Jitendra Nath Pandey added a comment -

        Attached patch fixes the issue.

        Show
        Jitendra Nath Pandey added a comment - Attached patch fixes the issue.
        Hide
        Remus Rusanu added a comment -

        +1

        Show
        Remus Rusanu added a comment - +1
        Hide
        Hive QA added a comment -

        Overall: -1 no tests executed

        Here are the results of testing the latest attachment:
        https://issues.apache.org/jira/secure/attachment/12634906/HIVE-6680.1.patch

        Test results: http://bigtop01.cloudera.org:8080/job/PreCommit-HIVE-Build/1835/testReport
        Console output: http://bigtop01.cloudera.org:8080/job/PreCommit-HIVE-Build/1835/console

        Messages:

        **** This message was trimmed, see log for full details ****
        [INFO] Using 'UTF-8' encoding to copy filtered resources.
        [INFO] skip non existing resourceDirectory /data/hive-ptest/working/apache-svn-trunk-source/hwi/src/test/resources
        [INFO] Copying 3 resources
        [INFO] 
        [INFO] --- maven-antrun-plugin:1.7:run (setup-test-dirs) @ hive-hwi ---
        [INFO] Executing tasks
        
        main:
            [mkdir] Created dir: /data/hive-ptest/working/apache-svn-trunk-source/hwi/target/tmp
            [mkdir] Created dir: /data/hive-ptest/working/apache-svn-trunk-source/hwi/target/warehouse
            [mkdir] Created dir: /data/hive-ptest/working/apache-svn-trunk-source/hwi/target/tmp/conf
             [copy] Copying 5 files to /data/hive-ptest/working/apache-svn-trunk-source/hwi/target/tmp/conf
        [INFO] Executed tasks
        [INFO] 
        [INFO] --- maven-compiler-plugin:3.1:testCompile (default-testCompile) @ hive-hwi ---
        [INFO] Compiling 2 source files to /data/hive-ptest/working/apache-svn-trunk-source/hwi/target/test-classes
        [INFO] 
        [INFO] --- maven-surefire-plugin:2.16:test (default-test) @ hive-hwi ---
        [INFO] Tests are skipped.
        [INFO] 
        [INFO] --- maven-jar-plugin:2.2:jar (default-jar) @ hive-hwi ---
        [INFO] Building jar: /data/hive-ptest/working/apache-svn-trunk-source/hwi/target/hive-hwi-0.14.0-SNAPSHOT.jar
        [INFO] 
        [INFO] --- maven-site-plugin:3.3:attach-descriptor (attach-descriptor) @ hive-hwi ---
        [INFO] 
        [INFO] --- maven-install-plugin:2.4:install (default-install) @ hive-hwi ---
        [INFO] Installing /data/hive-ptest/working/apache-svn-trunk-source/hwi/target/hive-hwi-0.14.0-SNAPSHOT.jar to /data/hive-ptest/working/maven/org/apache/hive/hive-hwi/0.14.0-SNAPSHOT/hive-hwi-0.14.0-SNAPSHOT.jar
        [INFO] Installing /data/hive-ptest/working/apache-svn-trunk-source/hwi/pom.xml to /data/hive-ptest/working/maven/org/apache/hive/hive-hwi/0.14.0-SNAPSHOT/hive-hwi-0.14.0-SNAPSHOT.pom
        [INFO]                                                                         
        [INFO] ------------------------------------------------------------------------
        [INFO] Building Hive ODBC 0.14.0-SNAPSHOT
        [INFO] ------------------------------------------------------------------------
        [INFO] 
        [INFO] --- maven-clean-plugin:2.5:clean (default-clean) @ hive-odbc ---
        [INFO] Deleting /data/hive-ptest/working/apache-svn-trunk-source/odbc (includes = [datanucleus.log, derby.log], excludes = [])
        [INFO] 
        [INFO] --- maven-remote-resources-plugin:1.5:process (default) @ hive-odbc ---
        [INFO] 
        [INFO] --- maven-antrun-plugin:1.7:run (define-classpath) @ hive-odbc ---
        [INFO] Executing tasks
        
        main:
        [INFO] Executed tasks
        [INFO] 
        [INFO] --- maven-antrun-plugin:1.7:run (setup-test-dirs) @ hive-odbc ---
        [INFO] Executing tasks
        
        main:
            [mkdir] Created dir: /data/hive-ptest/working/apache-svn-trunk-source/odbc/target/tmp
            [mkdir] Created dir: /data/hive-ptest/working/apache-svn-trunk-source/odbc/target/warehouse
            [mkdir] Created dir: /data/hive-ptest/working/apache-svn-trunk-source/odbc/target/tmp/conf
             [copy] Copying 5 files to /data/hive-ptest/working/apache-svn-trunk-source/odbc/target/tmp/conf
        [INFO] Executed tasks
        [INFO] 
        [INFO] --- maven-site-plugin:3.3:attach-descriptor (attach-descriptor) @ hive-odbc ---
        [INFO] 
        [INFO] --- maven-install-plugin:2.4:install (default-install) @ hive-odbc ---
        [INFO] Installing /data/hive-ptest/working/apache-svn-trunk-source/odbc/pom.xml to /data/hive-ptest/working/maven/org/apache/hive/hive-odbc/0.14.0-SNAPSHOT/hive-odbc-0.14.0-SNAPSHOT.pom
        [INFO]                                                                         
        [INFO] ------------------------------------------------------------------------
        [INFO] Building Hive Shims Aggregator 0.14.0-SNAPSHOT
        [INFO] ------------------------------------------------------------------------
        [INFO] 
        [INFO] --- maven-clean-plugin:2.5:clean (default-clean) @ hive-shims-aggregator ---
        [INFO] Deleting /data/hive-ptest/working/apache-svn-trunk-source/shims (includes = [datanucleus.log, derby.log], excludes = [])
        [INFO] 
        [INFO] --- maven-remote-resources-plugin:1.5:process (default) @ hive-shims-aggregator ---
        [INFO] 
        [INFO] --- maven-antrun-plugin:1.7:run (define-classpath) @ hive-shims-aggregator ---
        [INFO] Executing tasks
        
        main:
        [INFO] Executed tasks
        [INFO] 
        [INFO] --- maven-antrun-plugin:1.7:run (setup-test-dirs) @ hive-shims-aggregator ---
        [INFO] Executing tasks
        
        main:
            [mkdir] Created dir: /data/hive-ptest/working/apache-svn-trunk-source/shims/target/tmp
            [mkdir] Created dir: /data/hive-ptest/working/apache-svn-trunk-source/shims/target/warehouse
            [mkdir] Created dir: /data/hive-ptest/working/apache-svn-trunk-source/shims/target/tmp/conf
             [copy] Copying 5 files to /data/hive-ptest/working/apache-svn-trunk-source/shims/target/tmp/conf
        [INFO] Executed tasks
        [INFO] 
        [INFO] --- maven-site-plugin:3.3:attach-descriptor (attach-descriptor) @ hive-shims-aggregator ---
        [INFO] 
        [INFO] --- maven-install-plugin:2.4:install (default-install) @ hive-shims-aggregator ---
        [INFO] Installing /data/hive-ptest/working/apache-svn-trunk-source/shims/pom.xml to /data/hive-ptest/working/maven/org/apache/hive/hive-shims-aggregator/0.14.0-SNAPSHOT/hive-shims-aggregator-0.14.0-SNAPSHOT.pom
        [INFO]                                                                         
        [INFO] ------------------------------------------------------------------------
        [INFO] Building Hive TestUtils 0.14.0-SNAPSHOT
        [INFO] ------------------------------------------------------------------------
        [INFO] 
        [INFO] --- maven-clean-plugin:2.5:clean (default-clean) @ hive-testutils ---
        [INFO] Deleting /data/hive-ptest/working/apache-svn-trunk-source/testutils (includes = [datanucleus.log, derby.log], excludes = [])
        [INFO] 
        [INFO] --- maven-remote-resources-plugin:1.5:process (default) @ hive-testutils ---
        [INFO] 
        [INFO] --- maven-resources-plugin:2.6:resources (default-resources) @ hive-testutils ---
        [INFO] Using 'UTF-8' encoding to copy filtered resources.
        [INFO] skip non existing resourceDirectory /data/hive-ptest/working/apache-svn-trunk-source/testutils/src/main/resources
        [INFO] Copying 3 resources
        [INFO] 
        [INFO] --- maven-antrun-plugin:1.7:run (define-classpath) @ hive-testutils ---
        [INFO] Executing tasks
        
        main:
        [INFO] Executed tasks
        [INFO] 
        [INFO] --- maven-compiler-plugin:3.1:compile (default-compile) @ hive-testutils ---
        [INFO] Compiling 2 source files to /data/hive-ptest/working/apache-svn-trunk-source/testutils/target/classes
        [INFO] 
        [INFO] --- maven-resources-plugin:2.6:testResources (default-testResources) @ hive-testutils ---
        [INFO] Using 'UTF-8' encoding to copy filtered resources.
        [INFO] skip non existing resourceDirectory /data/hive-ptest/working/apache-svn-trunk-source/testutils/src/test/resources
        [INFO] Copying 3 resources
        [INFO] 
        [INFO] --- maven-antrun-plugin:1.7:run (setup-test-dirs) @ hive-testutils ---
        [INFO] Executing tasks
        
        main:
            [mkdir] Created dir: /data/hive-ptest/working/apache-svn-trunk-source/testutils/target/tmp
            [mkdir] Created dir: /data/hive-ptest/working/apache-svn-trunk-source/testutils/target/warehouse
            [mkdir] Created dir: /data/hive-ptest/working/apache-svn-trunk-source/testutils/target/tmp/conf
             [copy] Copying 5 files to /data/hive-ptest/working/apache-svn-trunk-source/testutils/target/tmp/conf
        [INFO] Executed tasks
        [INFO] 
        [INFO] --- maven-compiler-plugin:3.1:testCompile (default-testCompile) @ hive-testutils ---
        [INFO] No sources to compile
        [INFO] 
        [INFO] --- maven-surefire-plugin:2.16:test (default-test) @ hive-testutils ---
        [INFO] Tests are skipped.
        [INFO] 
        [INFO] --- maven-jar-plugin:2.2:jar (default-jar) @ hive-testutils ---
        [INFO] Building jar: /data/hive-ptest/working/apache-svn-trunk-source/testutils/target/hive-testutils-0.14.0-SNAPSHOT.jar
        [INFO] 
        [INFO] --- maven-site-plugin:3.3:attach-descriptor (attach-descriptor) @ hive-testutils ---
        [INFO] 
        [INFO] --- maven-install-plugin:2.4:install (default-install) @ hive-testutils ---
        [INFO] Installing /data/hive-ptest/working/apache-svn-trunk-source/testutils/target/hive-testutils-0.14.0-SNAPSHOT.jar to /data/hive-ptest/working/maven/org/apache/hive/hive-testutils/0.14.0-SNAPSHOT/hive-testutils-0.14.0-SNAPSHOT.jar
        [INFO] Installing /data/hive-ptest/working/apache-svn-trunk-source/testutils/pom.xml to /data/hive-ptest/working/maven/org/apache/hive/hive-testutils/0.14.0-SNAPSHOT/hive-testutils-0.14.0-SNAPSHOT.pom
        [INFO]                                                                         
        [INFO] ------------------------------------------------------------------------
        [INFO] Building Hive Packaging 0.14.0-SNAPSHOT
        [INFO] ------------------------------------------------------------------------
        Downloading: http://repository.apache.org/snapshots/org/apache/hive/hcatalog/hive-hcatalog-hbase-storage-handler/0.14.0-SNAPSHOT/maven-metadata.xml
        Downloading: http://repository.apache.org/snapshots/org/apache/hive/hcatalog/hive-hcatalog-hbase-storage-handler/0.14.0-SNAPSHOT/hive-hcatalog-hbase-storage-handler-0.14.0-SNAPSHOT.pom
        [WARNING] The POM for org.apache.hive.hcatalog:hive-hcatalog-hbase-storage-handler:jar:0.14.0-SNAPSHOT is missing, no dependency information available
        Downloading: http://repository.apache.org/snapshots/org/apache/hive/hcatalog/hive-hcatalog-hbase-storage-handler/0.14.0-SNAPSHOT/hive-hcatalog-hbase-storage-handler-0.14.0-SNAPSHOT.jar
        [INFO] ------------------------------------------------------------------------
        [INFO] Reactor Summary:
        [INFO] 
        [INFO] Hive .............................................. SUCCESS [8.585s]
        [INFO] Hive Ant Utilities ................................ SUCCESS [5.340s]
        [INFO] Hive Shims Common ................................. SUCCESS [3.698s]
        [INFO] Hive Shims 0.20 ................................... SUCCESS [2.469s]
        [INFO] Hive Shims Secure Common .......................... SUCCESS [4.373s]
        [INFO] Hive Shims 0.20S .................................. SUCCESS [2.644s]
        [INFO] Hive Shims 0.23 ................................... SUCCESS [8.083s]
        [INFO] Hive Shims ........................................ SUCCESS [1.302s]
        [INFO] Hive Common ....................................... SUCCESS [6.758s]
        [INFO] Hive Serde ........................................ SUCCESS [10.735s]
        [INFO] Hive Metastore .................................... SUCCESS [32.370s]
        [INFO] Hive Query Language ............................... SUCCESS [1:17.707s]
        [INFO] Hive Service ...................................... SUCCESS [8.422s]
        [INFO] Hive JDBC ......................................... SUCCESS [2.987s]
        [INFO] Hive Beeline ...................................... SUCCESS [2.791s]
        [INFO] Hive CLI .......................................... SUCCESS [1.907s]
        [INFO] Hive Contrib ...................................... SUCCESS [2.379s]
        [INFO] Hive HBase Handler ................................ SUCCESS [2.725s]
        [INFO] Hive HCatalog ..................................... SUCCESS [0.502s]
        [INFO] Hive HCatalog Core ................................ SUCCESS [1.891s]
        [INFO] Hive HCatalog Pig Adapter ......................... SUCCESS [2.392s]
        [INFO] Hive HCatalog Server Extensions ................... SUCCESS [1.258s]
        [INFO] Hive HCatalog Webhcat Java Client ................. SUCCESS [2.197s]
        [INFO] Hive HCatalog Webhcat ............................. SUCCESS [9.940s]
        [INFO] Hive HWI .......................................... SUCCESS [1.138s]
        [INFO] Hive ODBC ......................................... SUCCESS [0.876s]
        [INFO] Hive Shims Aggregator ............................. SUCCESS [0.201s]
        [INFO] Hive TestUtils .................................... SUCCESS [0.658s]
        [INFO] Hive Packaging .................................... FAILURE [1.747s]
        [INFO] ------------------------------------------------------------------------
        [INFO] BUILD FAILURE
        [INFO] ------------------------------------------------------------------------
        [INFO] Total time: 3:32.626s
        [INFO] Finished at: Sat Mar 15 13:32:01 EDT 2014
        [INFO] Final Memory: 74M/422M
        [INFO] ------------------------------------------------------------------------
        [ERROR] Failed to execute goal on project hive-packaging: Could not resolve dependencies for project org.apache.hive:hive-packaging:pom:0.14.0-SNAPSHOT: Could not find artifact org.apache.hive.hcatalog:hive-hcatalog-hbase-storage-handler:jar:0.14.0-SNAPSHOT in apache.snapshots (http://repository.apache.org/snapshots) -> [Help 1]
        [ERROR] 
        [ERROR] To see the full stack trace of the errors, re-run Maven with the -e switch.
        [ERROR] Re-run Maven using the -X switch to enable full debug logging.
        [ERROR] 
        [ERROR] For more information about the errors and possible solutions, please read the following articles:
        [ERROR] [Help 1] http://cwiki.apache.org/confluence/display/MAVEN/DependencyResolutionException
        [ERROR] 
        [ERROR] After correcting the problems, you can resume the build with the command
        [ERROR]   mvn <goals> -rf :hive-packaging
        + exit 1
        '
        

        This message is automatically generated.

        ATTACHMENT ID: 12634906

        Show
        Hive QA added a comment - Overall : -1 no tests executed Here are the results of testing the latest attachment: https://issues.apache.org/jira/secure/attachment/12634906/HIVE-6680.1.patch Test results: http://bigtop01.cloudera.org:8080/job/PreCommit-HIVE-Build/1835/testReport Console output: http://bigtop01.cloudera.org:8080/job/PreCommit-HIVE-Build/1835/console Messages: **** This message was trimmed, see log for full details **** [INFO] Using 'UTF-8' encoding to copy filtered resources. [INFO] skip non existing resourceDirectory /data/hive-ptest/working/apache-svn-trunk-source/hwi/src/test/resources [INFO] Copying 3 resources [INFO] [INFO] --- maven-antrun-plugin:1.7:run (setup-test-dirs) @ hive-hwi --- [INFO] Executing tasks main: [mkdir] Created dir: /data/hive-ptest/working/apache-svn-trunk-source/hwi/target/tmp [mkdir] Created dir: /data/hive-ptest/working/apache-svn-trunk-source/hwi/target/warehouse [mkdir] Created dir: /data/hive-ptest/working/apache-svn-trunk-source/hwi/target/tmp/conf [copy] Copying 5 files to /data/hive-ptest/working/apache-svn-trunk-source/hwi/target/tmp/conf [INFO] Executed tasks [INFO] [INFO] --- maven-compiler-plugin:3.1:testCompile (default-testCompile) @ hive-hwi --- [INFO] Compiling 2 source files to /data/hive-ptest/working/apache-svn-trunk-source/hwi/target/test-classes [INFO] [INFO] --- maven-surefire-plugin:2.16:test (default-test) @ hive-hwi --- [INFO] Tests are skipped. [INFO] [INFO] --- maven-jar-plugin:2.2:jar (default-jar) @ hive-hwi --- [INFO] Building jar: /data/hive-ptest/working/apache-svn-trunk-source/hwi/target/hive-hwi-0.14.0-SNAPSHOT.jar [INFO] [INFO] --- maven-site-plugin:3.3:attach-descriptor (attach-descriptor) @ hive-hwi --- [INFO] [INFO] --- maven-install-plugin:2.4:install (default-install) @ hive-hwi --- [INFO] Installing /data/hive-ptest/working/apache-svn-trunk-source/hwi/target/hive-hwi-0.14.0-SNAPSHOT.jar to /data/hive-ptest/working/maven/org/apache/hive/hive-hwi/0.14.0-SNAPSHOT/hive-hwi-0.14.0-SNAPSHOT.jar [INFO] Installing /data/hive-ptest/working/apache-svn-trunk-source/hwi/pom.xml to /data/hive-ptest/working/maven/org/apache/hive/hive-hwi/0.14.0-SNAPSHOT/hive-hwi-0.14.0-SNAPSHOT.pom [INFO] [INFO] ------------------------------------------------------------------------ [INFO] Building Hive ODBC 0.14.0-SNAPSHOT [INFO] ------------------------------------------------------------------------ [INFO] [INFO] --- maven-clean-plugin:2.5:clean (default-clean) @ hive-odbc --- [INFO] Deleting /data/hive-ptest/working/apache-svn-trunk-source/odbc (includes = [datanucleus.log, derby.log], excludes = []) [INFO] [INFO] --- maven-remote-resources-plugin:1.5:process (default) @ hive-odbc --- [INFO] [INFO] --- maven-antrun-plugin:1.7:run (define-classpath) @ hive-odbc --- [INFO] Executing tasks main: [INFO] Executed tasks [INFO] [INFO] --- maven-antrun-plugin:1.7:run (setup-test-dirs) @ hive-odbc --- [INFO] Executing tasks main: [mkdir] Created dir: /data/hive-ptest/working/apache-svn-trunk-source/odbc/target/tmp [mkdir] Created dir: /data/hive-ptest/working/apache-svn-trunk-source/odbc/target/warehouse [mkdir] Created dir: /data/hive-ptest/working/apache-svn-trunk-source/odbc/target/tmp/conf [copy] Copying 5 files to /data/hive-ptest/working/apache-svn-trunk-source/odbc/target/tmp/conf [INFO] Executed tasks [INFO] [INFO] --- maven-site-plugin:3.3:attach-descriptor (attach-descriptor) @ hive-odbc --- [INFO] [INFO] --- maven-install-plugin:2.4:install (default-install) @ hive-odbc --- [INFO] Installing /data/hive-ptest/working/apache-svn-trunk-source/odbc/pom.xml to /data/hive-ptest/working/maven/org/apache/hive/hive-odbc/0.14.0-SNAPSHOT/hive-odbc-0.14.0-SNAPSHOT.pom [INFO] [INFO] ------------------------------------------------------------------------ [INFO] Building Hive Shims Aggregator 0.14.0-SNAPSHOT [INFO] ------------------------------------------------------------------------ [INFO] [INFO] --- maven-clean-plugin:2.5:clean (default-clean) @ hive-shims-aggregator --- [INFO] Deleting /data/hive-ptest/working/apache-svn-trunk-source/shims (includes = [datanucleus.log, derby.log], excludes = []) [INFO] [INFO] --- maven-remote-resources-plugin:1.5:process (default) @ hive-shims-aggregator --- [INFO] [INFO] --- maven-antrun-plugin:1.7:run (define-classpath) @ hive-shims-aggregator --- [INFO] Executing tasks main: [INFO] Executed tasks [INFO] [INFO] --- maven-antrun-plugin:1.7:run (setup-test-dirs) @ hive-shims-aggregator --- [INFO] Executing tasks main: [mkdir] Created dir: /data/hive-ptest/working/apache-svn-trunk-source/shims/target/tmp [mkdir] Created dir: /data/hive-ptest/working/apache-svn-trunk-source/shims/target/warehouse [mkdir] Created dir: /data/hive-ptest/working/apache-svn-trunk-source/shims/target/tmp/conf [copy] Copying 5 files to /data/hive-ptest/working/apache-svn-trunk-source/shims/target/tmp/conf [INFO] Executed tasks [INFO] [INFO] --- maven-site-plugin:3.3:attach-descriptor (attach-descriptor) @ hive-shims-aggregator --- [INFO] [INFO] --- maven-install-plugin:2.4:install (default-install) @ hive-shims-aggregator --- [INFO] Installing /data/hive-ptest/working/apache-svn-trunk-source/shims/pom.xml to /data/hive-ptest/working/maven/org/apache/hive/hive-shims-aggregator/0.14.0-SNAPSHOT/hive-shims-aggregator-0.14.0-SNAPSHOT.pom [INFO] [INFO] ------------------------------------------------------------------------ [INFO] Building Hive TestUtils 0.14.0-SNAPSHOT [INFO] ------------------------------------------------------------------------ [INFO] [INFO] --- maven-clean-plugin:2.5:clean (default-clean) @ hive-testutils --- [INFO] Deleting /data/hive-ptest/working/apache-svn-trunk-source/testutils (includes = [datanucleus.log, derby.log], excludes = []) [INFO] [INFO] --- maven-remote-resources-plugin:1.5:process (default) @ hive-testutils --- [INFO] [INFO] --- maven-resources-plugin:2.6:resources (default-resources) @ hive-testutils --- [INFO] Using 'UTF-8' encoding to copy filtered resources. [INFO] skip non existing resourceDirectory /data/hive-ptest/working/apache-svn-trunk-source/testutils/src/main/resources [INFO] Copying 3 resources [INFO] [INFO] --- maven-antrun-plugin:1.7:run (define-classpath) @ hive-testutils --- [INFO] Executing tasks main: [INFO] Executed tasks [INFO] [INFO] --- maven-compiler-plugin:3.1:compile (default-compile) @ hive-testutils --- [INFO] Compiling 2 source files to /data/hive-ptest/working/apache-svn-trunk-source/testutils/target/classes [INFO] [INFO] --- maven-resources-plugin:2.6:testResources (default-testResources) @ hive-testutils --- [INFO] Using 'UTF-8' encoding to copy filtered resources. [INFO] skip non existing resourceDirectory /data/hive-ptest/working/apache-svn-trunk-source/testutils/src/test/resources [INFO] Copying 3 resources [INFO] [INFO] --- maven-antrun-plugin:1.7:run (setup-test-dirs) @ hive-testutils --- [INFO] Executing tasks main: [mkdir] Created dir: /data/hive-ptest/working/apache-svn-trunk-source/testutils/target/tmp [mkdir] Created dir: /data/hive-ptest/working/apache-svn-trunk-source/testutils/target/warehouse [mkdir] Created dir: /data/hive-ptest/working/apache-svn-trunk-source/testutils/target/tmp/conf [copy] Copying 5 files to /data/hive-ptest/working/apache-svn-trunk-source/testutils/target/tmp/conf [INFO] Executed tasks [INFO] [INFO] --- maven-compiler-plugin:3.1:testCompile (default-testCompile) @ hive-testutils --- [INFO] No sources to compile [INFO] [INFO] --- maven-surefire-plugin:2.16:test (default-test) @ hive-testutils --- [INFO] Tests are skipped. [INFO] [INFO] --- maven-jar-plugin:2.2:jar (default-jar) @ hive-testutils --- [INFO] Building jar: /data/hive-ptest/working/apache-svn-trunk-source/testutils/target/hive-testutils-0.14.0-SNAPSHOT.jar [INFO] [INFO] --- maven-site-plugin:3.3:attach-descriptor (attach-descriptor) @ hive-testutils --- [INFO] [INFO] --- maven-install-plugin:2.4:install (default-install) @ hive-testutils --- [INFO] Installing /data/hive-ptest/working/apache-svn-trunk-source/testutils/target/hive-testutils-0.14.0-SNAPSHOT.jar to /data/hive-ptest/working/maven/org/apache/hive/hive-testutils/0.14.0-SNAPSHOT/hive-testutils-0.14.0-SNAPSHOT.jar [INFO] Installing /data/hive-ptest/working/apache-svn-trunk-source/testutils/pom.xml to /data/hive-ptest/working/maven/org/apache/hive/hive-testutils/0.14.0-SNAPSHOT/hive-testutils-0.14.0-SNAPSHOT.pom [INFO] [INFO] ------------------------------------------------------------------------ [INFO] Building Hive Packaging 0.14.0-SNAPSHOT [INFO] ------------------------------------------------------------------------ Downloading: http://repository.apache.org/snapshots/org/apache/hive/hcatalog/hive-hcatalog-hbase-storage-handler/0.14.0-SNAPSHOT/maven-metadata.xml Downloading: http://repository.apache.org/snapshots/org/apache/hive/hcatalog/hive-hcatalog-hbase-storage-handler/0.14.0-SNAPSHOT/hive-hcatalog-hbase-storage-handler-0.14.0-SNAPSHOT.pom [WARNING] The POM for org.apache.hive.hcatalog:hive-hcatalog-hbase-storage-handler:jar:0.14.0-SNAPSHOT is missing, no dependency information available Downloading: http://repository.apache.org/snapshots/org/apache/hive/hcatalog/hive-hcatalog-hbase-storage-handler/0.14.0-SNAPSHOT/hive-hcatalog-hbase-storage-handler-0.14.0-SNAPSHOT.jar [INFO] ------------------------------------------------------------------------ [INFO] Reactor Summary: [INFO] [INFO] Hive .............................................. SUCCESS [8.585s] [INFO] Hive Ant Utilities ................................ SUCCESS [5.340s] [INFO] Hive Shims Common ................................. SUCCESS [3.698s] [INFO] Hive Shims 0.20 ................................... SUCCESS [2.469s] [INFO] Hive Shims Secure Common .......................... SUCCESS [4.373s] [INFO] Hive Shims 0.20S .................................. SUCCESS [2.644s] [INFO] Hive Shims 0.23 ................................... SUCCESS [8.083s] [INFO] Hive Shims ........................................ SUCCESS [1.302s] [INFO] Hive Common ....................................... SUCCESS [6.758s] [INFO] Hive Serde ........................................ SUCCESS [10.735s] [INFO] Hive Metastore .................................... SUCCESS [32.370s] [INFO] Hive Query Language ............................... SUCCESS [1:17.707s] [INFO] Hive Service ...................................... SUCCESS [8.422s] [INFO] Hive JDBC ......................................... SUCCESS [2.987s] [INFO] Hive Beeline ...................................... SUCCESS [2.791s] [INFO] Hive CLI .......................................... SUCCESS [1.907s] [INFO] Hive Contrib ...................................... SUCCESS [2.379s] [INFO] Hive HBase Handler ................................ SUCCESS [2.725s] [INFO] Hive HCatalog ..................................... SUCCESS [0.502s] [INFO] Hive HCatalog Core ................................ SUCCESS [1.891s] [INFO] Hive HCatalog Pig Adapter ......................... SUCCESS [2.392s] [INFO] Hive HCatalog Server Extensions ................... SUCCESS [1.258s] [INFO] Hive HCatalog Webhcat Java Client ................. SUCCESS [2.197s] [INFO] Hive HCatalog Webhcat ............................. SUCCESS [9.940s] [INFO] Hive HWI .......................................... SUCCESS [1.138s] [INFO] Hive ODBC ......................................... SUCCESS [0.876s] [INFO] Hive Shims Aggregator ............................. SUCCESS [0.201s] [INFO] Hive TestUtils .................................... SUCCESS [0.658s] [INFO] Hive Packaging .................................... FAILURE [1.747s] [INFO] ------------------------------------------------------------------------ [INFO] BUILD FAILURE [INFO] ------------------------------------------------------------------------ [INFO] Total time: 3:32.626s [INFO] Finished at: Sat Mar 15 13:32:01 EDT 2014 [INFO] Final Memory: 74M/422M [INFO] ------------------------------------------------------------------------ [ERROR] Failed to execute goal on project hive-packaging: Could not resolve dependencies for project org.apache.hive:hive-packaging:pom:0.14.0-SNAPSHOT: Could not find artifact org.apache.hive.hcatalog:hive-hcatalog-hbase-storage-handler:jar:0.14.0-SNAPSHOT in apache.snapshots (http://repository.apache.org/snapshots) -> [Help 1] [ERROR] [ERROR] To see the full stack trace of the errors, re-run Maven with the -e switch. [ERROR] Re-run Maven using the -X switch to enable full debug logging. [ERROR] [ERROR] For more information about the errors and possible solutions, please read the following articles: [ERROR] [Help 1] http://cwiki.apache.org/confluence/display/MAVEN/DependencyResolutionException [ERROR] [ERROR] After correcting the problems, you can resume the build with the command [ERROR] mvn <goals> -rf :hive-packaging + exit 1 ' This message is automatically generated. ATTACHMENT ID: 12634906
        Hide
        Hive QA added a comment -

        Overall: -1 no tests executed

        Here are the results of testing the latest attachment:
        https://issues.apache.org/jira/secure/attachment/12634939/HIVE-6680.1.patch

        Test results: http://bigtop01.cloudera.org:8080/job/PreCommit-HIVE-Build/1844/testReport
        Console output: http://bigtop01.cloudera.org:8080/job/PreCommit-HIVE-Build/1844/console

        Messages:

        **** This message was trimmed, see log for full details ****
        [INFO] Using 'UTF-8' encoding to copy filtered resources.
        [INFO] skip non existing resourceDirectory /data/hive-ptest/working/apache-svn-trunk-source/hwi/src/test/resources
        [INFO] Copying 3 resources
        [INFO] 
        [INFO] --- maven-antrun-plugin:1.7:run (setup-test-dirs) @ hive-hwi ---
        [INFO] Executing tasks
        
        main:
            [mkdir] Created dir: /data/hive-ptest/working/apache-svn-trunk-source/hwi/target/tmp
            [mkdir] Created dir: /data/hive-ptest/working/apache-svn-trunk-source/hwi/target/warehouse
            [mkdir] Created dir: /data/hive-ptest/working/apache-svn-trunk-source/hwi/target/tmp/conf
             [copy] Copying 5 files to /data/hive-ptest/working/apache-svn-trunk-source/hwi/target/tmp/conf
        [INFO] Executed tasks
        [INFO] 
        [INFO] --- maven-compiler-plugin:3.1:testCompile (default-testCompile) @ hive-hwi ---
        [INFO] Compiling 2 source files to /data/hive-ptest/working/apache-svn-trunk-source/hwi/target/test-classes
        [INFO] 
        [INFO] --- maven-surefire-plugin:2.16:test (default-test) @ hive-hwi ---
        [INFO] Tests are skipped.
        [INFO] 
        [INFO] --- maven-jar-plugin:2.2:jar (default-jar) @ hive-hwi ---
        [INFO] Building jar: /data/hive-ptest/working/apache-svn-trunk-source/hwi/target/hive-hwi-0.14.0-SNAPSHOT.jar
        [INFO] 
        [INFO] --- maven-site-plugin:3.3:attach-descriptor (attach-descriptor) @ hive-hwi ---
        [INFO] 
        [INFO] --- maven-install-plugin:2.4:install (default-install) @ hive-hwi ---
        [INFO] Installing /data/hive-ptest/working/apache-svn-trunk-source/hwi/target/hive-hwi-0.14.0-SNAPSHOT.jar to /data/hive-ptest/working/maven/org/apache/hive/hive-hwi/0.14.0-SNAPSHOT/hive-hwi-0.14.0-SNAPSHOT.jar
        [INFO] Installing /data/hive-ptest/working/apache-svn-trunk-source/hwi/pom.xml to /data/hive-ptest/working/maven/org/apache/hive/hive-hwi/0.14.0-SNAPSHOT/hive-hwi-0.14.0-SNAPSHOT.pom
        [INFO]                                                                         
        [INFO] ------------------------------------------------------------------------
        [INFO] Building Hive ODBC 0.14.0-SNAPSHOT
        [INFO] ------------------------------------------------------------------------
        [INFO] 
        [INFO] --- maven-clean-plugin:2.5:clean (default-clean) @ hive-odbc ---
        [INFO] Deleting /data/hive-ptest/working/apache-svn-trunk-source/odbc (includes = [datanucleus.log, derby.log], excludes = [])
        [INFO] 
        [INFO] --- maven-remote-resources-plugin:1.5:process (default) @ hive-odbc ---
        [INFO] 
        [INFO] --- maven-antrun-plugin:1.7:run (define-classpath) @ hive-odbc ---
        [INFO] Executing tasks
        
        main:
        [INFO] Executed tasks
        [INFO] 
        [INFO] --- maven-antrun-plugin:1.7:run (setup-test-dirs) @ hive-odbc ---
        [INFO] Executing tasks
        
        main:
            [mkdir] Created dir: /data/hive-ptest/working/apache-svn-trunk-source/odbc/target/tmp
            [mkdir] Created dir: /data/hive-ptest/working/apache-svn-trunk-source/odbc/target/warehouse
            [mkdir] Created dir: /data/hive-ptest/working/apache-svn-trunk-source/odbc/target/tmp/conf
             [copy] Copying 5 files to /data/hive-ptest/working/apache-svn-trunk-source/odbc/target/tmp/conf
        [INFO] Executed tasks
        [INFO] 
        [INFO] --- maven-site-plugin:3.3:attach-descriptor (attach-descriptor) @ hive-odbc ---
        [INFO] 
        [INFO] --- maven-install-plugin:2.4:install (default-install) @ hive-odbc ---
        [INFO] Installing /data/hive-ptest/working/apache-svn-trunk-source/odbc/pom.xml to /data/hive-ptest/working/maven/org/apache/hive/hive-odbc/0.14.0-SNAPSHOT/hive-odbc-0.14.0-SNAPSHOT.pom
        [INFO]                                                                         
        [INFO] ------------------------------------------------------------------------
        [INFO] Building Hive Shims Aggregator 0.14.0-SNAPSHOT
        [INFO] ------------------------------------------------------------------------
        [INFO] 
        [INFO] --- maven-clean-plugin:2.5:clean (default-clean) @ hive-shims-aggregator ---
        [INFO] Deleting /data/hive-ptest/working/apache-svn-trunk-source/shims (includes = [datanucleus.log, derby.log], excludes = [])
        [INFO] 
        [INFO] --- maven-remote-resources-plugin:1.5:process (default) @ hive-shims-aggregator ---
        [INFO] 
        [INFO] --- maven-antrun-plugin:1.7:run (define-classpath) @ hive-shims-aggregator ---
        [INFO] Executing tasks
        
        main:
        [INFO] Executed tasks
        [INFO] 
        [INFO] --- maven-antrun-plugin:1.7:run (setup-test-dirs) @ hive-shims-aggregator ---
        [INFO] Executing tasks
        
        main:
            [mkdir] Created dir: /data/hive-ptest/working/apache-svn-trunk-source/shims/target/tmp
            [mkdir] Created dir: /data/hive-ptest/working/apache-svn-trunk-source/shims/target/warehouse
            [mkdir] Created dir: /data/hive-ptest/working/apache-svn-trunk-source/shims/target/tmp/conf
             [copy] Copying 5 files to /data/hive-ptest/working/apache-svn-trunk-source/shims/target/tmp/conf
        [INFO] Executed tasks
        [INFO] 
        [INFO] --- maven-site-plugin:3.3:attach-descriptor (attach-descriptor) @ hive-shims-aggregator ---
        [INFO] 
        [INFO] --- maven-install-plugin:2.4:install (default-install) @ hive-shims-aggregator ---
        [INFO] Installing /data/hive-ptest/working/apache-svn-trunk-source/shims/pom.xml to /data/hive-ptest/working/maven/org/apache/hive/hive-shims-aggregator/0.14.0-SNAPSHOT/hive-shims-aggregator-0.14.0-SNAPSHOT.pom
        [INFO]                                                                         
        [INFO] ------------------------------------------------------------------------
        [INFO] Building Hive TestUtils 0.14.0-SNAPSHOT
        [INFO] ------------------------------------------------------------------------
        [INFO] 
        [INFO] --- maven-clean-plugin:2.5:clean (default-clean) @ hive-testutils ---
        [INFO] Deleting /data/hive-ptest/working/apache-svn-trunk-source/testutils (includes = [datanucleus.log, derby.log], excludes = [])
        [INFO] 
        [INFO] --- maven-remote-resources-plugin:1.5:process (default) @ hive-testutils ---
        [INFO] 
        [INFO] --- maven-resources-plugin:2.6:resources (default-resources) @ hive-testutils ---
        [INFO] Using 'UTF-8' encoding to copy filtered resources.
        [INFO] skip non existing resourceDirectory /data/hive-ptest/working/apache-svn-trunk-source/testutils/src/main/resources
        [INFO] Copying 3 resources
        [INFO] 
        [INFO] --- maven-antrun-plugin:1.7:run (define-classpath) @ hive-testutils ---
        [INFO] Executing tasks
        
        main:
        [INFO] Executed tasks
        [INFO] 
        [INFO] --- maven-compiler-plugin:3.1:compile (default-compile) @ hive-testutils ---
        [INFO] Compiling 2 source files to /data/hive-ptest/working/apache-svn-trunk-source/testutils/target/classes
        [INFO] 
        [INFO] --- maven-resources-plugin:2.6:testResources (default-testResources) @ hive-testutils ---
        [INFO] Using 'UTF-8' encoding to copy filtered resources.
        [INFO] skip non existing resourceDirectory /data/hive-ptest/working/apache-svn-trunk-source/testutils/src/test/resources
        [INFO] Copying 3 resources
        [INFO] 
        [INFO] --- maven-antrun-plugin:1.7:run (setup-test-dirs) @ hive-testutils ---
        [INFO] Executing tasks
        
        main:
            [mkdir] Created dir: /data/hive-ptest/working/apache-svn-trunk-source/testutils/target/tmp
            [mkdir] Created dir: /data/hive-ptest/working/apache-svn-trunk-source/testutils/target/warehouse
            [mkdir] Created dir: /data/hive-ptest/working/apache-svn-trunk-source/testutils/target/tmp/conf
             [copy] Copying 5 files to /data/hive-ptest/working/apache-svn-trunk-source/testutils/target/tmp/conf
        [INFO] Executed tasks
        [INFO] 
        [INFO] --- maven-compiler-plugin:3.1:testCompile (default-testCompile) @ hive-testutils ---
        [INFO] No sources to compile
        [INFO] 
        [INFO] --- maven-surefire-plugin:2.16:test (default-test) @ hive-testutils ---
        [INFO] Tests are skipped.
        [INFO] 
        [INFO] --- maven-jar-plugin:2.2:jar (default-jar) @ hive-testutils ---
        [INFO] Building jar: /data/hive-ptest/working/apache-svn-trunk-source/testutils/target/hive-testutils-0.14.0-SNAPSHOT.jar
        [INFO] 
        [INFO] --- maven-site-plugin:3.3:attach-descriptor (attach-descriptor) @ hive-testutils ---
        [INFO] 
        [INFO] --- maven-install-plugin:2.4:install (default-install) @ hive-testutils ---
        [INFO] Installing /data/hive-ptest/working/apache-svn-trunk-source/testutils/target/hive-testutils-0.14.0-SNAPSHOT.jar to /data/hive-ptest/working/maven/org/apache/hive/hive-testutils/0.14.0-SNAPSHOT/hive-testutils-0.14.0-SNAPSHOT.jar
        [INFO] Installing /data/hive-ptest/working/apache-svn-trunk-source/testutils/pom.xml to /data/hive-ptest/working/maven/org/apache/hive/hive-testutils/0.14.0-SNAPSHOT/hive-testutils-0.14.0-SNAPSHOT.pom
        [INFO]                                                                         
        [INFO] ------------------------------------------------------------------------
        [INFO] Building Hive Packaging 0.14.0-SNAPSHOT
        [INFO] ------------------------------------------------------------------------
        Downloading: http://repository.apache.org/snapshots/org/apache/hive/hcatalog/hive-hcatalog-hbase-storage-handler/0.14.0-SNAPSHOT/maven-metadata.xml
        Downloading: http://repository.apache.org/snapshots/org/apache/hive/hcatalog/hive-hcatalog-hbase-storage-handler/0.14.0-SNAPSHOT/hive-hcatalog-hbase-storage-handler-0.14.0-SNAPSHOT.pom
        [WARNING] The POM for org.apache.hive.hcatalog:hive-hcatalog-hbase-storage-handler:jar:0.14.0-SNAPSHOT is missing, no dependency information available
        Downloading: http://repository.apache.org/snapshots/org/apache/hive/hcatalog/hive-hcatalog-hbase-storage-handler/0.14.0-SNAPSHOT/hive-hcatalog-hbase-storage-handler-0.14.0-SNAPSHOT.jar
        [INFO] ------------------------------------------------------------------------
        [INFO] Reactor Summary:
        [INFO] 
        [INFO] Hive .............................................. SUCCESS [8.907s]
        [INFO] Hive Ant Utilities ................................ SUCCESS [6.009s]
        [INFO] Hive Shims Common ................................. SUCCESS [3.679s]
        [INFO] Hive Shims 0.20 ................................... SUCCESS [2.466s]
        [INFO] Hive Shims Secure Common .......................... SUCCESS [4.233s]
        [INFO] Hive Shims 0.20S .................................. SUCCESS [3.037s]
        [INFO] Hive Shims 0.23 ................................... SUCCESS [7.596s]
        [INFO] Hive Shims ........................................ SUCCESS [0.824s]
        [INFO] Hive Common ....................................... SUCCESS [6.801s]
        [INFO] Hive Serde ........................................ SUCCESS [9.826s]
        [INFO] Hive Metastore .................................... SUCCESS [32.381s]
        [INFO] Hive Query Language ............................... SUCCESS [1:21.168s]
        [INFO] Hive Service ...................................... SUCCESS [7.410s]
        [INFO] Hive JDBC ......................................... SUCCESS [3.068s]
        [INFO] Hive Beeline ...................................... SUCCESS [2.708s]
        [INFO] Hive CLI .......................................... SUCCESS [1.791s]
        [INFO] Hive Contrib ...................................... SUCCESS [2.449s]
        [INFO] Hive HBase Handler ................................ SUCCESS [2.687s]
        [INFO] Hive HCatalog ..................................... SUCCESS [0.536s]
        [INFO] Hive HCatalog Core ................................ SUCCESS [2.828s]
        [INFO] Hive HCatalog Pig Adapter ......................... SUCCESS [2.481s]
        [INFO] Hive HCatalog Server Extensions ................... SUCCESS [1.257s]
        [INFO] Hive HCatalog Webhcat Java Client ................. SUCCESS [2.110s]
        [INFO] Hive HCatalog Webhcat ............................. SUCCESS [9.975s]
        [INFO] Hive HWI .......................................... SUCCESS [1.212s]
        [INFO] Hive ODBC ......................................... SUCCESS [0.805s]
        [INFO] Hive Shims Aggregator ............................. SUCCESS [0.194s]
        [INFO] Hive TestUtils .................................... SUCCESS [0.651s]
        [INFO] Hive Packaging .................................... FAILURE [1.184s]
        [INFO] ------------------------------------------------------------------------
        [INFO] BUILD FAILURE
        [INFO] ------------------------------------------------------------------------
        [INFO] Total time: 3:34.922s
        [INFO] Finished at: Sat Mar 15 18:03:49 EDT 2014
        [INFO] Final Memory: 74M/553M
        [INFO] ------------------------------------------------------------------------
        [ERROR] Failed to execute goal on project hive-packaging: Could not resolve dependencies for project org.apache.hive:hive-packaging:pom:0.14.0-SNAPSHOT: Could not find artifact org.apache.hive.hcatalog:hive-hcatalog-hbase-storage-handler:jar:0.14.0-SNAPSHOT in apache.snapshots (http://repository.apache.org/snapshots) -> [Help 1]
        [ERROR] 
        [ERROR] To see the full stack trace of the errors, re-run Maven with the -e switch.
        [ERROR] Re-run Maven using the -X switch to enable full debug logging.
        [ERROR] 
        [ERROR] For more information about the errors and possible solutions, please read the following articles:
        [ERROR] [Help 1] http://cwiki.apache.org/confluence/display/MAVEN/DependencyResolutionException
        [ERROR] 
        [ERROR] After correcting the problems, you can resume the build with the command
        [ERROR]   mvn <goals> -rf :hive-packaging
        + exit 1
        '
        

        This message is automatically generated.

        ATTACHMENT ID: 12634939

        Show
        Hive QA added a comment - Overall : -1 no tests executed Here are the results of testing the latest attachment: https://issues.apache.org/jira/secure/attachment/12634939/HIVE-6680.1.patch Test results: http://bigtop01.cloudera.org:8080/job/PreCommit-HIVE-Build/1844/testReport Console output: http://bigtop01.cloudera.org:8080/job/PreCommit-HIVE-Build/1844/console Messages: **** This message was trimmed, see log for full details **** [INFO] Using 'UTF-8' encoding to copy filtered resources. [INFO] skip non existing resourceDirectory /data/hive-ptest/working/apache-svn-trunk-source/hwi/src/test/resources [INFO] Copying 3 resources [INFO] [INFO] --- maven-antrun-plugin:1.7:run (setup-test-dirs) @ hive-hwi --- [INFO] Executing tasks main: [mkdir] Created dir: /data/hive-ptest/working/apache-svn-trunk-source/hwi/target/tmp [mkdir] Created dir: /data/hive-ptest/working/apache-svn-trunk-source/hwi/target/warehouse [mkdir] Created dir: /data/hive-ptest/working/apache-svn-trunk-source/hwi/target/tmp/conf [copy] Copying 5 files to /data/hive-ptest/working/apache-svn-trunk-source/hwi/target/tmp/conf [INFO] Executed tasks [INFO] [INFO] --- maven-compiler-plugin:3.1:testCompile (default-testCompile) @ hive-hwi --- [INFO] Compiling 2 source files to /data/hive-ptest/working/apache-svn-trunk-source/hwi/target/test-classes [INFO] [INFO] --- maven-surefire-plugin:2.16:test (default-test) @ hive-hwi --- [INFO] Tests are skipped. [INFO] [INFO] --- maven-jar-plugin:2.2:jar (default-jar) @ hive-hwi --- [INFO] Building jar: /data/hive-ptest/working/apache-svn-trunk-source/hwi/target/hive-hwi-0.14.0-SNAPSHOT.jar [INFO] [INFO] --- maven-site-plugin:3.3:attach-descriptor (attach-descriptor) @ hive-hwi --- [INFO] [INFO] --- maven-install-plugin:2.4:install (default-install) @ hive-hwi --- [INFO] Installing /data/hive-ptest/working/apache-svn-trunk-source/hwi/target/hive-hwi-0.14.0-SNAPSHOT.jar to /data/hive-ptest/working/maven/org/apache/hive/hive-hwi/0.14.0-SNAPSHOT/hive-hwi-0.14.0-SNAPSHOT.jar [INFO] Installing /data/hive-ptest/working/apache-svn-trunk-source/hwi/pom.xml to /data/hive-ptest/working/maven/org/apache/hive/hive-hwi/0.14.0-SNAPSHOT/hive-hwi-0.14.0-SNAPSHOT.pom [INFO] [INFO] ------------------------------------------------------------------------ [INFO] Building Hive ODBC 0.14.0-SNAPSHOT [INFO] ------------------------------------------------------------------------ [INFO] [INFO] --- maven-clean-plugin:2.5:clean (default-clean) @ hive-odbc --- [INFO] Deleting /data/hive-ptest/working/apache-svn-trunk-source/odbc (includes = [datanucleus.log, derby.log], excludes = []) [INFO] [INFO] --- maven-remote-resources-plugin:1.5:process (default) @ hive-odbc --- [INFO] [INFO] --- maven-antrun-plugin:1.7:run (define-classpath) @ hive-odbc --- [INFO] Executing tasks main: [INFO] Executed tasks [INFO] [INFO] --- maven-antrun-plugin:1.7:run (setup-test-dirs) @ hive-odbc --- [INFO] Executing tasks main: [mkdir] Created dir: /data/hive-ptest/working/apache-svn-trunk-source/odbc/target/tmp [mkdir] Created dir: /data/hive-ptest/working/apache-svn-trunk-source/odbc/target/warehouse [mkdir] Created dir: /data/hive-ptest/working/apache-svn-trunk-source/odbc/target/tmp/conf [copy] Copying 5 files to /data/hive-ptest/working/apache-svn-trunk-source/odbc/target/tmp/conf [INFO] Executed tasks [INFO] [INFO] --- maven-site-plugin:3.3:attach-descriptor (attach-descriptor) @ hive-odbc --- [INFO] [INFO] --- maven-install-plugin:2.4:install (default-install) @ hive-odbc --- [INFO] Installing /data/hive-ptest/working/apache-svn-trunk-source/odbc/pom.xml to /data/hive-ptest/working/maven/org/apache/hive/hive-odbc/0.14.0-SNAPSHOT/hive-odbc-0.14.0-SNAPSHOT.pom [INFO] [INFO] ------------------------------------------------------------------------ [INFO] Building Hive Shims Aggregator 0.14.0-SNAPSHOT [INFO] ------------------------------------------------------------------------ [INFO] [INFO] --- maven-clean-plugin:2.5:clean (default-clean) @ hive-shims-aggregator --- [INFO] Deleting /data/hive-ptest/working/apache-svn-trunk-source/shims (includes = [datanucleus.log, derby.log], excludes = []) [INFO] [INFO] --- maven-remote-resources-plugin:1.5:process (default) @ hive-shims-aggregator --- [INFO] [INFO] --- maven-antrun-plugin:1.7:run (define-classpath) @ hive-shims-aggregator --- [INFO] Executing tasks main: [INFO] Executed tasks [INFO] [INFO] --- maven-antrun-plugin:1.7:run (setup-test-dirs) @ hive-shims-aggregator --- [INFO] Executing tasks main: [mkdir] Created dir: /data/hive-ptest/working/apache-svn-trunk-source/shims/target/tmp [mkdir] Created dir: /data/hive-ptest/working/apache-svn-trunk-source/shims/target/warehouse [mkdir] Created dir: /data/hive-ptest/working/apache-svn-trunk-source/shims/target/tmp/conf [copy] Copying 5 files to /data/hive-ptest/working/apache-svn-trunk-source/shims/target/tmp/conf [INFO] Executed tasks [INFO] [INFO] --- maven-site-plugin:3.3:attach-descriptor (attach-descriptor) @ hive-shims-aggregator --- [INFO] [INFO] --- maven-install-plugin:2.4:install (default-install) @ hive-shims-aggregator --- [INFO] Installing /data/hive-ptest/working/apache-svn-trunk-source/shims/pom.xml to /data/hive-ptest/working/maven/org/apache/hive/hive-shims-aggregator/0.14.0-SNAPSHOT/hive-shims-aggregator-0.14.0-SNAPSHOT.pom [INFO] [INFO] ------------------------------------------------------------------------ [INFO] Building Hive TestUtils 0.14.0-SNAPSHOT [INFO] ------------------------------------------------------------------------ [INFO] [INFO] --- maven-clean-plugin:2.5:clean (default-clean) @ hive-testutils --- [INFO] Deleting /data/hive-ptest/working/apache-svn-trunk-source/testutils (includes = [datanucleus.log, derby.log], excludes = []) [INFO] [INFO] --- maven-remote-resources-plugin:1.5:process (default) @ hive-testutils --- [INFO] [INFO] --- maven-resources-plugin:2.6:resources (default-resources) @ hive-testutils --- [INFO] Using 'UTF-8' encoding to copy filtered resources. [INFO] skip non existing resourceDirectory /data/hive-ptest/working/apache-svn-trunk-source/testutils/src/main/resources [INFO] Copying 3 resources [INFO] [INFO] --- maven-antrun-plugin:1.7:run (define-classpath) @ hive-testutils --- [INFO] Executing tasks main: [INFO] Executed tasks [INFO] [INFO] --- maven-compiler-plugin:3.1:compile (default-compile) @ hive-testutils --- [INFO] Compiling 2 source files to /data/hive-ptest/working/apache-svn-trunk-source/testutils/target/classes [INFO] [INFO] --- maven-resources-plugin:2.6:testResources (default-testResources) @ hive-testutils --- [INFO] Using 'UTF-8' encoding to copy filtered resources. [INFO] skip non existing resourceDirectory /data/hive-ptest/working/apache-svn-trunk-source/testutils/src/test/resources [INFO] Copying 3 resources [INFO] [INFO] --- maven-antrun-plugin:1.7:run (setup-test-dirs) @ hive-testutils --- [INFO] Executing tasks main: [mkdir] Created dir: /data/hive-ptest/working/apache-svn-trunk-source/testutils/target/tmp [mkdir] Created dir: /data/hive-ptest/working/apache-svn-trunk-source/testutils/target/warehouse [mkdir] Created dir: /data/hive-ptest/working/apache-svn-trunk-source/testutils/target/tmp/conf [copy] Copying 5 files to /data/hive-ptest/working/apache-svn-trunk-source/testutils/target/tmp/conf [INFO] Executed tasks [INFO] [INFO] --- maven-compiler-plugin:3.1:testCompile (default-testCompile) @ hive-testutils --- [INFO] No sources to compile [INFO] [INFO] --- maven-surefire-plugin:2.16:test (default-test) @ hive-testutils --- [INFO] Tests are skipped. [INFO] [INFO] --- maven-jar-plugin:2.2:jar (default-jar) @ hive-testutils --- [INFO] Building jar: /data/hive-ptest/working/apache-svn-trunk-source/testutils/target/hive-testutils-0.14.0-SNAPSHOT.jar [INFO] [INFO] --- maven-site-plugin:3.3:attach-descriptor (attach-descriptor) @ hive-testutils --- [INFO] [INFO] --- maven-install-plugin:2.4:install (default-install) @ hive-testutils --- [INFO] Installing /data/hive-ptest/working/apache-svn-trunk-source/testutils/target/hive-testutils-0.14.0-SNAPSHOT.jar to /data/hive-ptest/working/maven/org/apache/hive/hive-testutils/0.14.0-SNAPSHOT/hive-testutils-0.14.0-SNAPSHOT.jar [INFO] Installing /data/hive-ptest/working/apache-svn-trunk-source/testutils/pom.xml to /data/hive-ptest/working/maven/org/apache/hive/hive-testutils/0.14.0-SNAPSHOT/hive-testutils-0.14.0-SNAPSHOT.pom [INFO] [INFO] ------------------------------------------------------------------------ [INFO] Building Hive Packaging 0.14.0-SNAPSHOT [INFO] ------------------------------------------------------------------------ Downloading: http://repository.apache.org/snapshots/org/apache/hive/hcatalog/hive-hcatalog-hbase-storage-handler/0.14.0-SNAPSHOT/maven-metadata.xml Downloading: http://repository.apache.org/snapshots/org/apache/hive/hcatalog/hive-hcatalog-hbase-storage-handler/0.14.0-SNAPSHOT/hive-hcatalog-hbase-storage-handler-0.14.0-SNAPSHOT.pom [WARNING] The POM for org.apache.hive.hcatalog:hive-hcatalog-hbase-storage-handler:jar:0.14.0-SNAPSHOT is missing, no dependency information available Downloading: http://repository.apache.org/snapshots/org/apache/hive/hcatalog/hive-hcatalog-hbase-storage-handler/0.14.0-SNAPSHOT/hive-hcatalog-hbase-storage-handler-0.14.0-SNAPSHOT.jar [INFO] ------------------------------------------------------------------------ [INFO] Reactor Summary: [INFO] [INFO] Hive .............................................. SUCCESS [8.907s] [INFO] Hive Ant Utilities ................................ SUCCESS [6.009s] [INFO] Hive Shims Common ................................. SUCCESS [3.679s] [INFO] Hive Shims 0.20 ................................... SUCCESS [2.466s] [INFO] Hive Shims Secure Common .......................... SUCCESS [4.233s] [INFO] Hive Shims 0.20S .................................. SUCCESS [3.037s] [INFO] Hive Shims 0.23 ................................... SUCCESS [7.596s] [INFO] Hive Shims ........................................ SUCCESS [0.824s] [INFO] Hive Common ....................................... SUCCESS [6.801s] [INFO] Hive Serde ........................................ SUCCESS [9.826s] [INFO] Hive Metastore .................................... SUCCESS [32.381s] [INFO] Hive Query Language ............................... SUCCESS [1:21.168s] [INFO] Hive Service ...................................... SUCCESS [7.410s] [INFO] Hive JDBC ......................................... SUCCESS [3.068s] [INFO] Hive Beeline ...................................... SUCCESS [2.708s] [INFO] Hive CLI .......................................... SUCCESS [1.791s] [INFO] Hive Contrib ...................................... SUCCESS [2.449s] [INFO] Hive HBase Handler ................................ SUCCESS [2.687s] [INFO] Hive HCatalog ..................................... SUCCESS [0.536s] [INFO] Hive HCatalog Core ................................ SUCCESS [2.828s] [INFO] Hive HCatalog Pig Adapter ......................... SUCCESS [2.481s] [INFO] Hive HCatalog Server Extensions ................... SUCCESS [1.257s] [INFO] Hive HCatalog Webhcat Java Client ................. SUCCESS [2.110s] [INFO] Hive HCatalog Webhcat ............................. SUCCESS [9.975s] [INFO] Hive HWI .......................................... SUCCESS [1.212s] [INFO] Hive ODBC ......................................... SUCCESS [0.805s] [INFO] Hive Shims Aggregator ............................. SUCCESS [0.194s] [INFO] Hive TestUtils .................................... SUCCESS [0.651s] [INFO] Hive Packaging .................................... FAILURE [1.184s] [INFO] ------------------------------------------------------------------------ [INFO] BUILD FAILURE [INFO] ------------------------------------------------------------------------ [INFO] Total time: 3:34.922s [INFO] Finished at: Sat Mar 15 18:03:49 EDT 2014 [INFO] Final Memory: 74M/553M [INFO] ------------------------------------------------------------------------ [ERROR] Failed to execute goal on project hive-packaging: Could not resolve dependencies for project org.apache.hive:hive-packaging:pom:0.14.0-SNAPSHOT: Could not find artifact org.apache.hive.hcatalog:hive-hcatalog-hbase-storage-handler:jar:0.14.0-SNAPSHOT in apache.snapshots (http://repository.apache.org/snapshots) -> [Help 1] [ERROR] [ERROR] To see the full stack trace of the errors, re-run Maven with the -e switch. [ERROR] Re-run Maven using the -X switch to enable full debug logging. [ERROR] [ERROR] For more information about the errors and possible solutions, please read the following articles: [ERROR] [Help 1] http://cwiki.apache.org/confluence/display/MAVEN/DependencyResolutionException [ERROR] [ERROR] After correcting the problems, you can resume the build with the command [ERROR] mvn <goals> -rf :hive-packaging + exit 1 ' This message is automatically generated. ATTACHMENT ID: 12634939
        Hide
        Jitendra Nath Pandey added a comment -

        Ran tests locally. Only failures were show_create_table_serde.q and metadata_only_queries_with_filters.q which are unrelated to this patch.

        Show
        Jitendra Nath Pandey added a comment - Ran tests locally. Only failures were show_create_table_serde.q and metadata_only_queries_with_filters.q which are unrelated to this patch.
        Hide
        Jitendra Nath Pandey added a comment -

        Committed to trunk. It is a correctness bug affecting hive-0.13, therefore I will port it to hive-13 branch as well.

        Show
        Jitendra Nath Pandey added a comment - Committed to trunk. It is a correctness bug affecting hive-0.13, therefore I will port it to hive-13 branch as well.

          People

          • Assignee:
            Jitendra Nath Pandey
            Reporter:
            Jitendra Nath Pandey
          • Votes:
            0 Vote for this issue
            Watchers:
            2 Start watching this issue

            Dates

            • Created:
              Updated:
              Resolved:

              Development