Details

    • Type: Bug Bug
    • Status: Resolved
    • Priority: Major Major
    • Resolution: Fixed
    • Affects Version/s: None
    • Fix Version/s: 0.13.0
    • Component/s: None
    • Labels:
      None

      Description

      "show grant on all" is supposed to show all the grants in the system on all the objects. But it fails with NPE with both SQL standard auth, and legacy auth.

      Caused by: java.lang.NullPointerException
              at org.apache.hadoop.hive.metastore.ObjectStore.listPrincipalAllDBGrant(ObjectStore.java:4206)
              at org.apache.hadoop.hive.metastore.ObjectStore.listPrincipalDBGrantsAll(ObjectStore.java:4169)
              at sun.reflect.NativeMethodAccessorImpl.invoke0(Native Method)
              at sun.reflect.NativeMethodAccessorImpl.invoke(NativeMethodAccessorImpl.java:39)
              at sun.reflect.DelegatingMethodAccessorImpl.invoke(DelegatingMethodAccessorImpl.java:25)
              at java.lang.reflect.Method.invoke(Method.java:597)
              at org.apache.hadoop.hive.metastore.RawStoreProxy.invoke(RawStoreProxy.java:108)
              at com.sun.proxy.$Proxy6.listPrincipalDBGrantsAll(Unknown Source)
              at org.apache.hadoop.hive.metastore.HiveMetaStore$HMSHandler.list_db_privileges(HiveMetaStore.java:4295)
              ... 36 more
      
      1. HIVE-6674.2.patch.txt
        10 kB
        Navis
      2. HIVE-6674.1.patch.txt
        10 kB
        Navis

        Issue Links

          Activity

          Thejas M Nair created issue -
          Thejas M Nair made changes -
          Field Original Value New Value
          Link This issue is related to HIVE-6673 [ HIVE-6673 ]
          Hide
          Thejas M Nair added a comment -

          I am not going to be working on this soon, so anyone can feel free to take this on.

          Show
          Thejas M Nair added a comment - I am not going to be working on this soon, so anyone can feel free to take this on.
          Navis made changes -
          Attachment HIVE-6674.1.patch.txt [ 12634911 ]
          Hide
          Navis added a comment -

          I'll take this.

          Show
          Navis added a comment - I'll take this.
          Navis made changes -
          Status Open [ 1 ] Patch Available [ 10002 ]
          Assignee Navis [ navis ]
          Hide
          Hive QA added a comment -

          Overall: -1 no tests executed

          Here are the results of testing the latest attachment:
          https://issues.apache.org/jira/secure/attachment/12634911/HIVE-6674.1.patch.txt

          Test results: http://bigtop01.cloudera.org:8080/job/PreCommit-HIVE-Build/1832/testReport
          Console output: http://bigtop01.cloudera.org:8080/job/PreCommit-HIVE-Build/1832/console

          Messages:

          **** This message was trimmed, see log for full details ****
          [INFO] Using 'UTF-8' encoding to copy filtered resources.
          [INFO] skip non existing resourceDirectory /data/hive-ptest/working/apache-svn-trunk-source/hwi/src/test/resources
          [INFO] Copying 3 resources
          [INFO] 
          [INFO] --- maven-antrun-plugin:1.7:run (setup-test-dirs) @ hive-hwi ---
          [INFO] Executing tasks
          
          main:
              [mkdir] Created dir: /data/hive-ptest/working/apache-svn-trunk-source/hwi/target/tmp
              [mkdir] Created dir: /data/hive-ptest/working/apache-svn-trunk-source/hwi/target/warehouse
              [mkdir] Created dir: /data/hive-ptest/working/apache-svn-trunk-source/hwi/target/tmp/conf
               [copy] Copying 5 files to /data/hive-ptest/working/apache-svn-trunk-source/hwi/target/tmp/conf
          [INFO] Executed tasks
          [INFO] 
          [INFO] --- maven-compiler-plugin:3.1:testCompile (default-testCompile) @ hive-hwi ---
          [INFO] Compiling 2 source files to /data/hive-ptest/working/apache-svn-trunk-source/hwi/target/test-classes
          [INFO] 
          [INFO] --- maven-surefire-plugin:2.16:test (default-test) @ hive-hwi ---
          [INFO] Tests are skipped.
          [INFO] 
          [INFO] --- maven-jar-plugin:2.2:jar (default-jar) @ hive-hwi ---
          [INFO] Building jar: /data/hive-ptest/working/apache-svn-trunk-source/hwi/target/hive-hwi-0.14.0-SNAPSHOT.jar
          [INFO] 
          [INFO] --- maven-site-plugin:3.3:attach-descriptor (attach-descriptor) @ hive-hwi ---
          [INFO] 
          [INFO] --- maven-install-plugin:2.4:install (default-install) @ hive-hwi ---
          [INFO] Installing /data/hive-ptest/working/apache-svn-trunk-source/hwi/target/hive-hwi-0.14.0-SNAPSHOT.jar to /data/hive-ptest/working/maven/org/apache/hive/hive-hwi/0.14.0-SNAPSHOT/hive-hwi-0.14.0-SNAPSHOT.jar
          [INFO] Installing /data/hive-ptest/working/apache-svn-trunk-source/hwi/pom.xml to /data/hive-ptest/working/maven/org/apache/hive/hive-hwi/0.14.0-SNAPSHOT/hive-hwi-0.14.0-SNAPSHOT.pom
          [INFO]                                                                         
          [INFO] ------------------------------------------------------------------------
          [INFO] Building Hive ODBC 0.14.0-SNAPSHOT
          [INFO] ------------------------------------------------------------------------
          [INFO] 
          [INFO] --- maven-clean-plugin:2.5:clean (default-clean) @ hive-odbc ---
          [INFO] Deleting /data/hive-ptest/working/apache-svn-trunk-source/odbc (includes = [datanucleus.log, derby.log], excludes = [])
          [INFO] 
          [INFO] --- maven-remote-resources-plugin:1.5:process (default) @ hive-odbc ---
          [INFO] 
          [INFO] --- maven-antrun-plugin:1.7:run (define-classpath) @ hive-odbc ---
          [INFO] Executing tasks
          
          main:
          [INFO] Executed tasks
          [INFO] 
          [INFO] --- maven-antrun-plugin:1.7:run (setup-test-dirs) @ hive-odbc ---
          [INFO] Executing tasks
          
          main:
              [mkdir] Created dir: /data/hive-ptest/working/apache-svn-trunk-source/odbc/target/tmp
              [mkdir] Created dir: /data/hive-ptest/working/apache-svn-trunk-source/odbc/target/warehouse
              [mkdir] Created dir: /data/hive-ptest/working/apache-svn-trunk-source/odbc/target/tmp/conf
               [copy] Copying 5 files to /data/hive-ptest/working/apache-svn-trunk-source/odbc/target/tmp/conf
          [INFO] Executed tasks
          [INFO] 
          [INFO] --- maven-site-plugin:3.3:attach-descriptor (attach-descriptor) @ hive-odbc ---
          [INFO] 
          [INFO] --- maven-install-plugin:2.4:install (default-install) @ hive-odbc ---
          [INFO] Installing /data/hive-ptest/working/apache-svn-trunk-source/odbc/pom.xml to /data/hive-ptest/working/maven/org/apache/hive/hive-odbc/0.14.0-SNAPSHOT/hive-odbc-0.14.0-SNAPSHOT.pom
          [INFO]                                                                         
          [INFO] ------------------------------------------------------------------------
          [INFO] Building Hive Shims Aggregator 0.14.0-SNAPSHOT
          [INFO] ------------------------------------------------------------------------
          [INFO] 
          [INFO] --- maven-clean-plugin:2.5:clean (default-clean) @ hive-shims-aggregator ---
          [INFO] Deleting /data/hive-ptest/working/apache-svn-trunk-source/shims (includes = [datanucleus.log, derby.log], excludes = [])
          [INFO] 
          [INFO] --- maven-remote-resources-plugin:1.5:process (default) @ hive-shims-aggregator ---
          [INFO] 
          [INFO] --- maven-antrun-plugin:1.7:run (define-classpath) @ hive-shims-aggregator ---
          [INFO] Executing tasks
          
          main:
          [INFO] Executed tasks
          [INFO] 
          [INFO] --- maven-antrun-plugin:1.7:run (setup-test-dirs) @ hive-shims-aggregator ---
          [INFO] Executing tasks
          
          main:
              [mkdir] Created dir: /data/hive-ptest/working/apache-svn-trunk-source/shims/target/tmp
              [mkdir] Created dir: /data/hive-ptest/working/apache-svn-trunk-source/shims/target/warehouse
              [mkdir] Created dir: /data/hive-ptest/working/apache-svn-trunk-source/shims/target/tmp/conf
               [copy] Copying 5 files to /data/hive-ptest/working/apache-svn-trunk-source/shims/target/tmp/conf
          [INFO] Executed tasks
          [INFO] 
          [INFO] --- maven-site-plugin:3.3:attach-descriptor (attach-descriptor) @ hive-shims-aggregator ---
          [INFO] 
          [INFO] --- maven-install-plugin:2.4:install (default-install) @ hive-shims-aggregator ---
          [INFO] Installing /data/hive-ptest/working/apache-svn-trunk-source/shims/pom.xml to /data/hive-ptest/working/maven/org/apache/hive/hive-shims-aggregator/0.14.0-SNAPSHOT/hive-shims-aggregator-0.14.0-SNAPSHOT.pom
          [INFO]                                                                         
          [INFO] ------------------------------------------------------------------------
          [INFO] Building Hive TestUtils 0.14.0-SNAPSHOT
          [INFO] ------------------------------------------------------------------------
          [INFO] 
          [INFO] --- maven-clean-plugin:2.5:clean (default-clean) @ hive-testutils ---
          [INFO] Deleting /data/hive-ptest/working/apache-svn-trunk-source/testutils (includes = [datanucleus.log, derby.log], excludes = [])
          [INFO] 
          [INFO] --- maven-remote-resources-plugin:1.5:process (default) @ hive-testutils ---
          [INFO] 
          [INFO] --- maven-resources-plugin:2.6:resources (default-resources) @ hive-testutils ---
          [INFO] Using 'UTF-8' encoding to copy filtered resources.
          [INFO] skip non existing resourceDirectory /data/hive-ptest/working/apache-svn-trunk-source/testutils/src/main/resources
          [INFO] Copying 3 resources
          [INFO] 
          [INFO] --- maven-antrun-plugin:1.7:run (define-classpath) @ hive-testutils ---
          [INFO] Executing tasks
          
          main:
          [INFO] Executed tasks
          [INFO] 
          [INFO] --- maven-compiler-plugin:3.1:compile (default-compile) @ hive-testutils ---
          [INFO] Compiling 2 source files to /data/hive-ptest/working/apache-svn-trunk-source/testutils/target/classes
          [INFO] 
          [INFO] --- maven-resources-plugin:2.6:testResources (default-testResources) @ hive-testutils ---
          [INFO] Using 'UTF-8' encoding to copy filtered resources.
          [INFO] skip non existing resourceDirectory /data/hive-ptest/working/apache-svn-trunk-source/testutils/src/test/resources
          [INFO] Copying 3 resources
          [INFO] 
          [INFO] --- maven-antrun-plugin:1.7:run (setup-test-dirs) @ hive-testutils ---
          [INFO] Executing tasks
          
          main:
              [mkdir] Created dir: /data/hive-ptest/working/apache-svn-trunk-source/testutils/target/tmp
              [mkdir] Created dir: /data/hive-ptest/working/apache-svn-trunk-source/testutils/target/warehouse
              [mkdir] Created dir: /data/hive-ptest/working/apache-svn-trunk-source/testutils/target/tmp/conf
               [copy] Copying 5 files to /data/hive-ptest/working/apache-svn-trunk-source/testutils/target/tmp/conf
          [INFO] Executed tasks
          [INFO] 
          [INFO] --- maven-compiler-plugin:3.1:testCompile (default-testCompile) @ hive-testutils ---
          [INFO] No sources to compile
          [INFO] 
          [INFO] --- maven-surefire-plugin:2.16:test (default-test) @ hive-testutils ---
          [INFO] Tests are skipped.
          [INFO] 
          [INFO] --- maven-jar-plugin:2.2:jar (default-jar) @ hive-testutils ---
          [INFO] Building jar: /data/hive-ptest/working/apache-svn-trunk-source/testutils/target/hive-testutils-0.14.0-SNAPSHOT.jar
          [INFO] 
          [INFO] --- maven-site-plugin:3.3:attach-descriptor (attach-descriptor) @ hive-testutils ---
          [INFO] 
          [INFO] --- maven-install-plugin:2.4:install (default-install) @ hive-testutils ---
          [INFO] Installing /data/hive-ptest/working/apache-svn-trunk-source/testutils/target/hive-testutils-0.14.0-SNAPSHOT.jar to /data/hive-ptest/working/maven/org/apache/hive/hive-testutils/0.14.0-SNAPSHOT/hive-testutils-0.14.0-SNAPSHOT.jar
          [INFO] Installing /data/hive-ptest/working/apache-svn-trunk-source/testutils/pom.xml to /data/hive-ptest/working/maven/org/apache/hive/hive-testutils/0.14.0-SNAPSHOT/hive-testutils-0.14.0-SNAPSHOT.pom
          [INFO]                                                                         
          [INFO] ------------------------------------------------------------------------
          [INFO] Building Hive Packaging 0.14.0-SNAPSHOT
          [INFO] ------------------------------------------------------------------------
          Downloading: http://repository.apache.org/snapshots/org/apache/hive/hcatalog/hive-hcatalog-hbase-storage-handler/0.14.0-SNAPSHOT/maven-metadata.xml
          Downloading: http://repository.apache.org/snapshots/org/apache/hive/hcatalog/hive-hcatalog-hbase-storage-handler/0.14.0-SNAPSHOT/hive-hcatalog-hbase-storage-handler-0.14.0-SNAPSHOT.pom
          [WARNING] The POM for org.apache.hive.hcatalog:hive-hcatalog-hbase-storage-handler:jar:0.14.0-SNAPSHOT is missing, no dependency information available
          Downloading: http://repository.apache.org/snapshots/org/apache/hive/hcatalog/hive-hcatalog-hbase-storage-handler/0.14.0-SNAPSHOT/hive-hcatalog-hbase-storage-handler-0.14.0-SNAPSHOT.jar
          [INFO] ------------------------------------------------------------------------
          [INFO] Reactor Summary:
          [INFO] 
          [INFO] Hive .............................................. SUCCESS [8.640s]
          [INFO] Hive Ant Utilities ................................ SUCCESS [5.887s]
          [INFO] Hive Shims Common ................................. SUCCESS [3.628s]
          [INFO] Hive Shims 0.20 ................................... SUCCESS [2.420s]
          [INFO] Hive Shims Secure Common .......................... SUCCESS [4.354s]
          [INFO] Hive Shims 0.20S .................................. SUCCESS [2.601s]
          [INFO] Hive Shims 0.23 ................................... SUCCESS [8.012s]
          [INFO] Hive Shims ........................................ SUCCESS [1.291s]
          [INFO] Hive Common ....................................... SUCCESS [6.829s]
          [INFO] Hive Serde ........................................ SUCCESS [10.910s]
          [INFO] Hive Metastore .................................... SUCCESS [32.234s]
          [INFO] Hive Query Language ............................... SUCCESS [1:16.853s]
          [INFO] Hive Service ...................................... SUCCESS [7.446s]
          [INFO] Hive JDBC ......................................... SUCCESS [2.858s]
          [INFO] Hive Beeline ...................................... SUCCESS [2.751s]
          [INFO] Hive CLI .......................................... SUCCESS [1.964s]
          [INFO] Hive Contrib ...................................... SUCCESS [2.611s]
          [INFO] Hive HBase Handler ................................ SUCCESS [2.566s]
          [INFO] Hive HCatalog ..................................... SUCCESS [0.603s]
          [INFO] Hive HCatalog Core ................................ SUCCESS [1.952s]
          [INFO] Hive HCatalog Pig Adapter ......................... SUCCESS [2.412s]
          [INFO] Hive HCatalog Server Extensions ................... SUCCESS [1.799s]
          [INFO] Hive HCatalog Webhcat Java Client ................. SUCCESS [1.767s]
          [INFO] Hive HCatalog Webhcat ............................. SUCCESS [10.180s]
          [INFO] Hive HWI .......................................... SUCCESS [1.189s]
          [INFO] Hive ODBC ......................................... SUCCESS [0.816s]
          [INFO] Hive Shims Aggregator ............................. SUCCESS [0.208s]
          [INFO] Hive TestUtils .................................... SUCCESS [0.589s]
          [INFO] Hive Packaging .................................... FAILURE [1.656s]
          [INFO] ------------------------------------------------------------------------
          [INFO] BUILD FAILURE
          [INFO] ------------------------------------------------------------------------
          [INFO] Total time: 3:31.572s
          [INFO] Finished at: Sat Mar 15 07:05:54 EDT 2014
          [INFO] Final Memory: 74M/424M
          [INFO] ------------------------------------------------------------------------
          [ERROR] Failed to execute goal on project hive-packaging: Could not resolve dependencies for project org.apache.hive:hive-packaging:pom:0.14.0-SNAPSHOT: Could not find artifact org.apache.hive.hcatalog:hive-hcatalog-hbase-storage-handler:jar:0.14.0-SNAPSHOT in apache.snapshots (http://repository.apache.org/snapshots) -> [Help 1]
          [ERROR] 
          [ERROR] To see the full stack trace of the errors, re-run Maven with the -e switch.
          [ERROR] Re-run Maven using the -X switch to enable full debug logging.
          [ERROR] 
          [ERROR] For more information about the errors and possible solutions, please read the following articles:
          [ERROR] [Help 1] http://cwiki.apache.org/confluence/display/MAVEN/DependencyResolutionException
          [ERROR] 
          [ERROR] After correcting the problems, you can resume the build with the command
          [ERROR]   mvn <goals> -rf :hive-packaging
          + exit 1
          '
          

          This message is automatically generated.

          ATTACHMENT ID: 12634911

          Show
          Hive QA added a comment - Overall : -1 no tests executed Here are the results of testing the latest attachment: https://issues.apache.org/jira/secure/attachment/12634911/HIVE-6674.1.patch.txt Test results: http://bigtop01.cloudera.org:8080/job/PreCommit-HIVE-Build/1832/testReport Console output: http://bigtop01.cloudera.org:8080/job/PreCommit-HIVE-Build/1832/console Messages: **** This message was trimmed, see log for full details **** [INFO] Using 'UTF-8' encoding to copy filtered resources. [INFO] skip non existing resourceDirectory /data/hive-ptest/working/apache-svn-trunk-source/hwi/src/test/resources [INFO] Copying 3 resources [INFO] [INFO] --- maven-antrun-plugin:1.7:run (setup-test-dirs) @ hive-hwi --- [INFO] Executing tasks main: [mkdir] Created dir: /data/hive-ptest/working/apache-svn-trunk-source/hwi/target/tmp [mkdir] Created dir: /data/hive-ptest/working/apache-svn-trunk-source/hwi/target/warehouse [mkdir] Created dir: /data/hive-ptest/working/apache-svn-trunk-source/hwi/target/tmp/conf [copy] Copying 5 files to /data/hive-ptest/working/apache-svn-trunk-source/hwi/target/tmp/conf [INFO] Executed tasks [INFO] [INFO] --- maven-compiler-plugin:3.1:testCompile (default-testCompile) @ hive-hwi --- [INFO] Compiling 2 source files to /data/hive-ptest/working/apache-svn-trunk-source/hwi/target/test-classes [INFO] [INFO] --- maven-surefire-plugin:2.16:test (default-test) @ hive-hwi --- [INFO] Tests are skipped. [INFO] [INFO] --- maven-jar-plugin:2.2:jar (default-jar) @ hive-hwi --- [INFO] Building jar: /data/hive-ptest/working/apache-svn-trunk-source/hwi/target/hive-hwi-0.14.0-SNAPSHOT.jar [INFO] [INFO] --- maven-site-plugin:3.3:attach-descriptor (attach-descriptor) @ hive-hwi --- [INFO] [INFO] --- maven-install-plugin:2.4:install (default-install) @ hive-hwi --- [INFO] Installing /data/hive-ptest/working/apache-svn-trunk-source/hwi/target/hive-hwi-0.14.0-SNAPSHOT.jar to /data/hive-ptest/working/maven/org/apache/hive/hive-hwi/0.14.0-SNAPSHOT/hive-hwi-0.14.0-SNAPSHOT.jar [INFO] Installing /data/hive-ptest/working/apache-svn-trunk-source/hwi/pom.xml to /data/hive-ptest/working/maven/org/apache/hive/hive-hwi/0.14.0-SNAPSHOT/hive-hwi-0.14.0-SNAPSHOT.pom [INFO] [INFO] ------------------------------------------------------------------------ [INFO] Building Hive ODBC 0.14.0-SNAPSHOT [INFO] ------------------------------------------------------------------------ [INFO] [INFO] --- maven-clean-plugin:2.5:clean (default-clean) @ hive-odbc --- [INFO] Deleting /data/hive-ptest/working/apache-svn-trunk-source/odbc (includes = [datanucleus.log, derby.log], excludes = []) [INFO] [INFO] --- maven-remote-resources-plugin:1.5:process (default) @ hive-odbc --- [INFO] [INFO] --- maven-antrun-plugin:1.7:run (define-classpath) @ hive-odbc --- [INFO] Executing tasks main: [INFO] Executed tasks [INFO] [INFO] --- maven-antrun-plugin:1.7:run (setup-test-dirs) @ hive-odbc --- [INFO] Executing tasks main: [mkdir] Created dir: /data/hive-ptest/working/apache-svn-trunk-source/odbc/target/tmp [mkdir] Created dir: /data/hive-ptest/working/apache-svn-trunk-source/odbc/target/warehouse [mkdir] Created dir: /data/hive-ptest/working/apache-svn-trunk-source/odbc/target/tmp/conf [copy] Copying 5 files to /data/hive-ptest/working/apache-svn-trunk-source/odbc/target/tmp/conf [INFO] Executed tasks [INFO] [INFO] --- maven-site-plugin:3.3:attach-descriptor (attach-descriptor) @ hive-odbc --- [INFO] [INFO] --- maven-install-plugin:2.4:install (default-install) @ hive-odbc --- [INFO] Installing /data/hive-ptest/working/apache-svn-trunk-source/odbc/pom.xml to /data/hive-ptest/working/maven/org/apache/hive/hive-odbc/0.14.0-SNAPSHOT/hive-odbc-0.14.0-SNAPSHOT.pom [INFO] [INFO] ------------------------------------------------------------------------ [INFO] Building Hive Shims Aggregator 0.14.0-SNAPSHOT [INFO] ------------------------------------------------------------------------ [INFO] [INFO] --- maven-clean-plugin:2.5:clean (default-clean) @ hive-shims-aggregator --- [INFO] Deleting /data/hive-ptest/working/apache-svn-trunk-source/shims (includes = [datanucleus.log, derby.log], excludes = []) [INFO] [INFO] --- maven-remote-resources-plugin:1.5:process (default) @ hive-shims-aggregator --- [INFO] [INFO] --- maven-antrun-plugin:1.7:run (define-classpath) @ hive-shims-aggregator --- [INFO] Executing tasks main: [INFO] Executed tasks [INFO] [INFO] --- maven-antrun-plugin:1.7:run (setup-test-dirs) @ hive-shims-aggregator --- [INFO] Executing tasks main: [mkdir] Created dir: /data/hive-ptest/working/apache-svn-trunk-source/shims/target/tmp [mkdir] Created dir: /data/hive-ptest/working/apache-svn-trunk-source/shims/target/warehouse [mkdir] Created dir: /data/hive-ptest/working/apache-svn-trunk-source/shims/target/tmp/conf [copy] Copying 5 files to /data/hive-ptest/working/apache-svn-trunk-source/shims/target/tmp/conf [INFO] Executed tasks [INFO] [INFO] --- maven-site-plugin:3.3:attach-descriptor (attach-descriptor) @ hive-shims-aggregator --- [INFO] [INFO] --- maven-install-plugin:2.4:install (default-install) @ hive-shims-aggregator --- [INFO] Installing /data/hive-ptest/working/apache-svn-trunk-source/shims/pom.xml to /data/hive-ptest/working/maven/org/apache/hive/hive-shims-aggregator/0.14.0-SNAPSHOT/hive-shims-aggregator-0.14.0-SNAPSHOT.pom [INFO] [INFO] ------------------------------------------------------------------------ [INFO] Building Hive TestUtils 0.14.0-SNAPSHOT [INFO] ------------------------------------------------------------------------ [INFO] [INFO] --- maven-clean-plugin:2.5:clean (default-clean) @ hive-testutils --- [INFO] Deleting /data/hive-ptest/working/apache-svn-trunk-source/testutils (includes = [datanucleus.log, derby.log], excludes = []) [INFO] [INFO] --- maven-remote-resources-plugin:1.5:process (default) @ hive-testutils --- [INFO] [INFO] --- maven-resources-plugin:2.6:resources (default-resources) @ hive-testutils --- [INFO] Using 'UTF-8' encoding to copy filtered resources. [INFO] skip non existing resourceDirectory /data/hive-ptest/working/apache-svn-trunk-source/testutils/src/main/resources [INFO] Copying 3 resources [INFO] [INFO] --- maven-antrun-plugin:1.7:run (define-classpath) @ hive-testutils --- [INFO] Executing tasks main: [INFO] Executed tasks [INFO] [INFO] --- maven-compiler-plugin:3.1:compile (default-compile) @ hive-testutils --- [INFO] Compiling 2 source files to /data/hive-ptest/working/apache-svn-trunk-source/testutils/target/classes [INFO] [INFO] --- maven-resources-plugin:2.6:testResources (default-testResources) @ hive-testutils --- [INFO] Using 'UTF-8' encoding to copy filtered resources. [INFO] skip non existing resourceDirectory /data/hive-ptest/working/apache-svn-trunk-source/testutils/src/test/resources [INFO] Copying 3 resources [INFO] [INFO] --- maven-antrun-plugin:1.7:run (setup-test-dirs) @ hive-testutils --- [INFO] Executing tasks main: [mkdir] Created dir: /data/hive-ptest/working/apache-svn-trunk-source/testutils/target/tmp [mkdir] Created dir: /data/hive-ptest/working/apache-svn-trunk-source/testutils/target/warehouse [mkdir] Created dir: /data/hive-ptest/working/apache-svn-trunk-source/testutils/target/tmp/conf [copy] Copying 5 files to /data/hive-ptest/working/apache-svn-trunk-source/testutils/target/tmp/conf [INFO] Executed tasks [INFO] [INFO] --- maven-compiler-plugin:3.1:testCompile (default-testCompile) @ hive-testutils --- [INFO] No sources to compile [INFO] [INFO] --- maven-surefire-plugin:2.16:test (default-test) @ hive-testutils --- [INFO] Tests are skipped. [INFO] [INFO] --- maven-jar-plugin:2.2:jar (default-jar) @ hive-testutils --- [INFO] Building jar: /data/hive-ptest/working/apache-svn-trunk-source/testutils/target/hive-testutils-0.14.0-SNAPSHOT.jar [INFO] [INFO] --- maven-site-plugin:3.3:attach-descriptor (attach-descriptor) @ hive-testutils --- [INFO] [INFO] --- maven-install-plugin:2.4:install (default-install) @ hive-testutils --- [INFO] Installing /data/hive-ptest/working/apache-svn-trunk-source/testutils/target/hive-testutils-0.14.0-SNAPSHOT.jar to /data/hive-ptest/working/maven/org/apache/hive/hive-testutils/0.14.0-SNAPSHOT/hive-testutils-0.14.0-SNAPSHOT.jar [INFO] Installing /data/hive-ptest/working/apache-svn-trunk-source/testutils/pom.xml to /data/hive-ptest/working/maven/org/apache/hive/hive-testutils/0.14.0-SNAPSHOT/hive-testutils-0.14.0-SNAPSHOT.pom [INFO] [INFO] ------------------------------------------------------------------------ [INFO] Building Hive Packaging 0.14.0-SNAPSHOT [INFO] ------------------------------------------------------------------------ Downloading: http://repository.apache.org/snapshots/org/apache/hive/hcatalog/hive-hcatalog-hbase-storage-handler/0.14.0-SNAPSHOT/maven-metadata.xml Downloading: http://repository.apache.org/snapshots/org/apache/hive/hcatalog/hive-hcatalog-hbase-storage-handler/0.14.0-SNAPSHOT/hive-hcatalog-hbase-storage-handler-0.14.0-SNAPSHOT.pom [WARNING] The POM for org.apache.hive.hcatalog:hive-hcatalog-hbase-storage-handler:jar:0.14.0-SNAPSHOT is missing, no dependency information available Downloading: http://repository.apache.org/snapshots/org/apache/hive/hcatalog/hive-hcatalog-hbase-storage-handler/0.14.0-SNAPSHOT/hive-hcatalog-hbase-storage-handler-0.14.0-SNAPSHOT.jar [INFO] ------------------------------------------------------------------------ [INFO] Reactor Summary: [INFO] [INFO] Hive .............................................. SUCCESS [8.640s] [INFO] Hive Ant Utilities ................................ SUCCESS [5.887s] [INFO] Hive Shims Common ................................. SUCCESS [3.628s] [INFO] Hive Shims 0.20 ................................... SUCCESS [2.420s] [INFO] Hive Shims Secure Common .......................... SUCCESS [4.354s] [INFO] Hive Shims 0.20S .................................. SUCCESS [2.601s] [INFO] Hive Shims 0.23 ................................... SUCCESS [8.012s] [INFO] Hive Shims ........................................ SUCCESS [1.291s] [INFO] Hive Common ....................................... SUCCESS [6.829s] [INFO] Hive Serde ........................................ SUCCESS [10.910s] [INFO] Hive Metastore .................................... SUCCESS [32.234s] [INFO] Hive Query Language ............................... SUCCESS [1:16.853s] [INFO] Hive Service ...................................... SUCCESS [7.446s] [INFO] Hive JDBC ......................................... SUCCESS [2.858s] [INFO] Hive Beeline ...................................... SUCCESS [2.751s] [INFO] Hive CLI .......................................... SUCCESS [1.964s] [INFO] Hive Contrib ...................................... SUCCESS [2.611s] [INFO] Hive HBase Handler ................................ SUCCESS [2.566s] [INFO] Hive HCatalog ..................................... SUCCESS [0.603s] [INFO] Hive HCatalog Core ................................ SUCCESS [1.952s] [INFO] Hive HCatalog Pig Adapter ......................... SUCCESS [2.412s] [INFO] Hive HCatalog Server Extensions ................... SUCCESS [1.799s] [INFO] Hive HCatalog Webhcat Java Client ................. SUCCESS [1.767s] [INFO] Hive HCatalog Webhcat ............................. SUCCESS [10.180s] [INFO] Hive HWI .......................................... SUCCESS [1.189s] [INFO] Hive ODBC ......................................... SUCCESS [0.816s] [INFO] Hive Shims Aggregator ............................. SUCCESS [0.208s] [INFO] Hive TestUtils .................................... SUCCESS [0.589s] [INFO] Hive Packaging .................................... FAILURE [1.656s] [INFO] ------------------------------------------------------------------------ [INFO] BUILD FAILURE [INFO] ------------------------------------------------------------------------ [INFO] Total time: 3:31.572s [INFO] Finished at: Sat Mar 15 07:05:54 EDT 2014 [INFO] Final Memory: 74M/424M [INFO] ------------------------------------------------------------------------ [ERROR] Failed to execute goal on project hive-packaging: Could not resolve dependencies for project org.apache.hive:hive-packaging:pom:0.14.0-SNAPSHOT: Could not find artifact org.apache.hive.hcatalog:hive-hcatalog-hbase-storage-handler:jar:0.14.0-SNAPSHOT in apache.snapshots (http://repository.apache.org/snapshots) -> [Help 1] [ERROR] [ERROR] To see the full stack trace of the errors, re-run Maven with the -e switch. [ERROR] Re-run Maven using the -X switch to enable full debug logging. [ERROR] [ERROR] For more information about the errors and possible solutions, please read the following articles: [ERROR] [Help 1] http://cwiki.apache.org/confluence/display/MAVEN/DependencyResolutionException [ERROR] [ERROR] After correcting the problems, you can resume the build with the command [ERROR] mvn <goals> -rf :hive-packaging + exit 1 ' This message is automatically generated. ATTACHMENT ID: 12634911
          Hide
          Ashutosh Chauhan added a comment -

          Navis Looks like this one needs rebase.

          Show
          Ashutosh Chauhan added a comment - Navis Looks like this one needs rebase.
          Ashutosh Chauhan made changes -
          Status Patch Available [ 10002 ] Open [ 1 ]
          Navis made changes -
          Attachment HIVE-6674.2.patch.txt [ 12636499 ]
          Hide
          Ashutosh Chauhan added a comment -

          +1 LGTM

          Show
          Ashutosh Chauhan added a comment - +1 LGTM
          Ashutosh Chauhan made changes -
          Status Open [ 1 ] Patch Available [ 10002 ]
          Hide
          Alan Gates added a comment -

          Ran the tests, all looks good.

          Show
          Alan Gates added a comment - Ran the tests, all looks good.
          Hide
          Ashutosh Chauhan added a comment -

          Committed to 0.13 & trunk.

          Show
          Ashutosh Chauhan added a comment - Committed to 0.13 & trunk.
          Ashutosh Chauhan made changes -
          Status Patch Available [ 10002 ] Resolved [ 5 ]
          Fix Version/s 0.13.0 [ 12324986 ]
          Resolution Fixed [ 1 ]
          Transition Time In Source Status Execution Times Last Executer Last Execution Date
          Patch Available Patch Available Open Open
          9d 7h 1m 1 Ashutosh Chauhan 24/Mar/14 17:49
          Open Open Patch Available Patch Available
          22h 1m 2 Ashutosh Chauhan 25/Mar/14 02:15
          Patch Available Patch Available Resolved Resolved
          1d 21h 57m 1 Ashutosh Chauhan 27/Mar/14 00:13

            People

            • Assignee:
              Navis
              Reporter:
              Thejas M Nair
            • Votes:
              0 Vote for this issue
              Watchers:
              3 Start watching this issue

              Dates

              • Created:
                Updated:
                Resolved:

                Development