Hive
  1. Hive
  2. HIVE-6574

Type in ql/pom.xml prevents jobs from parquet queries from running on a cluster

    Details

    • Type: Bug Bug
    • Status: Resolved
    • Priority: Blocker Blocker
    • Resolution: Fixed
    • Affects Version/s: 0.13.0
    • Fix Version/s: 0.13.0
    • Labels:
      None

      Description

      MR job complains about not found class:

      Caused by: java.lang.ClassNotFoundException: parquet.hadoop.ParquetInputFormat
      	at java.net.URLClassLoader$1.run(URLClassLoader.java:366)
      	at java.net.URLClassLoader$1.run(URLClassLoader.java:355)
      	at java.security.AccessController.doPrivileged(Native Method)
      	at java.net.URLClassLoader.findClass(URLClassLoader.java:354)
      	at java.lang.ClassLoader.loadClass(ClassLoader.java:423)
      	at sun.misc.Launcher$AppClassLoader.loadClass(Launcher.java:308)
      	at java.lang.ClassLoader.loadClass(ClassLoader.java:356)
      	... 64 more
      
      1. HIVE-6574.patch
        0.6 kB
        Xuefu Zhang

        Activity

        Xuefu Zhang created issue -
        Xuefu Zhang made changes -
        Field Original Value New Value
        Assignee Xuefu Zhang [ xuefuz ]
        Xuefu Zhang made changes -
        Attachment HIVE-6574.patch [ 12633254 ]
        Xuefu Zhang made changes -
        Status Open [ 1 ] Patch Available [ 10002 ]
        Hide
        Brock Noland added a comment -

        My mistake. +1

        Show
        Brock Noland added a comment - My mistake. +1
        Hide
        Hive QA added a comment -

        Overall: -1 at least one tests failed

        Here are the results of testing the latest attachment:
        https://issues.apache.org/jira/secure/attachment/12633254/HIVE-6574.patch

        ERROR: -1 due to 1 failed/errored test(s), 5360 tests executed
        Failed tests:

        org.apache.hadoop.hive.cli.TestMinimrCliDriver.testCliDriver_auto_sortmerge_join_16
        

        Test results: http://bigtop01.cloudera.org:8080/job/PreCommit-HIVE-Build/1651/testReport
        Console output: http://bigtop01.cloudera.org:8080/job/PreCommit-HIVE-Build/1651/console

        Messages:

        Executing org.apache.hive.ptest.execution.PrepPhase
        Executing org.apache.hive.ptest.execution.ExecutionPhase
        Executing org.apache.hive.ptest.execution.ReportingPhase
        Tests exited with: TestsFailedException: 1 tests failed
        

        This message is automatically generated.

        ATTACHMENT ID: 12633254

        Show
        Hive QA added a comment - Overall : -1 at least one tests failed Here are the results of testing the latest attachment: https://issues.apache.org/jira/secure/attachment/12633254/HIVE-6574.patch ERROR: -1 due to 1 failed/errored test(s), 5360 tests executed Failed tests: org.apache.hadoop.hive.cli.TestMinimrCliDriver.testCliDriver_auto_sortmerge_join_16 Test results: http://bigtop01.cloudera.org:8080/job/PreCommit-HIVE-Build/1651/testReport Console output: http://bigtop01.cloudera.org:8080/job/PreCommit-HIVE-Build/1651/console Messages: Executing org.apache.hive.ptest.execution.PrepPhase Executing org.apache.hive.ptest.execution.ExecutionPhase Executing org.apache.hive.ptest.execution.ReportingPhase Tests exited with: TestsFailedException: 1 tests failed This message is automatically generated. ATTACHMENT ID: 12633254
        Hide
        Xuefu Zhang added a comment -

        The above test failure is unrelated. Patched committed to trunk. Thanks Brock for the review.

        Show
        Xuefu Zhang added a comment - The above test failure is unrelated. Patched committed to trunk. Thanks Brock for the review.
        Xuefu Zhang made changes -
        Status Patch Available [ 10002 ] Resolved [ 5 ]
        Fix Version/s 0.14.0 [ 12326450 ]
        Resolution Fixed [ 1 ]
        Hide
        Brock Noland added a comment -

        Thanks! I think we should also commit this to 0.13.

        Show
        Brock Noland added a comment - Thanks! I think we should also commit this to 0.13.
        Hide
        Xuefu Zhang added a comment -

        Yes. I communicated this in the release email thread. Do I need to actually commit it or the release "manager" will?

        Show
        Xuefu Zhang added a comment - Yes. I communicated this in the release email thread. Do I need to actually commit it or the release "manager" will?
        Harish Butani made changes -
        Fix Version/s 0.13.0 [ 12324986 ]
        Fix Version/s 0.14.0 [ 12326450 ]
        Hide
        Harish Butani added a comment -

        ported to 0.13

        Show
        Harish Butani added a comment - ported to 0.13
        Hide
        Xuefu Zhang added a comment -

        Thanks, Harish!

        Show
        Xuefu Zhang added a comment - Thanks, Harish!
        Transition Time In Source Status Execution Times Last Executer Last Execution Date
        Open Open Patch Available Patch Available
        6m 56s 1 Xuefu Zhang 06/Mar/14 23:30
        Patch Available Patch Available Resolved Resolved
        1d 1h 14m 1 Xuefu Zhang 08/Mar/14 00:44

          People

          • Assignee:
            Xuefu Zhang
            Reporter:
            Xuefu Zhang
          • Votes:
            0 Vote for this issue
            Watchers:
            3 Start watching this issue

            Dates

            • Created:
              Updated:
              Resolved:

              Development