Hive
  1. Hive
  2. HIVE-6400

Add Apache Rat plugin to pom.xml

    Details

    • Type: Bug Bug
    • Status: Resolved
    • Priority: Major Major
    • Resolution: Fixed
    • Affects Version/s: None
    • Fix Version/s: 0.13.0
    • Component/s: None
    • Labels:
      None

      Description

      So we can generate the Release Audit report.

      1. HIVE-6400.1.patch
        0.9 kB
        Harish Butani

        Activity

        Hide
        Ashutosh Chauhan added a comment -

        Committed to trunk. Thanks, Harish!

        Show
        Ashutosh Chauhan added a comment - Committed to trunk. Thanks, Harish!
        Hide
        Hive QA added a comment -

        Overall: -1 at least one tests failed

        Here are the results of testing the latest attachment:
        https://issues.apache.org/jira/secure/attachment/12628949/HIVE-6400.1.patch

        ERROR: -1 due to 1 failed/errored test(s), 5119 tests executed
        Failed tests:

        org.apache.hadoop.hive.cli.TestMinimrCliDriver.testCliDriver_quotedid_smb
        

        Test results: http://bigtop01.cloudera.org:8080/job/PreCommit-HIVE-Build/1325/testReport
        Console output: http://bigtop01.cloudera.org:8080/job/PreCommit-HIVE-Build/1325/console

        Messages:

        Executing org.apache.hive.ptest.execution.PrepPhase
        Executing org.apache.hive.ptest.execution.ExecutionPhase
        Executing org.apache.hive.ptest.execution.ReportingPhase
        Tests exited with: TestsFailedException: 1 tests failed
        

        This message is automatically generated.

        ATTACHMENT ID: 12628949

        Show
        Hive QA added a comment - Overall : -1 at least one tests failed Here are the results of testing the latest attachment: https://issues.apache.org/jira/secure/attachment/12628949/HIVE-6400.1.patch ERROR: -1 due to 1 failed/errored test(s), 5119 tests executed Failed tests: org.apache.hadoop.hive.cli.TestMinimrCliDriver.testCliDriver_quotedid_smb Test results: http://bigtop01.cloudera.org:8080/job/PreCommit-HIVE-Build/1325/testReport Console output: http://bigtop01.cloudera.org:8080/job/PreCommit-HIVE-Build/1325/console Messages: Executing org.apache.hive.ptest.execution.PrepPhase Executing org.apache.hive.ptest.execution.ExecutionPhase Executing org.apache.hive.ptest.execution.ReportingPhase Tests exited with: TestsFailedException: 1 tests failed This message is automatically generated. ATTACHMENT ID: 12628949
        Hide
        Ashutosh Chauhan added a comment -

        +1

        Show
        Ashutosh Chauhan added a comment - +1
        Hide
        Hive QA added a comment -

        Overall: -1 at least one tests failed

        Here are the results of testing the latest attachment:
        https://issues.apache.org/jira/secure/attachment/12628061/HIVE-6400.1.patch

        ERROR: -1 due to 1 failed/errored test(s), 5083 tests executed
        Failed tests:

        org.apache.hadoop.hive.cli.TestCliDriver.testCliDriver_authorization_revoke_table_priv
        

        Test results: http://bigtop01.cloudera.org:8080/job/PreCommit-HIVE-Build/1274/testReport
        Console output: http://bigtop01.cloudera.org:8080/job/PreCommit-HIVE-Build/1274/console

        Messages:

        Executing org.apache.hive.ptest.execution.PrepPhase
        Executing org.apache.hive.ptest.execution.ExecutionPhase
        Executing org.apache.hive.ptest.execution.ReportingPhase
        Tests exited with: TestsFailedException: 1 tests failed
        

        This message is automatically generated.

        ATTACHMENT ID: 12628061

        Show
        Hive QA added a comment - Overall : -1 at least one tests failed Here are the results of testing the latest attachment: https://issues.apache.org/jira/secure/attachment/12628061/HIVE-6400.1.patch ERROR: -1 due to 1 failed/errored test(s), 5083 tests executed Failed tests: org.apache.hadoop.hive.cli.TestCliDriver.testCliDriver_authorization_revoke_table_priv Test results: http://bigtop01.cloudera.org:8080/job/PreCommit-HIVE-Build/1274/testReport Console output: http://bigtop01.cloudera.org:8080/job/PreCommit-HIVE-Build/1274/console Messages: Executing org.apache.hive.ptest.execution.PrepPhase Executing org.apache.hive.ptest.execution.ExecutionPhase Executing org.apache.hive.ptest.execution.ReportingPhase Tests exited with: TestsFailedException: 1 tests failed This message is automatically generated. ATTACHMENT ID: 12628061

          People

          • Assignee:
            Harish Butani
            Reporter:
            Harish Butani
          • Votes:
            0 Vote for this issue
            Watchers:
            2 Start watching this issue

            Dates

            • Created:
              Updated:
              Resolved:

              Development