Hive
  1. Hive
  2. HIVE-4920

PTest2 handle Spot Price increases gracefully and improve rsync paralllelsim

    Details

    • Type: Improvement Improvement
    • Status: Closed
    • Priority: Critical Critical
    • Resolution: Fixed
    • Affects Version/s: None
    • Fix Version/s: 0.12.0
    • Component/s: None
    • Labels:
      None

      Description

      We should handle spot price increases more gracefully and parallelize rsync to slaves better

      NO PRECOMMIT TESTS

      1. HIVE-4920.patch
        128 kB
        Brock Noland
      2. HIVE-4920.patch
        125 kB
        Brock Noland
      3. HIVE-4920.patch
        123 kB
        Brock Noland
      4. HIVE-4920.patch
        121 kB
        Brock Noland
      5. Screen Shot 2013-07-23 at 3.35.00 PM.png
        34 kB
        Brock Noland

        Issue Links

          Activity

          Brock Noland created issue -
          Brock Noland made changes -
          Field Original Value New Value
          Issue Type Bug [ 1 ] Improvement [ 4 ]
          Priority Major [ 3 ] Critical [ 2 ]
          Hide
          Edward Capriolo added a comment -

          What is the daily cost for running? With the backlog of patches we have we may be running for a bit.

          Show
          Edward Capriolo added a comment - What is the daily cost for running? With the backlog of patches we have we may be running for a bit.
          Hide
          Brock Noland added a comment -

          It varies quite a bit but I think it averages to about $1-2 per hour. The past few days there have been large spikes in the prices of spot instances which results in our slave instances being terminated. See attached.

          c1.xlarge seems to be more stable but also in less supply. I think that I will change to using c1.xlarge and then if fallback to m1.xlarge and then to on-demand instances.

          Show
          Brock Noland added a comment - It varies quite a bit but I think it averages to about $1-2 per hour. The past few days there have been large spikes in the prices of spot instances which results in our slave instances being terminated. See attached. c1.xlarge seems to be more stable but also in less supply. I think that I will change to using c1.xlarge and then if fallback to m1.xlarge and then to on-demand instances.
          Brock Noland made changes -
          Hide
          Brock Noland added a comment -

          I think we should also be able to "block" the test until prices come back down and then allocate new hosts during the middle of the test.

          Show
          Brock Noland added a comment - I think we should also be able to "block" the test until prices come back down and then allocate new hosts during the middle of the test.
          Hide
          Edward Capriolo added a comment -

          Are you trying to build a high frequency trading system or a test suite JK. We should be optimal but lets not spend too much time gaming the system. I think we are better off following up with the discussion on list of chopping up the project.

          Show
          Edward Capriolo added a comment - Are you trying to build a high frequency trading system or a test suite JK. We should be optimal but lets not spend too much time gaming the system. I think we are better off following up with the discussion on list of chopping up the project.
          Hide
          Brock Noland added a comment -

          Yeah I was thinking about it and I think what we should do instead is replace our set of slaves if they are all lost due to a price spike and then block while we cannot get hosts due to price. I have this patch working and will submit it soon.

          Show
          Brock Noland added a comment - Yeah I was thinking about it and I think what we should do instead is replace our set of slaves if they are all lost due to a price spike and then block while we cannot get hosts due to price. I have this patch working and will submit it soon.
          Brock Noland made changes -
          Summary PTest2 spot instances should fall back on c1.xlarge and then on-demand instances PTest2 handle Spot Price increases gracefully and improve rsync paralllelsim
          Description Today the price for m1.xlarge instances has been varying dramatically. We should fall back on c1.xlarge (which is more powerful and is cheaper at present) and then on on-demand instances. We should handle spot price increases more gracefully and parallelize rsync to slaves better
          Brock Noland made changes -
          Link This issue supercedes HIVE-4936 [ HIVE-4936 ]
          Brock Noland made changes -
          Description We should handle spot price increases more gracefully and parallelize rsync to slaves better We should handle spot price increases more gracefully and parallelize rsync to slaves better

          NO PRECOMMIT TESTS
          Hide
          Brock Noland added a comment -

          Alright last non-critical fix to PTest2

          I have tested this code a number of times including terminating all spot instances during a test and it worked quite well.

          Show
          Brock Noland added a comment - Alright last non-critical fix to PTest2 I have tested this code a number of times including terminating all spot instances during a test and it worked quite well.
          Brock Noland made changes -
          Attachment HIVE-4920.patch [ 12594545 ]
          Brock Noland made changes -
          Status Open [ 1 ] Patch Available [ 10002 ]
          Hide
          Brock Noland added a comment -

          Also this change allows us to go much wider (16 slaves hosts) with linear increases in test time (2 hours -> 1 hour).

          Show
          Brock Noland added a comment - Also this change allows us to go much wider (16 slaves hosts) with linear increases in test time (2 hours -> 1 hour).
          Hide
          Edward Capriolo added a comment -

          +1. I will review a bit more and commit in 24 hours.

          Show
          Edward Capriolo added a comment - +1. I will review a bit more and commit in 24 hours.
          Hide
          Brock Noland added a comment -

          Minor update. We now handle skipped tests (via @Ignore) properly. New unit tests added to handle this.

          Show
          Brock Noland added a comment - Minor update. We now handle skipped tests (via @Ignore) properly. New unit tests added to handle this.
          Brock Noland made changes -
          Attachment HIVE-4920.patch [ 12594600 ]
          Hide
          Brock Noland added a comment -

          Minor update to handle the hcat tests (which use TestSuite) correctly.

          Show
          Brock Noland added a comment - Minor update to handle the hcat tests (which use TestSuite) correctly.
          Brock Noland made changes -
          Attachment HIVE-4920.patch [ 12594980 ]
          Hide
          Brock Noland added a comment -

          Trivial update to sort failed tests.

          Show
          Brock Noland added a comment - Trivial update to sort failed tests.
          Brock Noland made changes -
          Attachment HIVE-4920.patch [ 12595021 ]
          Hide
          Edward Capriolo added a comment -

          +1 will commit

          Show
          Edward Capriolo added a comment - +1 will commit
          Hide
          Edward Capriolo added a comment -

          Resolved. Thanks Brockinator.

          Show
          Edward Capriolo added a comment - Resolved. Thanks Brockinator.
          Edward Capriolo made changes -
          Status Patch Available [ 10002 ] Resolved [ 5 ]
          Fix Version/s 0.12.0 [ 12324312 ]
          Resolution Fixed [ 1 ]
          Hide
          Hudson added a comment -

          FAILURE: Integrated in Hive-trunk-hadoop2-ptest #38 (See https://builds.apache.org/job/Hive-trunk-hadoop2-ptest/38/)
          HIVE-4920 PTest2 handle Spot Price increases gracefully and improve rsync paralllelsim (Brock Noland via egc)

          Submitted by: Brock Noland
          Reviewed by: Edward Capriolo (ecapriolo: http://svn.apache.org/viewcvs.cgi/?root=Apache-SVN&view=rev&rev=1508707)

          • /hive/trunk/testutils/ptest2/src/main/java/org/apache/hive/ptest/api/client/PTestClient.java
          • /hive/trunk/testutils/ptest2/src/main/java/org/apache/hive/ptest/api/request/TestStartRequest.java
          • /hive/trunk/testutils/ptest2/src/main/java/org/apache/hive/ptest/api/server/ExecutionController.java
          • /hive/trunk/testutils/ptest2/src/main/java/org/apache/hive/ptest/api/server/TestExecutor.java
          • /hive/trunk/testutils/ptest2/src/main/java/org/apache/hive/ptest/execution/CleanupPhase.java
          • /hive/trunk/testutils/ptest2/src/main/java/org/apache/hive/ptest/execution/Constants.java
          • /hive/trunk/testutils/ptest2/src/main/java/org/apache/hive/ptest/execution/Drone.java
          • /hive/trunk/testutils/ptest2/src/main/java/org/apache/hive/ptest/execution/ExecutionPhase.java
          • /hive/trunk/testutils/ptest2/src/main/java/org/apache/hive/ptest/execution/HostExecutor.java
          • /hive/trunk/testutils/ptest2/src/main/java/org/apache/hive/ptest/execution/HostExecutorBuilder.java
          • /hive/trunk/testutils/ptest2/src/main/java/org/apache/hive/ptest/execution/JIRAService.java
          • /hive/trunk/testutils/ptest2/src/main/java/org/apache/hive/ptest/execution/JUnitReportParser.java
          • /hive/trunk/testutils/ptest2/src/main/java/org/apache/hive/ptest/execution/LogDirectoryCleaner.java
          • /hive/trunk/testutils/ptest2/src/main/java/org/apache/hive/ptest/execution/PTest.java
          • /hive/trunk/testutils/ptest2/src/main/java/org/apache/hive/ptest/execution/Phase.java
          • /hive/trunk/testutils/ptest2/src/main/java/org/apache/hive/ptest/execution/PrepPhase.java
          • /hive/trunk/testutils/ptest2/src/main/java/org/apache/hive/ptest/execution/ReportingPhase.java
          • /hive/trunk/testutils/ptest2/src/main/java/org/apache/hive/ptest/execution/conf/ExecutionContextConfiguration.java
          • /hive/trunk/testutils/ptest2/src/main/java/org/apache/hive/ptest/execution/conf/QFileTestBatch.java
          • /hive/trunk/testutils/ptest2/src/main/java/org/apache/hive/ptest/execution/conf/TestConfiguration.java
          • /hive/trunk/testutils/ptest2/src/main/java/org/apache/hive/ptest/execution/conf/TestParser.java
          • /hive/trunk/testutils/ptest2/src/main/java/org/apache/hive/ptest/execution/context/CloudComputeService.java
          • /hive/trunk/testutils/ptest2/src/main/java/org/apache/hive/ptest/execution/context/CloudExecutionContextProvider.java
          • /hive/trunk/testutils/ptest2/src/main/java/org/apache/hive/ptest/execution/ssh/AbstractSSHCommand.java
          • /hive/trunk/testutils/ptest2/src/main/java/org/apache/hive/ptest/execution/ssh/RSyncCommandExecutor.java
          • /hive/trunk/testutils/ptest2/src/main/java/org/apache/hive/ptest/execution/ssh/SSHCommandExecutor.java
          • /hive/trunk/testutils/ptest2/src/main/resources/batch-exec.vm
          • /hive/trunk/testutils/ptest2/src/main/resources/log4j.properties
          • /hive/trunk/testutils/ptest2/src/main/resources/source-prep.vm
          • /hive/trunk/testutils/ptest2/src/test/java/org/apache/hive/ptest/api/server/TestTestExecutor.java
          • /hive/trunk/testutils/ptest2/src/test/java/org/apache/hive/ptest/execution/AbstractTestPhase.java
          • /hive/trunk/testutils/ptest2/src/test/java/org/apache/hive/ptest/execution/MockLocalCommandFactory.java
          • /hive/trunk/testutils/ptest2/src/test/java/org/apache/hive/ptest/execution/MockRSyncCommandExecutor.java
          • /hive/trunk/testutils/ptest2/src/test/java/org/apache/hive/ptest/execution/MockSSHCommandExecutor.java
          • /hive/trunk/testutils/ptest2/src/test/java/org/apache/hive/ptest/execution/TestCleanupPhase.java
          • /hive/trunk/testutils/ptest2/src/test/java/org/apache/hive/ptest/execution/TestCleanupPhase.testExecute.approved.txt
          • /hive/trunk/testutils/ptest2/src/test/java/org/apache/hive/ptest/execution/TestExecutionPhase.java
          • /hive/trunk/testutils/ptest2/src/test/java/org/apache/hive/ptest/execution/TestExecutionPhase.testFailingQFile.approved.txt
          • /hive/trunk/testutils/ptest2/src/test/java/org/apache/hive/ptest/execution/TestExecutionPhase.testFailingUnitTest.approved.txt
          • /hive/trunk/testutils/ptest2/src/test/java/org/apache/hive/ptest/execution/TestExecutionPhase.testPassingQFileTest.approved.txt
          • /hive/trunk/testutils/ptest2/src/test/java/org/apache/hive/ptest/execution/TestExecutionPhase.testPassingUnitTest.approved.txt
          • /hive/trunk/testutils/ptest2/src/test/java/org/apache/hive/ptest/execution/TestHostExecutor.java
          • /hive/trunk/testutils/ptest2/src/test/java/org/apache/hive/ptest/execution/TestPhase.java
          • /hive/trunk/testutils/ptest2/src/test/java/org/apache/hive/ptest/execution/TestPhase.testRsyncFromLocalToRemoteInstancesWithFailureOne.approved.txt
          • /hive/trunk/testutils/ptest2/src/test/java/org/apache/hive/ptest/execution/TestPhase.testRsyncFromLocalToRemoteInstancesWithFailureUnknown.approved.txt
          • /hive/trunk/testutils/ptest2/src/test/java/org/apache/hive/ptest/execution/TestPrepPhase.testExecute.approved.txt
          • /hive/trunk/testutils/ptest2/src/test/java/org/apache/hive/ptest/execution/TestReportParser.java
          • /hive/trunk/testutils/ptest2/src/test/java/org/apache/hive/ptest/execution/TestScripts.java
          • /hive/trunk/testutils/ptest2/src/test/java/org/apache/hive/ptest/execution/TestScripts.testPrepGit.approved.txt
          • /hive/trunk/testutils/ptest2/src/test/java/org/apache/hive/ptest/execution/TestScripts.testPrepNone.approved.txt
          • /hive/trunk/testutils/ptest2/src/test/java/org/apache/hive/ptest/execution/TestScripts.testPrepSvn.approved.txt
          • /hive/trunk/testutils/ptest2/src/test/resources/SomeTest-success.xml
          • /hive/trunk/testutils/ptest2/src/test/resources/test-outputs/SomeTest-truncated.xml
          • /hive/trunk/testutils/ptest2/src/test/resources/test-outputs/skewjoin_union_remove_1.q-TEST-org.apache.hadoop.hive.cli.TestCliDriver.xml
          Show
          Hudson added a comment - FAILURE: Integrated in Hive-trunk-hadoop2-ptest #38 (See https://builds.apache.org/job/Hive-trunk-hadoop2-ptest/38/ ) HIVE-4920 PTest2 handle Spot Price increases gracefully and improve rsync paralllelsim (Brock Noland via egc) Submitted by: Brock Noland Reviewed by: Edward Capriolo (ecapriolo: http://svn.apache.org/viewcvs.cgi/?root=Apache-SVN&view=rev&rev=1508707 ) /hive/trunk/testutils/ptest2/src/main/java/org/apache/hive/ptest/api/client/PTestClient.java /hive/trunk/testutils/ptest2/src/main/java/org/apache/hive/ptest/api/request/TestStartRequest.java /hive/trunk/testutils/ptest2/src/main/java/org/apache/hive/ptest/api/server/ExecutionController.java /hive/trunk/testutils/ptest2/src/main/java/org/apache/hive/ptest/api/server/TestExecutor.java /hive/trunk/testutils/ptest2/src/main/java/org/apache/hive/ptest/execution/CleanupPhase.java /hive/trunk/testutils/ptest2/src/main/java/org/apache/hive/ptest/execution/Constants.java /hive/trunk/testutils/ptest2/src/main/java/org/apache/hive/ptest/execution/Drone.java /hive/trunk/testutils/ptest2/src/main/java/org/apache/hive/ptest/execution/ExecutionPhase.java /hive/trunk/testutils/ptest2/src/main/java/org/apache/hive/ptest/execution/HostExecutor.java /hive/trunk/testutils/ptest2/src/main/java/org/apache/hive/ptest/execution/HostExecutorBuilder.java /hive/trunk/testutils/ptest2/src/main/java/org/apache/hive/ptest/execution/JIRAService.java /hive/trunk/testutils/ptest2/src/main/java/org/apache/hive/ptest/execution/JUnitReportParser.java /hive/trunk/testutils/ptest2/src/main/java/org/apache/hive/ptest/execution/LogDirectoryCleaner.java /hive/trunk/testutils/ptest2/src/main/java/org/apache/hive/ptest/execution/PTest.java /hive/trunk/testutils/ptest2/src/main/java/org/apache/hive/ptest/execution/Phase.java /hive/trunk/testutils/ptest2/src/main/java/org/apache/hive/ptest/execution/PrepPhase.java /hive/trunk/testutils/ptest2/src/main/java/org/apache/hive/ptest/execution/ReportingPhase.java /hive/trunk/testutils/ptest2/src/main/java/org/apache/hive/ptest/execution/conf/ExecutionContextConfiguration.java /hive/trunk/testutils/ptest2/src/main/java/org/apache/hive/ptest/execution/conf/QFileTestBatch.java /hive/trunk/testutils/ptest2/src/main/java/org/apache/hive/ptest/execution/conf/TestConfiguration.java /hive/trunk/testutils/ptest2/src/main/java/org/apache/hive/ptest/execution/conf/TestParser.java /hive/trunk/testutils/ptest2/src/main/java/org/apache/hive/ptest/execution/context/CloudComputeService.java /hive/trunk/testutils/ptest2/src/main/java/org/apache/hive/ptest/execution/context/CloudExecutionContextProvider.java /hive/trunk/testutils/ptest2/src/main/java/org/apache/hive/ptest/execution/ssh/AbstractSSHCommand.java /hive/trunk/testutils/ptest2/src/main/java/org/apache/hive/ptest/execution/ssh/RSyncCommandExecutor.java /hive/trunk/testutils/ptest2/src/main/java/org/apache/hive/ptest/execution/ssh/SSHCommandExecutor.java /hive/trunk/testutils/ptest2/src/main/resources/batch-exec.vm /hive/trunk/testutils/ptest2/src/main/resources/log4j.properties /hive/trunk/testutils/ptest2/src/main/resources/source-prep.vm /hive/trunk/testutils/ptest2/src/test/java/org/apache/hive/ptest/api/server/TestTestExecutor.java /hive/trunk/testutils/ptest2/src/test/java/org/apache/hive/ptest/execution/AbstractTestPhase.java /hive/trunk/testutils/ptest2/src/test/java/org/apache/hive/ptest/execution/MockLocalCommandFactory.java /hive/trunk/testutils/ptest2/src/test/java/org/apache/hive/ptest/execution/MockRSyncCommandExecutor.java /hive/trunk/testutils/ptest2/src/test/java/org/apache/hive/ptest/execution/MockSSHCommandExecutor.java /hive/trunk/testutils/ptest2/src/test/java/org/apache/hive/ptest/execution/TestCleanupPhase.java /hive/trunk/testutils/ptest2/src/test/java/org/apache/hive/ptest/execution/TestCleanupPhase.testExecute.approved.txt /hive/trunk/testutils/ptest2/src/test/java/org/apache/hive/ptest/execution/TestExecutionPhase.java /hive/trunk/testutils/ptest2/src/test/java/org/apache/hive/ptest/execution/TestExecutionPhase.testFailingQFile.approved.txt /hive/trunk/testutils/ptest2/src/test/java/org/apache/hive/ptest/execution/TestExecutionPhase.testFailingUnitTest.approved.txt /hive/trunk/testutils/ptest2/src/test/java/org/apache/hive/ptest/execution/TestExecutionPhase.testPassingQFileTest.approved.txt /hive/trunk/testutils/ptest2/src/test/java/org/apache/hive/ptest/execution/TestExecutionPhase.testPassingUnitTest.approved.txt /hive/trunk/testutils/ptest2/src/test/java/org/apache/hive/ptest/execution/TestHostExecutor.java /hive/trunk/testutils/ptest2/src/test/java/org/apache/hive/ptest/execution/TestPhase.java /hive/trunk/testutils/ptest2/src/test/java/org/apache/hive/ptest/execution/TestPhase.testRsyncFromLocalToRemoteInstancesWithFailureOne.approved.txt /hive/trunk/testutils/ptest2/src/test/java/org/apache/hive/ptest/execution/TestPhase.testRsyncFromLocalToRemoteInstancesWithFailureUnknown.approved.txt /hive/trunk/testutils/ptest2/src/test/java/org/apache/hive/ptest/execution/TestPrepPhase.testExecute.approved.txt /hive/trunk/testutils/ptest2/src/test/java/org/apache/hive/ptest/execution/TestReportParser.java /hive/trunk/testutils/ptest2/src/test/java/org/apache/hive/ptest/execution/TestScripts.java /hive/trunk/testutils/ptest2/src/test/java/org/apache/hive/ptest/execution/TestScripts.testPrepGit.approved.txt /hive/trunk/testutils/ptest2/src/test/java/org/apache/hive/ptest/execution/TestScripts.testPrepNone.approved.txt /hive/trunk/testutils/ptest2/src/test/java/org/apache/hive/ptest/execution/TestScripts.testPrepSvn.approved.txt /hive/trunk/testutils/ptest2/src/test/resources/SomeTest-success.xml /hive/trunk/testutils/ptest2/src/test/resources/test-outputs/SomeTest-truncated.xml /hive/trunk/testutils/ptest2/src/test/resources/test-outputs/skewjoin_union_remove_1.q-TEST-org.apache.hadoop.hive.cli.TestCliDriver.xml
          Hide
          Hudson added a comment -

          FAILURE: Integrated in Hive-trunk-hadoop1-ptest #110 (See https://builds.apache.org/job/Hive-trunk-hadoop1-ptest/110/)
          HIVE-4920 PTest2 handle Spot Price increases gracefully and improve rsync paralllelsim (Brock Noland via egc)

          Submitted by: Brock Noland
          Reviewed by: Edward Capriolo (ecapriolo: http://svn.apache.org/viewcvs.cgi/?root=Apache-SVN&view=rev&rev=1508707)

          • /hive/trunk/testutils/ptest2/src/main/java/org/apache/hive/ptest/api/client/PTestClient.java
          • /hive/trunk/testutils/ptest2/src/main/java/org/apache/hive/ptest/api/request/TestStartRequest.java
          • /hive/trunk/testutils/ptest2/src/main/java/org/apache/hive/ptest/api/server/ExecutionController.java
          • /hive/trunk/testutils/ptest2/src/main/java/org/apache/hive/ptest/api/server/TestExecutor.java
          • /hive/trunk/testutils/ptest2/src/main/java/org/apache/hive/ptest/execution/CleanupPhase.java
          • /hive/trunk/testutils/ptest2/src/main/java/org/apache/hive/ptest/execution/Constants.java
          • /hive/trunk/testutils/ptest2/src/main/java/org/apache/hive/ptest/execution/Drone.java
          • /hive/trunk/testutils/ptest2/src/main/java/org/apache/hive/ptest/execution/ExecutionPhase.java
          • /hive/trunk/testutils/ptest2/src/main/java/org/apache/hive/ptest/execution/HostExecutor.java
          • /hive/trunk/testutils/ptest2/src/main/java/org/apache/hive/ptest/execution/HostExecutorBuilder.java
          • /hive/trunk/testutils/ptest2/src/main/java/org/apache/hive/ptest/execution/JIRAService.java
          • /hive/trunk/testutils/ptest2/src/main/java/org/apache/hive/ptest/execution/JUnitReportParser.java
          • /hive/trunk/testutils/ptest2/src/main/java/org/apache/hive/ptest/execution/LogDirectoryCleaner.java
          • /hive/trunk/testutils/ptest2/src/main/java/org/apache/hive/ptest/execution/PTest.java
          • /hive/trunk/testutils/ptest2/src/main/java/org/apache/hive/ptest/execution/Phase.java
          • /hive/trunk/testutils/ptest2/src/main/java/org/apache/hive/ptest/execution/PrepPhase.java
          • /hive/trunk/testutils/ptest2/src/main/java/org/apache/hive/ptest/execution/ReportingPhase.java
          • /hive/trunk/testutils/ptest2/src/main/java/org/apache/hive/ptest/execution/conf/ExecutionContextConfiguration.java
          • /hive/trunk/testutils/ptest2/src/main/java/org/apache/hive/ptest/execution/conf/QFileTestBatch.java
          • /hive/trunk/testutils/ptest2/src/main/java/org/apache/hive/ptest/execution/conf/TestConfiguration.java
          • /hive/trunk/testutils/ptest2/src/main/java/org/apache/hive/ptest/execution/conf/TestParser.java
          • /hive/trunk/testutils/ptest2/src/main/java/org/apache/hive/ptest/execution/context/CloudComputeService.java
          • /hive/trunk/testutils/ptest2/src/main/java/org/apache/hive/ptest/execution/context/CloudExecutionContextProvider.java
          • /hive/trunk/testutils/ptest2/src/main/java/org/apache/hive/ptest/execution/ssh/AbstractSSHCommand.java
          • /hive/trunk/testutils/ptest2/src/main/java/org/apache/hive/ptest/execution/ssh/RSyncCommandExecutor.java
          • /hive/trunk/testutils/ptest2/src/main/java/org/apache/hive/ptest/execution/ssh/SSHCommandExecutor.java
          • /hive/trunk/testutils/ptest2/src/main/resources/batch-exec.vm
          • /hive/trunk/testutils/ptest2/src/main/resources/log4j.properties
          • /hive/trunk/testutils/ptest2/src/main/resources/source-prep.vm
          • /hive/trunk/testutils/ptest2/src/test/java/org/apache/hive/ptest/api/server/TestTestExecutor.java
          • /hive/trunk/testutils/ptest2/src/test/java/org/apache/hive/ptest/execution/AbstractTestPhase.java
          • /hive/trunk/testutils/ptest2/src/test/java/org/apache/hive/ptest/execution/MockLocalCommandFactory.java
          • /hive/trunk/testutils/ptest2/src/test/java/org/apache/hive/ptest/execution/MockRSyncCommandExecutor.java
          • /hive/trunk/testutils/ptest2/src/test/java/org/apache/hive/ptest/execution/MockSSHCommandExecutor.java
          • /hive/trunk/testutils/ptest2/src/test/java/org/apache/hive/ptest/execution/TestCleanupPhase.java
          • /hive/trunk/testutils/ptest2/src/test/java/org/apache/hive/ptest/execution/TestCleanupPhase.testExecute.approved.txt
          • /hive/trunk/testutils/ptest2/src/test/java/org/apache/hive/ptest/execution/TestExecutionPhase.java
          • /hive/trunk/testutils/ptest2/src/test/java/org/apache/hive/ptest/execution/TestExecutionPhase.testFailingQFile.approved.txt
          • /hive/trunk/testutils/ptest2/src/test/java/org/apache/hive/ptest/execution/TestExecutionPhase.testFailingUnitTest.approved.txt
          • /hive/trunk/testutils/ptest2/src/test/java/org/apache/hive/ptest/execution/TestExecutionPhase.testPassingQFileTest.approved.txt
          • /hive/trunk/testutils/ptest2/src/test/java/org/apache/hive/ptest/execution/TestExecutionPhase.testPassingUnitTest.approved.txt
          • /hive/trunk/testutils/ptest2/src/test/java/org/apache/hive/ptest/execution/TestHostExecutor.java
          • /hive/trunk/testutils/ptest2/src/test/java/org/apache/hive/ptest/execution/TestPhase.java
          • /hive/trunk/testutils/ptest2/src/test/java/org/apache/hive/ptest/execution/TestPhase.testRsyncFromLocalToRemoteInstancesWithFailureOne.approved.txt
          • /hive/trunk/testutils/ptest2/src/test/java/org/apache/hive/ptest/execution/TestPhase.testRsyncFromLocalToRemoteInstancesWithFailureUnknown.approved.txt
          • /hive/trunk/testutils/ptest2/src/test/java/org/apache/hive/ptest/execution/TestPrepPhase.testExecute.approved.txt
          • /hive/trunk/testutils/ptest2/src/test/java/org/apache/hive/ptest/execution/TestReportParser.java
          • /hive/trunk/testutils/ptest2/src/test/java/org/apache/hive/ptest/execution/TestScripts.java
          • /hive/trunk/testutils/ptest2/src/test/java/org/apache/hive/ptest/execution/TestScripts.testPrepGit.approved.txt
          • /hive/trunk/testutils/ptest2/src/test/java/org/apache/hive/ptest/execution/TestScripts.testPrepNone.approved.txt
          • /hive/trunk/testutils/ptest2/src/test/java/org/apache/hive/ptest/execution/TestScripts.testPrepSvn.approved.txt
          • /hive/trunk/testutils/ptest2/src/test/resources/SomeTest-success.xml
          • /hive/trunk/testutils/ptest2/src/test/resources/test-outputs/SomeTest-truncated.xml
          • /hive/trunk/testutils/ptest2/src/test/resources/test-outputs/skewjoin_union_remove_1.q-TEST-org.apache.hadoop.hive.cli.TestCliDriver.xml
          Show
          Hudson added a comment - FAILURE: Integrated in Hive-trunk-hadoop1-ptest #110 (See https://builds.apache.org/job/Hive-trunk-hadoop1-ptest/110/ ) HIVE-4920 PTest2 handle Spot Price increases gracefully and improve rsync paralllelsim (Brock Noland via egc) Submitted by: Brock Noland Reviewed by: Edward Capriolo (ecapriolo: http://svn.apache.org/viewcvs.cgi/?root=Apache-SVN&view=rev&rev=1508707 ) /hive/trunk/testutils/ptest2/src/main/java/org/apache/hive/ptest/api/client/PTestClient.java /hive/trunk/testutils/ptest2/src/main/java/org/apache/hive/ptest/api/request/TestStartRequest.java /hive/trunk/testutils/ptest2/src/main/java/org/apache/hive/ptest/api/server/ExecutionController.java /hive/trunk/testutils/ptest2/src/main/java/org/apache/hive/ptest/api/server/TestExecutor.java /hive/trunk/testutils/ptest2/src/main/java/org/apache/hive/ptest/execution/CleanupPhase.java /hive/trunk/testutils/ptest2/src/main/java/org/apache/hive/ptest/execution/Constants.java /hive/trunk/testutils/ptest2/src/main/java/org/apache/hive/ptest/execution/Drone.java /hive/trunk/testutils/ptest2/src/main/java/org/apache/hive/ptest/execution/ExecutionPhase.java /hive/trunk/testutils/ptest2/src/main/java/org/apache/hive/ptest/execution/HostExecutor.java /hive/trunk/testutils/ptest2/src/main/java/org/apache/hive/ptest/execution/HostExecutorBuilder.java /hive/trunk/testutils/ptest2/src/main/java/org/apache/hive/ptest/execution/JIRAService.java /hive/trunk/testutils/ptest2/src/main/java/org/apache/hive/ptest/execution/JUnitReportParser.java /hive/trunk/testutils/ptest2/src/main/java/org/apache/hive/ptest/execution/LogDirectoryCleaner.java /hive/trunk/testutils/ptest2/src/main/java/org/apache/hive/ptest/execution/PTest.java /hive/trunk/testutils/ptest2/src/main/java/org/apache/hive/ptest/execution/Phase.java /hive/trunk/testutils/ptest2/src/main/java/org/apache/hive/ptest/execution/PrepPhase.java /hive/trunk/testutils/ptest2/src/main/java/org/apache/hive/ptest/execution/ReportingPhase.java /hive/trunk/testutils/ptest2/src/main/java/org/apache/hive/ptest/execution/conf/ExecutionContextConfiguration.java /hive/trunk/testutils/ptest2/src/main/java/org/apache/hive/ptest/execution/conf/QFileTestBatch.java /hive/trunk/testutils/ptest2/src/main/java/org/apache/hive/ptest/execution/conf/TestConfiguration.java /hive/trunk/testutils/ptest2/src/main/java/org/apache/hive/ptest/execution/conf/TestParser.java /hive/trunk/testutils/ptest2/src/main/java/org/apache/hive/ptest/execution/context/CloudComputeService.java /hive/trunk/testutils/ptest2/src/main/java/org/apache/hive/ptest/execution/context/CloudExecutionContextProvider.java /hive/trunk/testutils/ptest2/src/main/java/org/apache/hive/ptest/execution/ssh/AbstractSSHCommand.java /hive/trunk/testutils/ptest2/src/main/java/org/apache/hive/ptest/execution/ssh/RSyncCommandExecutor.java /hive/trunk/testutils/ptest2/src/main/java/org/apache/hive/ptest/execution/ssh/SSHCommandExecutor.java /hive/trunk/testutils/ptest2/src/main/resources/batch-exec.vm /hive/trunk/testutils/ptest2/src/main/resources/log4j.properties /hive/trunk/testutils/ptest2/src/main/resources/source-prep.vm /hive/trunk/testutils/ptest2/src/test/java/org/apache/hive/ptest/api/server/TestTestExecutor.java /hive/trunk/testutils/ptest2/src/test/java/org/apache/hive/ptest/execution/AbstractTestPhase.java /hive/trunk/testutils/ptest2/src/test/java/org/apache/hive/ptest/execution/MockLocalCommandFactory.java /hive/trunk/testutils/ptest2/src/test/java/org/apache/hive/ptest/execution/MockRSyncCommandExecutor.java /hive/trunk/testutils/ptest2/src/test/java/org/apache/hive/ptest/execution/MockSSHCommandExecutor.java /hive/trunk/testutils/ptest2/src/test/java/org/apache/hive/ptest/execution/TestCleanupPhase.java /hive/trunk/testutils/ptest2/src/test/java/org/apache/hive/ptest/execution/TestCleanupPhase.testExecute.approved.txt /hive/trunk/testutils/ptest2/src/test/java/org/apache/hive/ptest/execution/TestExecutionPhase.java /hive/trunk/testutils/ptest2/src/test/java/org/apache/hive/ptest/execution/TestExecutionPhase.testFailingQFile.approved.txt /hive/trunk/testutils/ptest2/src/test/java/org/apache/hive/ptest/execution/TestExecutionPhase.testFailingUnitTest.approved.txt /hive/trunk/testutils/ptest2/src/test/java/org/apache/hive/ptest/execution/TestExecutionPhase.testPassingQFileTest.approved.txt /hive/trunk/testutils/ptest2/src/test/java/org/apache/hive/ptest/execution/TestExecutionPhase.testPassingUnitTest.approved.txt /hive/trunk/testutils/ptest2/src/test/java/org/apache/hive/ptest/execution/TestHostExecutor.java /hive/trunk/testutils/ptest2/src/test/java/org/apache/hive/ptest/execution/TestPhase.java /hive/trunk/testutils/ptest2/src/test/java/org/apache/hive/ptest/execution/TestPhase.testRsyncFromLocalToRemoteInstancesWithFailureOne.approved.txt /hive/trunk/testutils/ptest2/src/test/java/org/apache/hive/ptest/execution/TestPhase.testRsyncFromLocalToRemoteInstancesWithFailureUnknown.approved.txt /hive/trunk/testutils/ptest2/src/test/java/org/apache/hive/ptest/execution/TestPrepPhase.testExecute.approved.txt /hive/trunk/testutils/ptest2/src/test/java/org/apache/hive/ptest/execution/TestReportParser.java /hive/trunk/testutils/ptest2/src/test/java/org/apache/hive/ptest/execution/TestScripts.java /hive/trunk/testutils/ptest2/src/test/java/org/apache/hive/ptest/execution/TestScripts.testPrepGit.approved.txt /hive/trunk/testutils/ptest2/src/test/java/org/apache/hive/ptest/execution/TestScripts.testPrepNone.approved.txt /hive/trunk/testutils/ptest2/src/test/java/org/apache/hive/ptest/execution/TestScripts.testPrepSvn.approved.txt /hive/trunk/testutils/ptest2/src/test/resources/SomeTest-success.xml /hive/trunk/testutils/ptest2/src/test/resources/test-outputs/SomeTest-truncated.xml /hive/trunk/testutils/ptest2/src/test/resources/test-outputs/skewjoin_union_remove_1.q-TEST-org.apache.hadoop.hive.cli.TestCliDriver.xml
          Hide
          Hudson added a comment -

          FAILURE: Integrated in Hive-trunk-h0.21 #2234 (See https://builds.apache.org/job/Hive-trunk-h0.21/2234/)
          HIVE-4920 PTest2 handle Spot Price increases gracefully and improve rsync paralllelsim (Brock Noland via egc)

          Submitted by: Brock Noland
          Reviewed by: Edward Capriolo (ecapriolo: http://svn.apache.org/viewcvs.cgi/?root=Apache-SVN&view=rev&rev=1508707)

          • /hive/trunk/testutils/ptest2/src/main/java/org/apache/hive/ptest/api/client/PTestClient.java
          • /hive/trunk/testutils/ptest2/src/main/java/org/apache/hive/ptest/api/request/TestStartRequest.java
          • /hive/trunk/testutils/ptest2/src/main/java/org/apache/hive/ptest/api/server/ExecutionController.java
          • /hive/trunk/testutils/ptest2/src/main/java/org/apache/hive/ptest/api/server/TestExecutor.java
          • /hive/trunk/testutils/ptest2/src/main/java/org/apache/hive/ptest/execution/CleanupPhase.java
          • /hive/trunk/testutils/ptest2/src/main/java/org/apache/hive/ptest/execution/Constants.java
          • /hive/trunk/testutils/ptest2/src/main/java/org/apache/hive/ptest/execution/Drone.java
          • /hive/trunk/testutils/ptest2/src/main/java/org/apache/hive/ptest/execution/ExecutionPhase.java
          • /hive/trunk/testutils/ptest2/src/main/java/org/apache/hive/ptest/execution/HostExecutor.java
          • /hive/trunk/testutils/ptest2/src/main/java/org/apache/hive/ptest/execution/HostExecutorBuilder.java
          • /hive/trunk/testutils/ptest2/src/main/java/org/apache/hive/ptest/execution/JIRAService.java
          • /hive/trunk/testutils/ptest2/src/main/java/org/apache/hive/ptest/execution/JUnitReportParser.java
          • /hive/trunk/testutils/ptest2/src/main/java/org/apache/hive/ptest/execution/LogDirectoryCleaner.java
          • /hive/trunk/testutils/ptest2/src/main/java/org/apache/hive/ptest/execution/PTest.java
          • /hive/trunk/testutils/ptest2/src/main/java/org/apache/hive/ptest/execution/Phase.java
          • /hive/trunk/testutils/ptest2/src/main/java/org/apache/hive/ptest/execution/PrepPhase.java
          • /hive/trunk/testutils/ptest2/src/main/java/org/apache/hive/ptest/execution/ReportingPhase.java
          • /hive/trunk/testutils/ptest2/src/main/java/org/apache/hive/ptest/execution/conf/ExecutionContextConfiguration.java
          • /hive/trunk/testutils/ptest2/src/main/java/org/apache/hive/ptest/execution/conf/QFileTestBatch.java
          • /hive/trunk/testutils/ptest2/src/main/java/org/apache/hive/ptest/execution/conf/TestConfiguration.java
          • /hive/trunk/testutils/ptest2/src/main/java/org/apache/hive/ptest/execution/conf/TestParser.java
          • /hive/trunk/testutils/ptest2/src/main/java/org/apache/hive/ptest/execution/context/CloudComputeService.java
          • /hive/trunk/testutils/ptest2/src/main/java/org/apache/hive/ptest/execution/context/CloudExecutionContextProvider.java
          • /hive/trunk/testutils/ptest2/src/main/java/org/apache/hive/ptest/execution/ssh/AbstractSSHCommand.java
          • /hive/trunk/testutils/ptest2/src/main/java/org/apache/hive/ptest/execution/ssh/RSyncCommandExecutor.java
          • /hive/trunk/testutils/ptest2/src/main/java/org/apache/hive/ptest/execution/ssh/SSHCommandExecutor.java
          • /hive/trunk/testutils/ptest2/src/main/resources/batch-exec.vm
          • /hive/trunk/testutils/ptest2/src/main/resources/log4j.properties
          • /hive/trunk/testutils/ptest2/src/main/resources/source-prep.vm
          • /hive/trunk/testutils/ptest2/src/test/java/org/apache/hive/ptest/api/server/TestTestExecutor.java
          • /hive/trunk/testutils/ptest2/src/test/java/org/apache/hive/ptest/execution/AbstractTestPhase.java
          • /hive/trunk/testutils/ptest2/src/test/java/org/apache/hive/ptest/execution/MockLocalCommandFactory.java
          • /hive/trunk/testutils/ptest2/src/test/java/org/apache/hive/ptest/execution/MockRSyncCommandExecutor.java
          • /hive/trunk/testutils/ptest2/src/test/java/org/apache/hive/ptest/execution/MockSSHCommandExecutor.java
          • /hive/trunk/testutils/ptest2/src/test/java/org/apache/hive/ptest/execution/TestCleanupPhase.java
          • /hive/trunk/testutils/ptest2/src/test/java/org/apache/hive/ptest/execution/TestCleanupPhase.testExecute.approved.txt
          • /hive/trunk/testutils/ptest2/src/test/java/org/apache/hive/ptest/execution/TestExecutionPhase.java
          • /hive/trunk/testutils/ptest2/src/test/java/org/apache/hive/ptest/execution/TestExecutionPhase.testFailingQFile.approved.txt
          • /hive/trunk/testutils/ptest2/src/test/java/org/apache/hive/ptest/execution/TestExecutionPhase.testFailingUnitTest.approved.txt
          • /hive/trunk/testutils/ptest2/src/test/java/org/apache/hive/ptest/execution/TestExecutionPhase.testPassingQFileTest.approved.txt
          • /hive/trunk/testutils/ptest2/src/test/java/org/apache/hive/ptest/execution/TestExecutionPhase.testPassingUnitTest.approved.txt
          • /hive/trunk/testutils/ptest2/src/test/java/org/apache/hive/ptest/execution/TestHostExecutor.java
          • /hive/trunk/testutils/ptest2/src/test/java/org/apache/hive/ptest/execution/TestPhase.java
          • /hive/trunk/testutils/ptest2/src/test/java/org/apache/hive/ptest/execution/TestPhase.testRsyncFromLocalToRemoteInstancesWithFailureOne.approved.txt
          • /hive/trunk/testutils/ptest2/src/test/java/org/apache/hive/ptest/execution/TestPhase.testRsyncFromLocalToRemoteInstancesWithFailureUnknown.approved.txt
          • /hive/trunk/testutils/ptest2/src/test/java/org/apache/hive/ptest/execution/TestPrepPhase.testExecute.approved.txt
          • /hive/trunk/testutils/ptest2/src/test/java/org/apache/hive/ptest/execution/TestReportParser.java
          • /hive/trunk/testutils/ptest2/src/test/java/org/apache/hive/ptest/execution/TestScripts.java
          • /hive/trunk/testutils/ptest2/src/test/java/org/apache/hive/ptest/execution/TestScripts.testPrepGit.approved.txt
          • /hive/trunk/testutils/ptest2/src/test/java/org/apache/hive/ptest/execution/TestScripts.testPrepNone.approved.txt
          • /hive/trunk/testutils/ptest2/src/test/java/org/apache/hive/ptest/execution/TestScripts.testPrepSvn.approved.txt
          • /hive/trunk/testutils/ptest2/src/test/resources/SomeTest-success.xml
          • /hive/trunk/testutils/ptest2/src/test/resources/test-outputs/SomeTest-truncated.xml
          • /hive/trunk/testutils/ptest2/src/test/resources/test-outputs/skewjoin_union_remove_1.q-TEST-org.apache.hadoop.hive.cli.TestCliDriver.xml
          Show
          Hudson added a comment - FAILURE: Integrated in Hive-trunk-h0.21 #2234 (See https://builds.apache.org/job/Hive-trunk-h0.21/2234/ ) HIVE-4920 PTest2 handle Spot Price increases gracefully and improve rsync paralllelsim (Brock Noland via egc) Submitted by: Brock Noland Reviewed by: Edward Capriolo (ecapriolo: http://svn.apache.org/viewcvs.cgi/?root=Apache-SVN&view=rev&rev=1508707 ) /hive/trunk/testutils/ptest2/src/main/java/org/apache/hive/ptest/api/client/PTestClient.java /hive/trunk/testutils/ptest2/src/main/java/org/apache/hive/ptest/api/request/TestStartRequest.java /hive/trunk/testutils/ptest2/src/main/java/org/apache/hive/ptest/api/server/ExecutionController.java /hive/trunk/testutils/ptest2/src/main/java/org/apache/hive/ptest/api/server/TestExecutor.java /hive/trunk/testutils/ptest2/src/main/java/org/apache/hive/ptest/execution/CleanupPhase.java /hive/trunk/testutils/ptest2/src/main/java/org/apache/hive/ptest/execution/Constants.java /hive/trunk/testutils/ptest2/src/main/java/org/apache/hive/ptest/execution/Drone.java /hive/trunk/testutils/ptest2/src/main/java/org/apache/hive/ptest/execution/ExecutionPhase.java /hive/trunk/testutils/ptest2/src/main/java/org/apache/hive/ptest/execution/HostExecutor.java /hive/trunk/testutils/ptest2/src/main/java/org/apache/hive/ptest/execution/HostExecutorBuilder.java /hive/trunk/testutils/ptest2/src/main/java/org/apache/hive/ptest/execution/JIRAService.java /hive/trunk/testutils/ptest2/src/main/java/org/apache/hive/ptest/execution/JUnitReportParser.java /hive/trunk/testutils/ptest2/src/main/java/org/apache/hive/ptest/execution/LogDirectoryCleaner.java /hive/trunk/testutils/ptest2/src/main/java/org/apache/hive/ptest/execution/PTest.java /hive/trunk/testutils/ptest2/src/main/java/org/apache/hive/ptest/execution/Phase.java /hive/trunk/testutils/ptest2/src/main/java/org/apache/hive/ptest/execution/PrepPhase.java /hive/trunk/testutils/ptest2/src/main/java/org/apache/hive/ptest/execution/ReportingPhase.java /hive/trunk/testutils/ptest2/src/main/java/org/apache/hive/ptest/execution/conf/ExecutionContextConfiguration.java /hive/trunk/testutils/ptest2/src/main/java/org/apache/hive/ptest/execution/conf/QFileTestBatch.java /hive/trunk/testutils/ptest2/src/main/java/org/apache/hive/ptest/execution/conf/TestConfiguration.java /hive/trunk/testutils/ptest2/src/main/java/org/apache/hive/ptest/execution/conf/TestParser.java /hive/trunk/testutils/ptest2/src/main/java/org/apache/hive/ptest/execution/context/CloudComputeService.java /hive/trunk/testutils/ptest2/src/main/java/org/apache/hive/ptest/execution/context/CloudExecutionContextProvider.java /hive/trunk/testutils/ptest2/src/main/java/org/apache/hive/ptest/execution/ssh/AbstractSSHCommand.java /hive/trunk/testutils/ptest2/src/main/java/org/apache/hive/ptest/execution/ssh/RSyncCommandExecutor.java /hive/trunk/testutils/ptest2/src/main/java/org/apache/hive/ptest/execution/ssh/SSHCommandExecutor.java /hive/trunk/testutils/ptest2/src/main/resources/batch-exec.vm /hive/trunk/testutils/ptest2/src/main/resources/log4j.properties /hive/trunk/testutils/ptest2/src/main/resources/source-prep.vm /hive/trunk/testutils/ptest2/src/test/java/org/apache/hive/ptest/api/server/TestTestExecutor.java /hive/trunk/testutils/ptest2/src/test/java/org/apache/hive/ptest/execution/AbstractTestPhase.java /hive/trunk/testutils/ptest2/src/test/java/org/apache/hive/ptest/execution/MockLocalCommandFactory.java /hive/trunk/testutils/ptest2/src/test/java/org/apache/hive/ptest/execution/MockRSyncCommandExecutor.java /hive/trunk/testutils/ptest2/src/test/java/org/apache/hive/ptest/execution/MockSSHCommandExecutor.java /hive/trunk/testutils/ptest2/src/test/java/org/apache/hive/ptest/execution/TestCleanupPhase.java /hive/trunk/testutils/ptest2/src/test/java/org/apache/hive/ptest/execution/TestCleanupPhase.testExecute.approved.txt /hive/trunk/testutils/ptest2/src/test/java/org/apache/hive/ptest/execution/TestExecutionPhase.java /hive/trunk/testutils/ptest2/src/test/java/org/apache/hive/ptest/execution/TestExecutionPhase.testFailingQFile.approved.txt /hive/trunk/testutils/ptest2/src/test/java/org/apache/hive/ptest/execution/TestExecutionPhase.testFailingUnitTest.approved.txt /hive/trunk/testutils/ptest2/src/test/java/org/apache/hive/ptest/execution/TestExecutionPhase.testPassingQFileTest.approved.txt /hive/trunk/testutils/ptest2/src/test/java/org/apache/hive/ptest/execution/TestExecutionPhase.testPassingUnitTest.approved.txt /hive/trunk/testutils/ptest2/src/test/java/org/apache/hive/ptest/execution/TestHostExecutor.java /hive/trunk/testutils/ptest2/src/test/java/org/apache/hive/ptest/execution/TestPhase.java /hive/trunk/testutils/ptest2/src/test/java/org/apache/hive/ptest/execution/TestPhase.testRsyncFromLocalToRemoteInstancesWithFailureOne.approved.txt /hive/trunk/testutils/ptest2/src/test/java/org/apache/hive/ptest/execution/TestPhase.testRsyncFromLocalToRemoteInstancesWithFailureUnknown.approved.txt /hive/trunk/testutils/ptest2/src/test/java/org/apache/hive/ptest/execution/TestPrepPhase.testExecute.approved.txt /hive/trunk/testutils/ptest2/src/test/java/org/apache/hive/ptest/execution/TestReportParser.java /hive/trunk/testutils/ptest2/src/test/java/org/apache/hive/ptest/execution/TestScripts.java /hive/trunk/testutils/ptest2/src/test/java/org/apache/hive/ptest/execution/TestScripts.testPrepGit.approved.txt /hive/trunk/testutils/ptest2/src/test/java/org/apache/hive/ptest/execution/TestScripts.testPrepNone.approved.txt /hive/trunk/testutils/ptest2/src/test/java/org/apache/hive/ptest/execution/TestScripts.testPrepSvn.approved.txt /hive/trunk/testutils/ptest2/src/test/resources/SomeTest-success.xml /hive/trunk/testutils/ptest2/src/test/resources/test-outputs/SomeTest-truncated.xml /hive/trunk/testutils/ptest2/src/test/resources/test-outputs/skewjoin_union_remove_1.q-TEST-org.apache.hadoop.hive.cli.TestCliDriver.xml
          Hide
          Hudson added a comment -

          ABORTED: Integrated in Hive-trunk-hadoop2 #319 (See https://builds.apache.org/job/Hive-trunk-hadoop2/319/)
          HIVE-4920 PTest2 handle Spot Price increases gracefully and improve rsync paralllelsim (Brock Noland via egc)

          Submitted by: Brock Noland
          Reviewed by: Edward Capriolo (ecapriolo: http://svn.apache.org/viewcvs.cgi/?root=Apache-SVN&view=rev&rev=1508707)

          • /hive/trunk/testutils/ptest2/src/main/java/org/apache/hive/ptest/api/client/PTestClient.java
          • /hive/trunk/testutils/ptest2/src/main/java/org/apache/hive/ptest/api/request/TestStartRequest.java
          • /hive/trunk/testutils/ptest2/src/main/java/org/apache/hive/ptest/api/server/ExecutionController.java
          • /hive/trunk/testutils/ptest2/src/main/java/org/apache/hive/ptest/api/server/TestExecutor.java
          • /hive/trunk/testutils/ptest2/src/main/java/org/apache/hive/ptest/execution/CleanupPhase.java
          • /hive/trunk/testutils/ptest2/src/main/java/org/apache/hive/ptest/execution/Constants.java
          • /hive/trunk/testutils/ptest2/src/main/java/org/apache/hive/ptest/execution/Drone.java
          • /hive/trunk/testutils/ptest2/src/main/java/org/apache/hive/ptest/execution/ExecutionPhase.java
          • /hive/trunk/testutils/ptest2/src/main/java/org/apache/hive/ptest/execution/HostExecutor.java
          • /hive/trunk/testutils/ptest2/src/main/java/org/apache/hive/ptest/execution/HostExecutorBuilder.java
          • /hive/trunk/testutils/ptest2/src/main/java/org/apache/hive/ptest/execution/JIRAService.java
          • /hive/trunk/testutils/ptest2/src/main/java/org/apache/hive/ptest/execution/JUnitReportParser.java
          • /hive/trunk/testutils/ptest2/src/main/java/org/apache/hive/ptest/execution/LogDirectoryCleaner.java
          • /hive/trunk/testutils/ptest2/src/main/java/org/apache/hive/ptest/execution/PTest.java
          • /hive/trunk/testutils/ptest2/src/main/java/org/apache/hive/ptest/execution/Phase.java
          • /hive/trunk/testutils/ptest2/src/main/java/org/apache/hive/ptest/execution/PrepPhase.java
          • /hive/trunk/testutils/ptest2/src/main/java/org/apache/hive/ptest/execution/ReportingPhase.java
          • /hive/trunk/testutils/ptest2/src/main/java/org/apache/hive/ptest/execution/conf/ExecutionContextConfiguration.java
          • /hive/trunk/testutils/ptest2/src/main/java/org/apache/hive/ptest/execution/conf/QFileTestBatch.java
          • /hive/trunk/testutils/ptest2/src/main/java/org/apache/hive/ptest/execution/conf/TestConfiguration.java
          • /hive/trunk/testutils/ptest2/src/main/java/org/apache/hive/ptest/execution/conf/TestParser.java
          • /hive/trunk/testutils/ptest2/src/main/java/org/apache/hive/ptest/execution/context/CloudComputeService.java
          • /hive/trunk/testutils/ptest2/src/main/java/org/apache/hive/ptest/execution/context/CloudExecutionContextProvider.java
          • /hive/trunk/testutils/ptest2/src/main/java/org/apache/hive/ptest/execution/ssh/AbstractSSHCommand.java
          • /hive/trunk/testutils/ptest2/src/main/java/org/apache/hive/ptest/execution/ssh/RSyncCommandExecutor.java
          • /hive/trunk/testutils/ptest2/src/main/java/org/apache/hive/ptest/execution/ssh/SSHCommandExecutor.java
          • /hive/trunk/testutils/ptest2/src/main/resources/batch-exec.vm
          • /hive/trunk/testutils/ptest2/src/main/resources/log4j.properties
          • /hive/trunk/testutils/ptest2/src/main/resources/source-prep.vm
          • /hive/trunk/testutils/ptest2/src/test/java/org/apache/hive/ptest/api/server/TestTestExecutor.java
          • /hive/trunk/testutils/ptest2/src/test/java/org/apache/hive/ptest/execution/AbstractTestPhase.java
          • /hive/trunk/testutils/ptest2/src/test/java/org/apache/hive/ptest/execution/MockLocalCommandFactory.java
          • /hive/trunk/testutils/ptest2/src/test/java/org/apache/hive/ptest/execution/MockRSyncCommandExecutor.java
          • /hive/trunk/testutils/ptest2/src/test/java/org/apache/hive/ptest/execution/MockSSHCommandExecutor.java
          • /hive/trunk/testutils/ptest2/src/test/java/org/apache/hive/ptest/execution/TestCleanupPhase.java
          • /hive/trunk/testutils/ptest2/src/test/java/org/apache/hive/ptest/execution/TestCleanupPhase.testExecute.approved.txt
          • /hive/trunk/testutils/ptest2/src/test/java/org/apache/hive/ptest/execution/TestExecutionPhase.java
          • /hive/trunk/testutils/ptest2/src/test/java/org/apache/hive/ptest/execution/TestExecutionPhase.testFailingQFile.approved.txt
          • /hive/trunk/testutils/ptest2/src/test/java/org/apache/hive/ptest/execution/TestExecutionPhase.testFailingUnitTest.approved.txt
          • /hive/trunk/testutils/ptest2/src/test/java/org/apache/hive/ptest/execution/TestExecutionPhase.testPassingQFileTest.approved.txt
          • /hive/trunk/testutils/ptest2/src/test/java/org/apache/hive/ptest/execution/TestExecutionPhase.testPassingUnitTest.approved.txt
          • /hive/trunk/testutils/ptest2/src/test/java/org/apache/hive/ptest/execution/TestHostExecutor.java
          • /hive/trunk/testutils/ptest2/src/test/java/org/apache/hive/ptest/execution/TestPhase.java
          • /hive/trunk/testutils/ptest2/src/test/java/org/apache/hive/ptest/execution/TestPhase.testRsyncFromLocalToRemoteInstancesWithFailureOne.approved.txt
          • /hive/trunk/testutils/ptest2/src/test/java/org/apache/hive/ptest/execution/TestPhase.testRsyncFromLocalToRemoteInstancesWithFailureUnknown.approved.txt
          • /hive/trunk/testutils/ptest2/src/test/java/org/apache/hive/ptest/execution/TestPrepPhase.testExecute.approved.txt
          • /hive/trunk/testutils/ptest2/src/test/java/org/apache/hive/ptest/execution/TestReportParser.java
          • /hive/trunk/testutils/ptest2/src/test/java/org/apache/hive/ptest/execution/TestScripts.java
          • /hive/trunk/testutils/ptest2/src/test/java/org/apache/hive/ptest/execution/TestScripts.testPrepGit.approved.txt
          • /hive/trunk/testutils/ptest2/src/test/java/org/apache/hive/ptest/execution/TestScripts.testPrepNone.approved.txt
          • /hive/trunk/testutils/ptest2/src/test/java/org/apache/hive/ptest/execution/TestScripts.testPrepSvn.approved.txt
          • /hive/trunk/testutils/ptest2/src/test/resources/SomeTest-success.xml
          • /hive/trunk/testutils/ptest2/src/test/resources/test-outputs/SomeTest-truncated.xml
          • /hive/trunk/testutils/ptest2/src/test/resources/test-outputs/skewjoin_union_remove_1.q-TEST-org.apache.hadoop.hive.cli.TestCliDriver.xml
          Show
          Hudson added a comment - ABORTED: Integrated in Hive-trunk-hadoop2 #319 (See https://builds.apache.org/job/Hive-trunk-hadoop2/319/ ) HIVE-4920 PTest2 handle Spot Price increases gracefully and improve rsync paralllelsim (Brock Noland via egc) Submitted by: Brock Noland Reviewed by: Edward Capriolo (ecapriolo: http://svn.apache.org/viewcvs.cgi/?root=Apache-SVN&view=rev&rev=1508707 ) /hive/trunk/testutils/ptest2/src/main/java/org/apache/hive/ptest/api/client/PTestClient.java /hive/trunk/testutils/ptest2/src/main/java/org/apache/hive/ptest/api/request/TestStartRequest.java /hive/trunk/testutils/ptest2/src/main/java/org/apache/hive/ptest/api/server/ExecutionController.java /hive/trunk/testutils/ptest2/src/main/java/org/apache/hive/ptest/api/server/TestExecutor.java /hive/trunk/testutils/ptest2/src/main/java/org/apache/hive/ptest/execution/CleanupPhase.java /hive/trunk/testutils/ptest2/src/main/java/org/apache/hive/ptest/execution/Constants.java /hive/trunk/testutils/ptest2/src/main/java/org/apache/hive/ptest/execution/Drone.java /hive/trunk/testutils/ptest2/src/main/java/org/apache/hive/ptest/execution/ExecutionPhase.java /hive/trunk/testutils/ptest2/src/main/java/org/apache/hive/ptest/execution/HostExecutor.java /hive/trunk/testutils/ptest2/src/main/java/org/apache/hive/ptest/execution/HostExecutorBuilder.java /hive/trunk/testutils/ptest2/src/main/java/org/apache/hive/ptest/execution/JIRAService.java /hive/trunk/testutils/ptest2/src/main/java/org/apache/hive/ptest/execution/JUnitReportParser.java /hive/trunk/testutils/ptest2/src/main/java/org/apache/hive/ptest/execution/LogDirectoryCleaner.java /hive/trunk/testutils/ptest2/src/main/java/org/apache/hive/ptest/execution/PTest.java /hive/trunk/testutils/ptest2/src/main/java/org/apache/hive/ptest/execution/Phase.java /hive/trunk/testutils/ptest2/src/main/java/org/apache/hive/ptest/execution/PrepPhase.java /hive/trunk/testutils/ptest2/src/main/java/org/apache/hive/ptest/execution/ReportingPhase.java /hive/trunk/testutils/ptest2/src/main/java/org/apache/hive/ptest/execution/conf/ExecutionContextConfiguration.java /hive/trunk/testutils/ptest2/src/main/java/org/apache/hive/ptest/execution/conf/QFileTestBatch.java /hive/trunk/testutils/ptest2/src/main/java/org/apache/hive/ptest/execution/conf/TestConfiguration.java /hive/trunk/testutils/ptest2/src/main/java/org/apache/hive/ptest/execution/conf/TestParser.java /hive/trunk/testutils/ptest2/src/main/java/org/apache/hive/ptest/execution/context/CloudComputeService.java /hive/trunk/testutils/ptest2/src/main/java/org/apache/hive/ptest/execution/context/CloudExecutionContextProvider.java /hive/trunk/testutils/ptest2/src/main/java/org/apache/hive/ptest/execution/ssh/AbstractSSHCommand.java /hive/trunk/testutils/ptest2/src/main/java/org/apache/hive/ptest/execution/ssh/RSyncCommandExecutor.java /hive/trunk/testutils/ptest2/src/main/java/org/apache/hive/ptest/execution/ssh/SSHCommandExecutor.java /hive/trunk/testutils/ptest2/src/main/resources/batch-exec.vm /hive/trunk/testutils/ptest2/src/main/resources/log4j.properties /hive/trunk/testutils/ptest2/src/main/resources/source-prep.vm /hive/trunk/testutils/ptest2/src/test/java/org/apache/hive/ptest/api/server/TestTestExecutor.java /hive/trunk/testutils/ptest2/src/test/java/org/apache/hive/ptest/execution/AbstractTestPhase.java /hive/trunk/testutils/ptest2/src/test/java/org/apache/hive/ptest/execution/MockLocalCommandFactory.java /hive/trunk/testutils/ptest2/src/test/java/org/apache/hive/ptest/execution/MockRSyncCommandExecutor.java /hive/trunk/testutils/ptest2/src/test/java/org/apache/hive/ptest/execution/MockSSHCommandExecutor.java /hive/trunk/testutils/ptest2/src/test/java/org/apache/hive/ptest/execution/TestCleanupPhase.java /hive/trunk/testutils/ptest2/src/test/java/org/apache/hive/ptest/execution/TestCleanupPhase.testExecute.approved.txt /hive/trunk/testutils/ptest2/src/test/java/org/apache/hive/ptest/execution/TestExecutionPhase.java /hive/trunk/testutils/ptest2/src/test/java/org/apache/hive/ptest/execution/TestExecutionPhase.testFailingQFile.approved.txt /hive/trunk/testutils/ptest2/src/test/java/org/apache/hive/ptest/execution/TestExecutionPhase.testFailingUnitTest.approved.txt /hive/trunk/testutils/ptest2/src/test/java/org/apache/hive/ptest/execution/TestExecutionPhase.testPassingQFileTest.approved.txt /hive/trunk/testutils/ptest2/src/test/java/org/apache/hive/ptest/execution/TestExecutionPhase.testPassingUnitTest.approved.txt /hive/trunk/testutils/ptest2/src/test/java/org/apache/hive/ptest/execution/TestHostExecutor.java /hive/trunk/testutils/ptest2/src/test/java/org/apache/hive/ptest/execution/TestPhase.java /hive/trunk/testutils/ptest2/src/test/java/org/apache/hive/ptest/execution/TestPhase.testRsyncFromLocalToRemoteInstancesWithFailureOne.approved.txt /hive/trunk/testutils/ptest2/src/test/java/org/apache/hive/ptest/execution/TestPhase.testRsyncFromLocalToRemoteInstancesWithFailureUnknown.approved.txt /hive/trunk/testutils/ptest2/src/test/java/org/apache/hive/ptest/execution/TestPrepPhase.testExecute.approved.txt /hive/trunk/testutils/ptest2/src/test/java/org/apache/hive/ptest/execution/TestReportParser.java /hive/trunk/testutils/ptest2/src/test/java/org/apache/hive/ptest/execution/TestScripts.java /hive/trunk/testutils/ptest2/src/test/java/org/apache/hive/ptest/execution/TestScripts.testPrepGit.approved.txt /hive/trunk/testutils/ptest2/src/test/java/org/apache/hive/ptest/execution/TestScripts.testPrepNone.approved.txt /hive/trunk/testutils/ptest2/src/test/java/org/apache/hive/ptest/execution/TestScripts.testPrepSvn.approved.txt /hive/trunk/testutils/ptest2/src/test/resources/SomeTest-success.xml /hive/trunk/testutils/ptest2/src/test/resources/test-outputs/SomeTest-truncated.xml /hive/trunk/testutils/ptest2/src/test/resources/test-outputs/skewjoin_union_remove_1.q-TEST-org.apache.hadoop.hive.cli.TestCliDriver.xml
          Hide
          Ashutosh Chauhan added a comment -

          This issue has been fixed and released as part of 0.12 release. If you find further issues, please create a new jira and link it to this one.

          Show
          Ashutosh Chauhan added a comment - This issue has been fixed and released as part of 0.12 release. If you find further issues, please create a new jira and link it to this one.
          Ashutosh Chauhan made changes -
          Status Resolved [ 5 ] Closed [ 6 ]
          Transition Time In Source Status Execution Times Last Executer Last Execution Date
          Open Open Patch Available Patch Available
          3d 21h 55m 1 Brock Noland 27/Jul/13 18:27
          Patch Available Patch Available Resolved Resolved
          3d 8h 24m 1 Edward Capriolo 31/Jul/13 02:52
          Resolved Resolved Closed Closed
          76d 21h 39m 1 Ashutosh Chauhan 16/Oct/13 00:31

            People

            • Assignee:
              Brock Noland
              Reporter:
              Brock Noland
            • Votes:
              0 Vote for this issue
              Watchers:
              3 Start watching this issue

              Dates

              • Created:
                Updated:
                Resolved:

                Development