Details

    • Type: Bug Bug
    • Status: Closed
    • Priority: Major Major
    • Resolution: Fixed
    • Affects Version/s: 0.11.0
    • Fix Version/s: 0.11.0
    • Component/s: None
    • Labels:
      None
    • Hadoop Flags:
      Reviewed

      Description

      This test-case was introduced in HIVE-3750 and is failing since as soon as it was introduced.

        Activity

        Ashutosh Chauhan created issue -
        Hide
        Ashutosh Chauhan added a comment - - edited

        Looking at apache build logs, this test fails randomly. It failed in https://builds.apache.org/job/Hive-trunk-h0.21/1846/ and https://builds.apache.org/job/Hive-trunk-h0.21/1842/testReport/ but didn't fail in https://builds.apache.org/job/Hive-trunk-h0.21/1845/ https://builds.apache.org/job/Hive-trunk-h0.21/1844/ https://builds.apache.org/job/Hive-trunk-h0.21/1843/

        In my environment it almost always failed since it has been committed except for once when it did pass. Seems like some race condition. It always fails with following stack-trace:

          [junit] diff -a /home/ashutosh/hive/build/ql/test/logs/clientpositive/stats19.q.out /home/ashutosh/hive/ql/src/test/results/clientpositive/stats19.q.out
            [junit] 21,22c21,22
            [junit] < Stats prefix is hashed: false
            [junit] < Stats prefix is hashed: false
            [junit] ---
            [junit] > Stats prefix is hashed: true
            [junit] > Stats prefix is hashed: true
            [junit] 284,285c284,285
            [junit] < Stats prefix is hashed: false
            [junit] < Stats prefix is hashed: false
            [junit] ---
            [junit] > Stats prefix is hashed: true
            [junit] > Stats prefix is hashed: true
            [junit] Exception: Client execution results failed with error code = 1
            [junit] See build/ql/tmp/hive.log, or try "ant test ... -Dtest.silent=false" to get more logs.
            [junit] Failed query: stats19.q
        

        On the other hand, TestStatsPublisherEnhanced fails for me randomly as well. But, much more rarely. Only twice in last week in my environment. I don't remember seen it failing on apache machine yet.

            [junit] Running org.apache.hadoop.hive.ql.exec.TestStatsPublisherEnhanced
            [junit] StatsPublisher - one stat published per key - aggregating matching key
            [junit] StatsPublisher - basic functionality
            [junit] junit.framework.AssertionFailedError: null
            [junit] StatsPublisher - multiple updates
            [junit]     at junit.framework.Assert.fail(Assert.java:47)
            [junit]     at junit.framework.Assert.assertTrue(Assert.java:20)
            [junit]     at junit.framework.Assert.assertTrue(Assert.java:27)
            [junit]     at org.apache.hadoop.hive.ql.exec.TestStatsPublisherEnhanced.testStatsPublisherOneStat(TestStatsPublisherEnhanced.java:81)
            [junit]     at sun.reflect.NativeMethodAccessorImpl.invoke0(Native Method)
            [junit]     at sun.reflect.NativeMethodAccessorImpl.invoke(NativeMethodAccessorImpl.java:39)
            [junit]     at sun.reflect.DelegatingMethodAccessorImpl.invoke(DelegatingMethodAccessorImpl.java:25)
            [junit]     at java.lang.reflect.Method.invoke(Method.java:597)
            [junit]     at junit.framework.TestCase.runTest(TestCase.java:168)
            [junit]     at junit.framework.TestCase.runBare(TestCase.java:134)
            [junit]     at junit.framework.TestResult$1.protect(TestResult.java:110)
            [junit]     at junit.framework.TestResult.runProtected(TestResult.java:128)
            [junit]     at junit.framework.TestResult.run(TestResult.java:113)
            [junit]     at junit.framework.TestCase.run(TestCase.java:124)
            [junit]     at junit.framework.TestSuite.runTest(TestSuite.java:232)
            [junit]     at junit.framework.TestSuite.run(TestSuite.java:227)
            [junit]     at org.apache.tools.ant.taskdefs.optional.junit.JUnitTestRunner.run(JUnitTestRunner.java:518)
            [junit]     at org.apache.tools.ant.taskdefs.optional.junit.JUnitTestRunner.launch(JUnitTestRunner.java:1052)
            [junit]     at org.apache.tools.ant.taskdefs.optional.junit.JUnitTestRunner.main(JUnitTestRunner.java:906)
            [junit] junit.framework.AssertionFailedError: null
            [junit]     at junit.framework.Assert.fail(Assert.java:47)
            [junit]     at junit.framework.Assert.assertTrue(Assert.java:20)
            [junit]     at junit.framework.Assert.assertTrue(Assert.java:27)
            [junit]     at org.apache.hadoop.hive.ql.exec.TestStatsPublisherEnhanced.testStatsPublisher(TestStatsPublisherEnhanced.java:129)
            [junit]     at sun.reflect.NativeMethodAccessorImpl.invoke0(Native Method)
            [junit]     at sun.reflect.NativeMethodAccessorImpl.invoke(NativeMethodAccessorImpl.java:39)
            [junit]     at sun.reflect.DelegatingMethodAccessorImpl.invoke(DelegatingMethodAccessorImpl.java:25)
            [junit]     at java.lang.reflect.Method.invoke(Method.java:597)
            [junit]     at junit.framework.TestCase.runTest(TestCase.java:168)
            [junit]     at junit.framework.TestCase.runBare(TestCase.java:134)
            [junit]     at junit.framework.TestResult$1.protect(TestResult.java:110)
            [junit]     at junit.framework.TestResult.runProtected(TestResult.java:128)
            [junit]     at junit.framework.TestResult.run(TestResult.java:113)
            [junit]     at junit.framework.TestCase.run(TestCase.java:124)
            [junit]     at junit.framework.TestSuite.runTest(TestSuite.java:232)
            [junit]     at junit.framework.TestSuite.run(TestSuite.java:227)
            [junit]     at org.apache.tools.ant.taskdefs.optional.junit.JUnitTestRunner.run(JUnitTestRunner.java:518)
            [junit]     at org.apache.tools.ant.taskdefs.optional.junit.JUnitTestRunner.launch(JUnitTestRunner.java:1052)
            [junit]     at org.apache.tools.ant.taskdefs.optional.junit.JUnitTestRunner.main(JUnitTestRunner.java:906)
            [junit] StatsPublisher - (multiple updates + publishing subset of supported statistics)
            [junit] StatsAggregator - clean-up
            [junit] junit.framework.AssertionFailedError: null
            [junit]     at junit.framework.Assert.fail(Assert.java:47)
            [junit]     at junit.framework.Assert.assertTrue(Assert.java:20)
            [junit]     at junit.framework.Assert.assertTrue(Assert.java:27)
            [junit]     at org.apache.hadoop.hive.ql.exec.TestStatsPublisherEnhanced.testStatsPublisherMultipleUpdates(TestStatsPublisherEnhanced.java:190)
            [junit]     at sun.reflect.NativeMethodAccessorImpl.invoke0(Native Method)
            [junit]     at sun.reflect.NativeMethodAccessorImpl.invoke(NativeMethodAccessorImpl.java:39)
            [junit]     at sun.reflect.DelegatingMethodAccessorImpl.invoke(DelegatingMethodAccessorImpl.java:25)
            [junit]     at java.lang.reflect.Method.invoke(Method.java:597)
            [junit]     at junit.framework.TestCase.runTest(TestCase.java:168)
            [junit]     at junit.framework.TestCase.runBare(TestCase.java:134)
            [junit]     at junit.framework.TestResult$1.protect(TestResult.java:110)
            [junit]     at junit.framework.TestResult.runProtected(TestResult.java:128)
            [junit]     at junit.framework.TestResult.run(TestResult.java:113)
            [junit]     at junit.framework.TestCase.run(TestCase.java:124)
            [junit]     at junit.framework.TestSuite.runTest(TestSuite.java:232)
            [junit]     at junit.framework.TestSuite.run(TestSuite.java:227)
            [junit]     at org.apache.tools.ant.taskdefs.optional.junit.JUnitTestRunner.run(JUnitTestRunner.java:518)
            [junit]     at org.apache.tools.ant.taskdefs.optional.junit.JUnitTestRunner.launch(JUnitTestRunner.java:1052)
            [junit]     at org.apache.tools.ant.taskdefs.optional.junit.JUnitTestRunner.main(JUnitTestRunner.java:906)
            [junit] junit.framework.AssertionFailedError: null
            [junit]     at junit.framework.Assert.fail(Assert.java:47)
            [junit]     at junit.framework.Assert.assertTrue(Assert.java:20)
            [junit]     at junit.framework.Assert.assertTrue(Assert.java:27)
            [junit]     at org.apache.hadoop.hive.ql.exec.TestStatsPublisherEnhanced.testStatsPublisherMultipleUpdatesSubsetStatistics(TestStatsPublisherEnhanced.java:255)
            [junit]     at sun.reflect.NativeMethodAccessorImpl.invoke0(Native Method)
            [junit]     at sun.reflect.NativeMethodAccessorImpl.invoke(NativeMethodAccessorImpl.java:39)
            [junit]     at sun.reflect.DelegatingMethodAccessorImpl.invoke(DelegatingMethodAccessorImpl.java:25)
            [junit]     at java.lang.reflect.Method.invoke(Method.java:597)
            [junit]     at junit.framework.TestCase.runTest(TestCase.java:168)
            [junit]     at junit.framework.TestCase.runBare(TestCase.java:134)
            [junit]     at junit.framework.TestResult$1.protect(TestResult.java:110)
            [junit]     at junit.framework.TestResult.runProtected(TestResult.java:128)
            [junit]     at junit.framework.TestResult.run(TestResult.java:113)
            [junit]     at junit.framework.TestCase.run(TestCase.java:124)
            [junit]     at junit.framework.TestSuite.runTest(TestSuite.java:232)
            [junit]     at junit.framework.TestSuite.run(TestSuite.java:227)
            [junit]     at org.apache.tools.ant.taskdefs.optional.junit.JUnitTestRunner.run(JUnitTestRunner.java:518)
            [junit]     at org.apache.tools.ant.taskdefs.optional.junit.JUnitTestRunner.launch(JUnitTestRunner.java:1052)
            [junit]     at org.apache.tools.ant.taskdefs.optional.junit.JUnitTestRunner.main(JUnitTestRunner.java:906)
            [junit] junit.framework.AssertionFailedError: null
            [junit]     at junit.framework.Assert.fail(Assert.java:47)
            [junit]     at junit.framework.Assert.assertTrue(Assert.java:20)
            [junit]     at junit.framework.Assert.assertTrue(Assert.java:27)
            [junit]     at org.apache.hadoop.hive.ql.exec.TestStatsPublisherEnhanced.testStatsAggregatorCleanUp(TestStatsPublisherEnhanced.java:326)
            [junit]     at sun.reflect.NativeMethodAccessorImpl.invoke0(Native Method)
            [junit]     at sun.reflect.NativeMethodAccessorImpl.invoke(NativeMethodAccessorImpl.java:39)
            [junit]     at sun.reflect.DelegatingMethodAccessorImpl.invoke(DelegatingMethodAccessorImpl.java:25)
            [junit]     at java.lang.reflect.Method.invoke(Method.java:597)
            [junit]     at junit.framework.TestCase.runTest(TestCase.java:168)
            [junit]     at junit.framework.TestCase.runBare(TestCase.java:134)
            [junit]     at junit.framework.TestResult$1.protect(TestResult.java:110)
            [junit]     at junit.framework.TestResult.runProtected(TestResult.java:128)
            [junit]     at junit.framework.TestResult.run(TestResult.java:113)
            [junit]     at junit.framework.TestCase.run(TestCase.java:124)
            [junit]     at junit.framework.TestSuite.runTest(TestSuite.java:232)
            [junit]     at junit.framework.TestSuite.run(TestSuite.java:227)
            [junit]     at org.apache.tools.ant.taskdefs.optional.junit.JUnitTestRunner.run(JUnitTestRunner.java:518)
            [junit]     at org.apache.tools.ant.taskdefs.optional.junit.JUnitTestRunner.launch(JUnitTestRunner.java:1052)
            [junit]     at org.apache.tools.ant.taskdefs.optional.junit.JUnitTestRunner.main(JUnitTestRunner.java:906)
            [junit] Tests run: 5, Failures: 5, Errors: 0, Time elapsed: 0.756 sec
            [junit] Test org.apache.hadoop.hive.ql.exec.TestStatsPublisherEnhanced FAILED
        
        Show
        Ashutosh Chauhan added a comment - - edited Looking at apache build logs, this test fails randomly. It failed in https://builds.apache.org/job/Hive-trunk-h0.21/1846/ and https://builds.apache.org/job/Hive-trunk-h0.21/1842/testReport/ but didn't fail in https://builds.apache.org/job/Hive-trunk-h0.21/1845/ https://builds.apache.org/job/Hive-trunk-h0.21/1844/ https://builds.apache.org/job/Hive-trunk-h0.21/1843/ In my environment it almost always failed since it has been committed except for once when it did pass. Seems like some race condition. It always fails with following stack-trace: [junit] diff -a /home/ashutosh/hive/build/ql/test/logs/clientpositive/stats19.q.out /home/ashutosh/hive/ql/src/test/results/clientpositive/stats19.q.out [junit] 21,22c21,22 [junit] < Stats prefix is hashed: false [junit] < Stats prefix is hashed: false [junit] --- [junit] > Stats prefix is hashed: true [junit] > Stats prefix is hashed: true [junit] 284,285c284,285 [junit] < Stats prefix is hashed: false [junit] < Stats prefix is hashed: false [junit] --- [junit] > Stats prefix is hashed: true [junit] > Stats prefix is hashed: true [junit] Exception: Client execution results failed with error code = 1 [junit] See build/ql/tmp/hive.log, or try "ant test ... -Dtest.silent= false " to get more logs. [junit] Failed query: stats19.q On the other hand, TestStatsPublisherEnhanced fails for me randomly as well. But, much more rarely. Only twice in last week in my environment. I don't remember seen it failing on apache machine yet. [junit] Running org.apache.hadoop.hive.ql.exec.TestStatsPublisherEnhanced [junit] StatsPublisher - one stat published per key - aggregating matching key [junit] StatsPublisher - basic functionality [junit] junit.framework.AssertionFailedError: null [junit] StatsPublisher - multiple updates [junit] at junit.framework.Assert.fail(Assert.java:47) [junit] at junit.framework.Assert.assertTrue(Assert.java:20) [junit] at junit.framework.Assert.assertTrue(Assert.java:27) [junit] at org.apache.hadoop.hive.ql.exec.TestStatsPublisherEnhanced.testStatsPublisherOneStat(TestStatsPublisherEnhanced.java:81) [junit] at sun.reflect.NativeMethodAccessorImpl.invoke0(Native Method) [junit] at sun.reflect.NativeMethodAccessorImpl.invoke(NativeMethodAccessorImpl.java:39) [junit] at sun.reflect.DelegatingMethodAccessorImpl.invoke(DelegatingMethodAccessorImpl.java:25) [junit] at java.lang.reflect.Method.invoke(Method.java:597) [junit] at junit.framework.TestCase.runTest(TestCase.java:168) [junit] at junit.framework.TestCase.runBare(TestCase.java:134) [junit] at junit.framework.TestResult$1.protect(TestResult.java:110) [junit] at junit.framework.TestResult.runProtected(TestResult.java:128) [junit] at junit.framework.TestResult.run(TestResult.java:113) [junit] at junit.framework.TestCase.run(TestCase.java:124) [junit] at junit.framework.TestSuite.runTest(TestSuite.java:232) [junit] at junit.framework.TestSuite.run(TestSuite.java:227) [junit] at org.apache.tools.ant.taskdefs.optional.junit.JUnitTestRunner.run(JUnitTestRunner.java:518) [junit] at org.apache.tools.ant.taskdefs.optional.junit.JUnitTestRunner.launch(JUnitTestRunner.java:1052) [junit] at org.apache.tools.ant.taskdefs.optional.junit.JUnitTestRunner.main(JUnitTestRunner.java:906) [junit] junit.framework.AssertionFailedError: null [junit] at junit.framework.Assert.fail(Assert.java:47) [junit] at junit.framework.Assert.assertTrue(Assert.java:20) [junit] at junit.framework.Assert.assertTrue(Assert.java:27) [junit] at org.apache.hadoop.hive.ql.exec.TestStatsPublisherEnhanced.testStatsPublisher(TestStatsPublisherEnhanced.java:129) [junit] at sun.reflect.NativeMethodAccessorImpl.invoke0(Native Method) [junit] at sun.reflect.NativeMethodAccessorImpl.invoke(NativeMethodAccessorImpl.java:39) [junit] at sun.reflect.DelegatingMethodAccessorImpl.invoke(DelegatingMethodAccessorImpl.java:25) [junit] at java.lang.reflect.Method.invoke(Method.java:597) [junit] at junit.framework.TestCase.runTest(TestCase.java:168) [junit] at junit.framework.TestCase.runBare(TestCase.java:134) [junit] at junit.framework.TestResult$1.protect(TestResult.java:110) [junit] at junit.framework.TestResult.runProtected(TestResult.java:128) [junit] at junit.framework.TestResult.run(TestResult.java:113) [junit] at junit.framework.TestCase.run(TestCase.java:124) [junit] at junit.framework.TestSuite.runTest(TestSuite.java:232) [junit] at junit.framework.TestSuite.run(TestSuite.java:227) [junit] at org.apache.tools.ant.taskdefs.optional.junit.JUnitTestRunner.run(JUnitTestRunner.java:518) [junit] at org.apache.tools.ant.taskdefs.optional.junit.JUnitTestRunner.launch(JUnitTestRunner.java:1052) [junit] at org.apache.tools.ant.taskdefs.optional.junit.JUnitTestRunner.main(JUnitTestRunner.java:906) [junit] StatsPublisher - (multiple updates + publishing subset of supported statistics) [junit] StatsAggregator - clean-up [junit] junit.framework.AssertionFailedError: null [junit] at junit.framework.Assert.fail(Assert.java:47) [junit] at junit.framework.Assert.assertTrue(Assert.java:20) [junit] at junit.framework.Assert.assertTrue(Assert.java:27) [junit] at org.apache.hadoop.hive.ql.exec.TestStatsPublisherEnhanced.testStatsPublisherMultipleUpdates(TestStatsPublisherEnhanced.java:190) [junit] at sun.reflect.NativeMethodAccessorImpl.invoke0(Native Method) [junit] at sun.reflect.NativeMethodAccessorImpl.invoke(NativeMethodAccessorImpl.java:39) [junit] at sun.reflect.DelegatingMethodAccessorImpl.invoke(DelegatingMethodAccessorImpl.java:25) [junit] at java.lang.reflect.Method.invoke(Method.java:597) [junit] at junit.framework.TestCase.runTest(TestCase.java:168) [junit] at junit.framework.TestCase.runBare(TestCase.java:134) [junit] at junit.framework.TestResult$1.protect(TestResult.java:110) [junit] at junit.framework.TestResult.runProtected(TestResult.java:128) [junit] at junit.framework.TestResult.run(TestResult.java:113) [junit] at junit.framework.TestCase.run(TestCase.java:124) [junit] at junit.framework.TestSuite.runTest(TestSuite.java:232) [junit] at junit.framework.TestSuite.run(TestSuite.java:227) [junit] at org.apache.tools.ant.taskdefs.optional.junit.JUnitTestRunner.run(JUnitTestRunner.java:518) [junit] at org.apache.tools.ant.taskdefs.optional.junit.JUnitTestRunner.launch(JUnitTestRunner.java:1052) [junit] at org.apache.tools.ant.taskdefs.optional.junit.JUnitTestRunner.main(JUnitTestRunner.java:906) [junit] junit.framework.AssertionFailedError: null [junit] at junit.framework.Assert.fail(Assert.java:47) [junit] at junit.framework.Assert.assertTrue(Assert.java:20) [junit] at junit.framework.Assert.assertTrue(Assert.java:27) [junit] at org.apache.hadoop.hive.ql.exec.TestStatsPublisherEnhanced.testStatsPublisherMultipleUpdatesSubsetStatistics(TestStatsPublisherEnhanced.java:255) [junit] at sun.reflect.NativeMethodAccessorImpl.invoke0(Native Method) [junit] at sun.reflect.NativeMethodAccessorImpl.invoke(NativeMethodAccessorImpl.java:39) [junit] at sun.reflect.DelegatingMethodAccessorImpl.invoke(DelegatingMethodAccessorImpl.java:25) [junit] at java.lang.reflect.Method.invoke(Method.java:597) [junit] at junit.framework.TestCase.runTest(TestCase.java:168) [junit] at junit.framework.TestCase.runBare(TestCase.java:134) [junit] at junit.framework.TestResult$1.protect(TestResult.java:110) [junit] at junit.framework.TestResult.runProtected(TestResult.java:128) [junit] at junit.framework.TestResult.run(TestResult.java:113) [junit] at junit.framework.TestCase.run(TestCase.java:124) [junit] at junit.framework.TestSuite.runTest(TestSuite.java:232) [junit] at junit.framework.TestSuite.run(TestSuite.java:227) [junit] at org.apache.tools.ant.taskdefs.optional.junit.JUnitTestRunner.run(JUnitTestRunner.java:518) [junit] at org.apache.tools.ant.taskdefs.optional.junit.JUnitTestRunner.launch(JUnitTestRunner.java:1052) [junit] at org.apache.tools.ant.taskdefs.optional.junit.JUnitTestRunner.main(JUnitTestRunner.java:906) [junit] junit.framework.AssertionFailedError: null [junit] at junit.framework.Assert.fail(Assert.java:47) [junit] at junit.framework.Assert.assertTrue(Assert.java:20) [junit] at junit.framework.Assert.assertTrue(Assert.java:27) [junit] at org.apache.hadoop.hive.ql.exec.TestStatsPublisherEnhanced.testStatsAggregatorCleanUp(TestStatsPublisherEnhanced.java:326) [junit] at sun.reflect.NativeMethodAccessorImpl.invoke0(Native Method) [junit] at sun.reflect.NativeMethodAccessorImpl.invoke(NativeMethodAccessorImpl.java:39) [junit] at sun.reflect.DelegatingMethodAccessorImpl.invoke(DelegatingMethodAccessorImpl.java:25) [junit] at java.lang.reflect.Method.invoke(Method.java:597) [junit] at junit.framework.TestCase.runTest(TestCase.java:168) [junit] at junit.framework.TestCase.runBare(TestCase.java:134) [junit] at junit.framework.TestResult$1.protect(TestResult.java:110) [junit] at junit.framework.TestResult.runProtected(TestResult.java:128) [junit] at junit.framework.TestResult.run(TestResult.java:113) [junit] at junit.framework.TestCase.run(TestCase.java:124) [junit] at junit.framework.TestSuite.runTest(TestSuite.java:232) [junit] at junit.framework.TestSuite.run(TestSuite.java:227) [junit] at org.apache.tools.ant.taskdefs.optional.junit.JUnitTestRunner.run(JUnitTestRunner.java:518) [junit] at org.apache.tools.ant.taskdefs.optional.junit.JUnitTestRunner.launch(JUnitTestRunner.java:1052) [junit] at org.apache.tools.ant.taskdefs.optional.junit.JUnitTestRunner.main(JUnitTestRunner.java:906) [junit] Tests run: 5, Failures: 5, Errors: 0, Time elapsed: 0.756 sec [junit] Test org.apache.hadoop.hive.ql.exec.TestStatsPublisherEnhanced FAILED
        Kevin Wilfong made changes -
        Field Original Value New Value
        Assignee Kevin Wilfong [ kevinwilfong ]
        Show
        Kevin Wilfong added a comment - https://reviews.facebook.net/D7287
        Kevin Wilfong made changes -
        Attachment HIVE-3783.1.patch.txt [ 12560445 ]
        Kevin Wilfong made changes -
        Status Open [ 1 ] Patch Available [ 10002 ]
        Hide
        Kevin Wilfong added a comment -

        Found one reason for the test failing in some checkouts and not others. I've run the test in a directory where it was previously failing >5 times, and so far it's been passing consistently.

        Show
        Kevin Wilfong added a comment - Found one reason for the test failing in some checkouts and not others. I've run the test in a directory where it was previously failing >5 times, and so far it's been passing consistently.
        Hide
        Ashutosh Chauhan added a comment -

        TestStatsPublisherEnhanced failures on apache jenkins machine. https://builds.apache.org/job/Hive-trunk-h0.21/1849/testReport/

        Show
        Ashutosh Chauhan added a comment - TestStatsPublisherEnhanced failures on apache jenkins machine. https://builds.apache.org/job/Hive-trunk-h0.21/1849/testReport/
        Hide
        Kevin Wilfong added a comment -

        The failures in TestStatsPublisherEnhanced are coming from the init method of the stats Publisher.

        Show
        Kevin Wilfong added a comment - The failures in TestStatsPublisherEnhanced are coming from the init method of the stats Publisher.
        Hide
        Kevin Wilfong added a comment -

        I suspect the two are unrelated.

        Show
        Kevin Wilfong added a comment - I suspect the two are unrelated.
        Hide
        Namit Jain added a comment -

        +1

        Show
        Namit Jain added a comment - +1
        Hide
        Namit Jain added a comment -

        Committed. Thanks Kevin

        Show
        Namit Jain added a comment - Committed. Thanks Kevin
        Namit Jain made changes -
        Resolution Fixed [ 1 ]
        Status Patch Available [ 10002 ] Resolved [ 5 ]
        Hadoop Flags Reviewed [ 10343 ]
        Hide
        Hudson added a comment -

        Integrated in Hive-trunk-h0.21 #1853 (See https://builds.apache.org/job/Hive-trunk-h0.21/1853/)
        HIVE-3783 stats19.q is failing on trunk
        (Kevin Wilfong via namit) (Revision 1421161)

        Result = SUCCESS
        namit : http://svn.apache.org/viewcvs.cgi/?root=Apache-SVN&view=rev&rev=1421161
        Files :

        • /hive/trunk/ql/src/test/org/apache/hadoop/hive/ql/stats/KeyVerifyingStatsAggregator.java
        Show
        Hudson added a comment - Integrated in Hive-trunk-h0.21 #1853 (See https://builds.apache.org/job/Hive-trunk-h0.21/1853/ ) HIVE-3783 stats19.q is failing on trunk (Kevin Wilfong via namit) (Revision 1421161) Result = SUCCESS namit : http://svn.apache.org/viewcvs.cgi/?root=Apache-SVN&view=rev&rev=1421161 Files : /hive/trunk/ql/src/test/org/apache/hadoop/hive/ql/stats/KeyVerifyingStatsAggregator.java
        Ashutosh Chauhan made changes -
        Fix Version/s 0.10.0 [ 12320745 ]
        Ashutosh Chauhan made changes -
        Fix Version/s 0.11 [ 12323587 ]
        Fix Version/s 0.10.0 [ 12320745 ]
        Hide
        Hudson added a comment -

        Integrated in Hive-trunk-hadoop2 #54 (See https://builds.apache.org/job/Hive-trunk-hadoop2/54/)
        HIVE-3783 stats19.q is failing on trunk
        (Kevin Wilfong via namit) (Revision 1421161)

        Result = ABORTED
        namit : http://svn.apache.org/viewcvs.cgi/?root=Apache-SVN&view=rev&rev=1421161
        Files :

        • /hive/trunk/ql/src/test/org/apache/hadoop/hive/ql/stats/KeyVerifyingStatsAggregator.java
        Show
        Hudson added a comment - Integrated in Hive-trunk-hadoop2 #54 (See https://builds.apache.org/job/Hive-trunk-hadoop2/54/ ) HIVE-3783 stats19.q is failing on trunk (Kevin Wilfong via namit) (Revision 1421161) Result = ABORTED namit : http://svn.apache.org/viewcvs.cgi/?root=Apache-SVN&view=rev&rev=1421161 Files : /hive/trunk/ql/src/test/org/apache/hadoop/hive/ql/stats/KeyVerifyingStatsAggregator.java
        Owen O'Malley made changes -
        Status Resolved [ 5 ] Closed [ 6 ]
        Transition Time In Source Status Execution Times Last Executer Last Execution Date
        Open Open Patch Available Patch Available
        3d 1h 52m 1 Kevin Wilfong 11/Dec/12 20:29
        Patch Available Patch Available Resolved Resolved
        1d 12h 52m 1 Namit Jain 13/Dec/12 09:21
        Resolved Resolved Closed Closed
        154d 11h 49m 1 Owen O'Malley 16/May/13 22:10

          People

          • Assignee:
            Kevin Wilfong
            Reporter:
            Ashutosh Chauhan
          • Votes:
            0 Vote for this issue
            Watchers:
            4 Start watching this issue

            Dates

            • Created:
              Updated:
              Resolved:

              Development