Details

    • Type: Bug Bug
    • Status: Closed
    • Priority: Blocker Blocker
    • Resolution: Fixed
    • Affects Version/s: 0.6.0
    • Fix Version/s: 0.3.0
    • Component/s: Build Infrastructure
    • Labels:
      None
    • Hadoop Flags:
      Reviewed

      Description

      It has been broken for quite sometime but the build is not failing.

      1. hive-342.patch
        0.9 kB
        Prasad Chakka

        Issue Links

          Activity

          Transition Time In Source Status Execution Times Last Executer Last Execution Date
          Open Open Patch Available Patch Available
          1d 23h 53m 1 Prasad Chakka 13/Mar/09 17:31
          Patch Available Patch Available Resolved Resolved
          12d 3h 43m 1 Namit Jain 25/Mar/09 21:14
          Resolved Resolved Closed Closed
          996d 2h 54m 1 Carl Steinbach 17/Dec/11 00:09
          Carl Steinbach made changes -
          Status Resolved [ 5 ] Closed [ 6 ]
          Zheng Shao made changes -
          Affects Version/s 0.6.0 [ 12314524 ]
          Affects Version/s 0.2.0 [ 12313565 ]
          Namit Jain made changes -
          Status Patch Available [ 10002 ] Resolved [ 5 ]
          Hadoop Flags [Reviewed]
          Fix Version/s 0.3.0 [ 12313637 ]
          Fix Version/s 0.2.0 [ 12313565 ]
          Resolution Fixed [ 1 ]
          Hide
          Namit Jain added a comment -

          committed. Thanks Prasad

          Show
          Namit Jain added a comment - committed. Thanks Prasad
          Hide
          Prasad Chakka added a comment -

          once 349 is committed, the latest patch for this will work without any test failures.

          Show
          Prasad Chakka added a comment - once 349 is committed, the latest patch for this will work without any test failures.
          Prasad Chakka made changes -
          Link This issue is blocked by HIVE-349 [ HIVE-349 ]
          Hide
          Ashish Thusoo added a comment -

          Getting follow errors in test...

          [junit] Hive history file=/data/users/athusoo/commits/hive_trunk_ws7/ql/../build/ql/tmp/hive_job_log_athusoo_200903131519_1514028075.txt
          [junit] Exception: 0
          [junit] java.lang.ArrayIndexOutOfBoundsException: 0
          [junit] at org.apache.hadoop.hive.cli.TestCliDriver.testCliDriver_input_dfs(TestCliDriver.java:67)
          [junit] at sun.reflect.NativeMethodAccessorImpl.invoke0(Native Method)
          [junit] at sun.reflect.NativeMethodAccessorImpl.invoke(NativeMethodAccessorImpl.java:39)
          [junit] at sun.reflect.DelegatingMethodAccessorImpl.invoke(DelegatingMethodAccessorImpl.java:25)
          [junit] at java.lang.reflect.Method.invoke(Method.java:597)
          [junit] at junit.framework.TestCase.runTest(TestCase.java:154)
          [junit] at junit.framework.TestCase.runBare(TestCase.java:127)
          [junit] at junit.framework.TestResult$1.protect(TestResult.java:106)
          [junit] at junit.framework.TestResult.runProtected(TestResult.java:124)
          [junit] at junit.framework.TestResult.run(TestResult.java:109)
          [junit] at junit.framework.TestCase.run(TestCase.java:118)
          [junit] at junit.framework.TestSuite.runTest(TestSuite.java:208)
          [junit] at junit.framework.TestSuite.run(TestSuite.java:203)
          [junit] at org.apache.tools.ant.taskdefs.optional.junit.JUnitTestRunner.run(JUnitTestRunner.java:297)
          [junit] at org.apache.tools.ant.taskdefs.optional.junit.JUnitTestRunner.launch(JUnitTestRunner.java:672)
          [junit] at org.apache.tools.ant.taskdefs.optional.junit.JUnitTestRunner.main(JUnitTestRunner.java:567)
          [junit] Tests run: 1, Failures: 1, Errors: 0, Time elapsed: 8.928 sec
          [junit] Test org.apache.hadoop.hive.cli.TestCliDriver FAILED

          Show
          Ashish Thusoo added a comment - Getting follow errors in test... [junit] Hive history file=/data/users/athusoo/commits/hive_trunk_ws7/ql/../build/ql/tmp/hive_job_log_athusoo_200903131519_1514028075.txt [junit] Exception: 0 [junit] java.lang.ArrayIndexOutOfBoundsException: 0 [junit] at org.apache.hadoop.hive.cli.TestCliDriver.testCliDriver_input_dfs(TestCliDriver.java:67) [junit] at sun.reflect.NativeMethodAccessorImpl.invoke0(Native Method) [junit] at sun.reflect.NativeMethodAccessorImpl.invoke(NativeMethodAccessorImpl.java:39) [junit] at sun.reflect.DelegatingMethodAccessorImpl.invoke(DelegatingMethodAccessorImpl.java:25) [junit] at java.lang.reflect.Method.invoke(Method.java:597) [junit] at junit.framework.TestCase.runTest(TestCase.java:154) [junit] at junit.framework.TestCase.runBare(TestCase.java:127) [junit] at junit.framework.TestResult$1.protect(TestResult.java:106) [junit] at junit.framework.TestResult.runProtected(TestResult.java:124) [junit] at junit.framework.TestResult.run(TestResult.java:109) [junit] at junit.framework.TestCase.run(TestCase.java:118) [junit] at junit.framework.TestSuite.runTest(TestSuite.java:208) [junit] at junit.framework.TestSuite.run(TestSuite.java:203) [junit] at org.apache.tools.ant.taskdefs.optional.junit.JUnitTestRunner.run(JUnitTestRunner.java:297) [junit] at org.apache.tools.ant.taskdefs.optional.junit.JUnitTestRunner.launch(JUnitTestRunner.java:672) [junit] at org.apache.tools.ant.taskdefs.optional.junit.JUnitTestRunner.main(JUnitTestRunner.java:567) [junit] Tests run: 1, Failures: 1, Errors: 0, Time elapsed: 8.928 sec [junit] Test org.apache.hadoop.hive.cli.TestCliDriver FAILED
          Hide
          Ashish Thusoo added a comment -

          Sorry, did not realize that you can commit this yourself now

          Anyway

          +1 to the code.

          Show
          Ashish Thusoo added a comment - Sorry, did not realize that you can commit this yourself now Anyway +1 to the code.
          Hide
          Ashish Thusoo added a comment -

          Running tests on this and will commit once they succeed.

          Show
          Ashish Thusoo added a comment - Running tests on this and will commit once they succeed.
          Prasad Chakka made changes -
          Status Open [ 1 ] Patch Available [ 10002 ]
          Affects Version/s 0.2.0 [ 12313565 ]
          Fix Version/s 0.2.0 [ 12313565 ]
          Prasad Chakka made changes -
          Attachment hive-342.patch [ 12402154 ]
          Hide
          Prasad Chakka added a comment -

          Session is being initialized in wrong thread thus SessionState.get() in the test thread gets spawned.

          Show
          Prasad Chakka added a comment - Session is being initialized in wrong thread thus SessionState.get() in the test thread gets spawned.
          Ashish Thusoo made changes -
          Assignee Prasad Chakka [ prasadc ]
          Hide
          Ashish Thusoo added a comment -

          Assigning to Prasad.

          Show
          Ashish Thusoo added a comment - Assigning to Prasad.
          Show
          Prasad Chakka added a comment - http://hudson.zones.apache.org/hudson/job/Hive-trunk-h0.19/lastBuild/testReport/org.apache.hadoop.hive.ql/TestMTQueries/testMTQueries1/
          Prasad Chakka made changes -
          Field Original Value New Value
          Priority Major [ 3 ] Blocker [ 1 ]
          Hide
          Prasad Chakka added a comment -

          need to fix this otherwise bugs might be introduced

          Show
          Prasad Chakka added a comment - need to fix this otherwise bugs might be introduced
          Prasad Chakka created issue -

            People

            • Assignee:
              Prasad Chakka
              Reporter:
              Prasad Chakka
            • Votes:
              0 Vote for this issue
              Watchers:
              0 Start watching this issue

              Dates

              • Created:
                Updated:
                Resolved:

                Development