Uploaded image for project: 'Hive'
  1. Hive
  2. HIVE-28153

Flaky test TestConflictingDataFiles.testMultiFiltersUpdate

    XMLWordPrintableJSON

Details

    • Test
    • Status: Resolved
    • Major
    • Resolution: Fixed
    • None
    • 4.1.0
    • Test

    Description

      This test has been failing a lot lately, such as http://ci.hive.apache.org/blue/organizations/jenkins/hive-precommit/detail/PR-5063/13/tests/

       

      And the flaky test shows this test is unstable:

      http://ci.hive.apache.org/job/hive-flaky-check/831/testReport/

      10:29:21  [INFO]  T E S T S
      10:29:21  [INFO] -------------------------------------------------------
      10:29:21  [INFO] Running org.apache.iceberg.mr.hive.TestConflictingDataFiles
      10:36:13  [ERROR] Tests run: 60, Failures: 1, Errors: 0, Skipped: 24, Time elapsed: 399.12 s <<< FAILURE! - in org.apache.iceberg.mr.hive.TestConflictingDataFiles
      10:36:13  [ERROR] org.apache.iceberg.mr.hive.TestConflictingDataFiles.testMultiFiltersUpdate[fileFormat=PARQUET, engine=tez, catalog=HIVE_CATALOG, isVectorized=false, formatVersion=1]  Time elapsed: 11.781 s  <<< FAILURE!
      10:36:13  java.lang.AssertionError: expected:<12> but was:<13>
      10:36:13  	at org.junit.Assert.fail(Assert.java:89)
      10:36:13  	at org.junit.Assert.failNotEquals(Assert.java:835)
      10:36:13  	at org.junit.Assert.assertEquals(Assert.java:647)
      10:36:13  	at org.junit.Assert.assertEquals(Assert.java:633)
      10:36:13  	at org.apache.iceberg.mr.hive.TestConflictingDataFiles.testMultiFiltersUpdate(TestConflictingDataFiles.java:135)
      10:36:13  	at sun.reflect.NativeMethodAccessorImpl.invoke0(Native Method)
      10:36:13  	at sun.reflect.NativeMethodAccessorImpl.invoke(NativeMethodAccessorImpl.java:62)
      10:36:13  	at sun.reflect.DelegatingMethodAccessorImpl.invoke(DelegatingMethodAccessorImpl.java:43)
      10:36:13  	at java.lang.reflect.Method.invoke(Method.java:498)
      10:36:13  	at org.junit.runners.model.FrameworkMethod$1.runReflectiveCall(FrameworkMethod.java:59)
      10:36:13  	at org.junit.internal.runners.model.ReflectiveCallable.run(ReflectiveCallable.java:12)
      10:36:13  	at org.junit.runners.model.FrameworkMethod.invokeExplosively(FrameworkMethod.java:56)
      10:36:13  	at org.junit.internal.runners.statements.InvokeMethod.evaluate(InvokeMethod.java:17)
      10:36:13  	at org.junit.internal.runners.statements.RunBefores.evaluate(RunBefores.java:26)
      10:36:13  	at org.junit.internal.runners.statements.RunAfters.evaluate(RunAfters.java:27)
      10:36:13  	at org.junit.rules.ExternalResource$1.evaluate(ExternalResource.java:54)
      10:36:13  	at org.junit.internal.runners.statements.FailOnTimeout$CallableStatement.call(FailOnTimeout.java:299)
      10:36:13  	at org.junit.internal.runners.statements.FailOnTimeout$CallableStatement.call(FailOnTimeout.java:293)
      10:36:13  	at java.util.concurrent.FutureTask.run(FutureTask.java:266)
      10:36:13  	at java.lang.Thread.run(Thread.java:748) 

      Attachments

        Issue Links

          Activity

            People

              simhadri-g Simhadri Govindappa
              zhangbutao Butao Zhang
              Votes:
              0 Vote for this issue
              Watchers:
              2 Start watching this issue

              Dates

                Created:
                Updated:
                Resolved: