Uploaded image for project: 'Hive'
  1. Hive
  2. HIVE-17928

branch-2.3 does not compile due to using incorrect storage-api version

Log workAgile BoardRank to TopRank to BottomVotersWatch issueWatchersCreate sub-taskConvert to sub-taskMoveLinkCloneLabelsUpdate Comment AuthorReplace String in CommentUpdate Comment VisibilityDelete Comments
    XMLWordPrintableJSON

    Details

    • Type: Bug
    • Status: Resolved
    • Priority: Major
    • Resolution: Fixed
    • Affects Version/s: 2.3.2
    • Fix Version/s: 2.3.2
    • Component/s: Hive
    • Labels:
      None

      Description

      This is the error when building branch-2.3

      [INFO] Reactor Summary:
      [INFO]
      [INFO] Hive ............................................... SUCCESS [  1.401 s]
      [INFO] Hive Shims Common .................................. SUCCESS [  3.091 s]
      [INFO] Hive Shims 0.23 .................................... SUCCESS [  2.299 s]
      [INFO] Hive Shims Scheduler ............................... SUCCESS [  1.026 s]
      [INFO] Hive Shims ......................................... SUCCESS [  0.560 s]
      [INFO] Hive Common ........................................ FAILURE [  0.090 s]
      [INFO] Hive Service RPC ................................... SKIPPED
      [INFO] Hive Serde ......................................... SKIPPED
      [INFO] Hive Metastore ..................................... SKIPPED
      [INFO] Hive Vector-Code-Gen Utilities ..................... SKIPPED
      [INFO] Hive Llap Common ................................... SKIPPED
      [INFO] Hive Llap Client ................................... SKIPPED
      [INFO] Hive Llap Tez ...................................... SKIPPED
      [INFO] Spark Remote Client ................................ SKIPPED
      [INFO] Hive Query Language ................................ SKIPPED
      [INFO] Hive Llap Server ................................... SKIPPED
      [INFO] Hive Service ....................................... SKIPPED
      [INFO] Hive Accumulo Handler .............................. SKIPPED
      [INFO] Hive JDBC .......................................... SKIPPED
      [INFO] Hive Beeline ....................................... SKIPPED
      [INFO] Hive CLI ........................................... SKIPPED
      [INFO] Hive Contrib ....................................... SKIPPED
      [INFO] Hive Druid Handler ................................. SKIPPED
      [INFO] Hive HBase Handler ................................. SKIPPED
      [INFO] Hive JDBC Handler .................................. SKIPPED
      [INFO] Hive HCatalog ...................................... SKIPPED
      [INFO] Hive HCatalog Core ................................. SKIPPED
      [INFO] Hive HCatalog Pig Adapter .......................... SKIPPED
      [INFO] Hive HCatalog Server Extensions .................... SKIPPED
      [INFO] Hive HCatalog Webhcat Java Client .................. SKIPPED
      [INFO] Hive HCatalog Webhcat .............................. SKIPPED
      [INFO] Hive HCatalog Streaming ............................ SKIPPED
      [INFO] Hive HPL/SQL ....................................... SKIPPED
      [INFO] Hive Llap External Client .......................... SKIPPED
      [INFO] Hive Shims Aggregator .............................. SKIPPED
      [INFO] Hive TestUtils ..................................... SKIPPED
      [INFO] Hive Packaging ..................................... SKIPPED
      [INFO] ------------------------------------------------------------------------
      [INFO] BUILD FAILURE
      [INFO] ------------------------------------------------------------------------
      [INFO] Total time: 8.991 s
      [INFO] Finished at: 2017-10-28T12:33:51-05:00
      [INFO] Final Memory: 67M/975M
      [INFO] ------------------------------------------------------------------------
      [ERROR] Failed to execute goal on project hive-common: Could not resolve dependencies for project org.apache.hive:hive-common:jar:2.3.2-SNAPSHOT: Could not find artifact org.apache.hive:hive-storage-api:jar:2.3.2-SNAPSHOT -> [Help 1]
      

        Attachments

        1. HIVE-17928.1-branch2.3.patch
          0.4 kB
          Sergio Peña
        2. HIVE-17928.1-branch-2.3.patch
          0.4 kB
          Sergio Peña

          Activity

          $i18n.getText('security.level.explanation', $currentSelection) Viewable by All Users
          Cancel

            People

            • Assignee:
              spena Sergio Peña Assign to me
              Reporter:
              spena Sergio Peña

              Dates

              • Created:
                Updated:
                Resolved:

                Issue deployment