Uploaded image for project: 'Hive'
  1. Hive
  2. HIVE-17529

Bucket Map Join : Sets incorrect edge type causing execution failure

    Details

    • Type: Bug
    • Status: Resolved
    • Priority: Major
    • Resolution: Fixed
    • Affects Version/s: None
    • Fix Version/s: 3.0.0
    • Component/s: None
    • Labels:
      None

      Description

      If while traversing the tree to generate tasks, a bucket mapjoin may set its edge as CUSTOM_SIMPLE_EDGE against CUSTOM_EDGE if the bigtable is already not traversed causing Tez to assert and fail the vertex.

      1. HIVE-17529.1.patch
        338 kB
        Deepak Jaiswal
      2. HIVE-17529.2.patch
        620 kB
        Deepak Jaiswal
      3. HIVE-17529.3.patch
        620 kB
        Deepak Jaiswal
      4. HIVE-17529.4.patch
        620 kB
        Deepak Jaiswal
      5. HIVE-17529.5.patch
        627 kB
        Deepak Jaiswal

        Issue Links

          Activity

          Hide
          djaiswal Deepak Jaiswal added a comment -

          Jason Dere Gunther Hagleitner Gopal V Can you please review?

          Fixed the issue and updated the tests to actually test bucket mapjoin.

          Show
          djaiswal Deepak Jaiswal added a comment - Jason Dere Gunther Hagleitner Gopal V Can you please review? Fixed the issue and updated the tests to actually test bucket mapjoin.
          Hide
          djaiswal Deepak Jaiswal added a comment -

          Uploaded wrong patch

          Show
          djaiswal Deepak Jaiswal added a comment - Uploaded wrong patch
          Hide
          djaiswal Deepak Jaiswal added a comment -

          Somehow last patch did not trigger a test run. Reuploading the patch again.

          Show
          djaiswal Deepak Jaiswal added a comment - Somehow last patch did not trigger a test run. Reuploading the patch again.
          Hide
          hiveqa Hive QA added a comment -

          Here are the results of testing the latest attachment:
          https://issues.apache.org/jira/secure/attachment/12887141/HIVE-17529.1.patch

          SUCCESS: +1 due to 2 test(s) being added or modified.

          ERROR: -1 due to 12 failed/errored test(s), 11040 tests executed
          Failed tests:

          TestAccumuloCliDriver - did not produce a TEST-*.xml file (likely timed out) (batchId=230)
          TestDummy - did not produce a TEST-*.xml file (likely timed out) (batchId=230)
          org.apache.hadoop.hive.cli.TestCliDriver.testCliDriver[create_view] (batchId=39)
          org.apache.hadoop.hive.cli.TestCliDriver.testCliDriver[insert_values_orig_table_use_metadata] (batchId=61)
          org.apache.hadoop.hive.cli.TestMiniLlapLocalCliDriver.testCliDriver[union_fast_stats] (batchId=156)
          org.apache.hadoop.hive.cli.TestNegativeCliDriver.testCliDriver[drop_table_failure2] (batchId=89)
          org.apache.hadoop.hive.cli.TestPerfCliDriver.testCliDriver[query14] (batchId=234)
          org.apache.hadoop.hive.cli.TestSparkCliDriver.testCliDriver[bucket_map_join_tez1] (batchId=137)
          org.apache.hadoop.hive.cli.TestSparkCliDriver.testCliDriver[bucket_map_join_tez2] (batchId=106)
          org.apache.hadoop.hive.ql.TestAcidOnTez.testCtasTezUnion (batchId=215)
          org.apache.hadoop.hive.ql.TestAcidOnTez.testNonStandardConversion01 (batchId=215)
          org.apache.hive.jdbc.TestJdbcWithMiniHS2.testEnableThriftSerializeInTasks (batchId=227)
          

          Test results: https://builds.apache.org/job/PreCommit-HIVE-Build/6818/testReport
          Console output: https://builds.apache.org/job/PreCommit-HIVE-Build/6818/console
          Test logs: http://104.198.109.242/logs/PreCommit-HIVE-Build-6818/

          Messages:

          Executing org.apache.hive.ptest.execution.TestCheckPhase
          Executing org.apache.hive.ptest.execution.PrepPhase
          Executing org.apache.hive.ptest.execution.ExecutionPhase
          Executing org.apache.hive.ptest.execution.ReportingPhase
          Tests exited with: TestsFailedException: 12 tests failed
          

          This message is automatically generated.

          ATTACHMENT ID: 12887141 - PreCommit-HIVE-Build

          Show
          hiveqa Hive QA added a comment - Here are the results of testing the latest attachment: https://issues.apache.org/jira/secure/attachment/12887141/HIVE-17529.1.patch SUCCESS: +1 due to 2 test(s) being added or modified. ERROR: -1 due to 12 failed/errored test(s), 11040 tests executed Failed tests: TestAccumuloCliDriver - did not produce a TEST-*.xml file (likely timed out) (batchId=230) TestDummy - did not produce a TEST-*.xml file (likely timed out) (batchId=230) org.apache.hadoop.hive.cli.TestCliDriver.testCliDriver[create_view] (batchId=39) org.apache.hadoop.hive.cli.TestCliDriver.testCliDriver[insert_values_orig_table_use_metadata] (batchId=61) org.apache.hadoop.hive.cli.TestMiniLlapLocalCliDriver.testCliDriver[union_fast_stats] (batchId=156) org.apache.hadoop.hive.cli.TestNegativeCliDriver.testCliDriver[drop_table_failure2] (batchId=89) org.apache.hadoop.hive.cli.TestPerfCliDriver.testCliDriver[query14] (batchId=234) org.apache.hadoop.hive.cli.TestSparkCliDriver.testCliDriver[bucket_map_join_tez1] (batchId=137) org.apache.hadoop.hive.cli.TestSparkCliDriver.testCliDriver[bucket_map_join_tez2] (batchId=106) org.apache.hadoop.hive.ql.TestAcidOnTez.testCtasTezUnion (batchId=215) org.apache.hadoop.hive.ql.TestAcidOnTez.testNonStandardConversion01 (batchId=215) org.apache.hive.jdbc.TestJdbcWithMiniHS2.testEnableThriftSerializeInTasks (batchId=227) Test results: https://builds.apache.org/job/PreCommit-HIVE-Build/6818/testReport Console output: https://builds.apache.org/job/PreCommit-HIVE-Build/6818/console Test logs: http://104.198.109.242/logs/PreCommit-HIVE-Build-6818/ Messages: Executing org.apache.hive.ptest.execution.TestCheckPhase Executing org.apache.hive.ptest.execution.PrepPhase Executing org.apache.hive.ptest.execution.ExecutionPhase Executing org.apache.hive.ptest.execution.ReportingPhase Tests exited with: TestsFailedException: 12 tests failed This message is automatically generated. ATTACHMENT ID: 12887141 - PreCommit-HIVE-Build
          Hide
          djaiswal Deepak Jaiswal added a comment -

          Did not update results for spark driver.

          Show
          djaiswal Deepak Jaiswal added a comment - Did not update results for spark driver.
          Hide
          hiveqa Hive QA added a comment -

          Here are the results of testing the latest attachment:
          https://issues.apache.org/jira/secure/attachment/12887283/HIVE-17529.2.patch

          SUCCESS: +1 due to 2 test(s) being added or modified.

          ERROR: -1 due to 14 failed/errored test(s), 11040 tests executed
          Failed tests:

          TestAccumuloCliDriver - did not produce a TEST-*.xml file (likely timed out) (batchId=230)
          TestDummy - did not produce a TEST-*.xml file (likely timed out) (batchId=230)
          org.apache.hadoop.hive.cli.TestCliDriver.testCliDriver[create_view] (batchId=39)
          org.apache.hadoop.hive.cli.TestCliDriver.testCliDriver[insert_values_orig_table_use_metadata] (batchId=61)
          org.apache.hadoop.hive.cli.TestCliDriver.testCliDriver[udf_mask_hash] (batchId=28)
          org.apache.hadoop.hive.cli.TestHBaseCliDriver.testCliDriver[hbase_handler_snapshot] (batchId=96)
          org.apache.hadoop.hive.cli.TestMiniLlapLocalCliDriver.testCliDriver[union_fast_stats] (batchId=156)
          org.apache.hadoop.hive.cli.TestNegativeCliDriver.testCliDriver[drop_table_failure2] (batchId=89)
          org.apache.hadoop.hive.cli.TestPerfCliDriver.testCliDriver[query14] (batchId=234)
          org.apache.hadoop.hive.cli.TestPerfCliDriver.testCliDriver[query23] (batchId=234)
          org.apache.hadoop.hive.cli.TestSparkCliDriver.testCliDriver[bucket_map_join_tez1] (batchId=137)
          org.apache.hadoop.hive.ql.TestAcidOnTez.testCtasTezUnion (batchId=215)
          org.apache.hadoop.hive.ql.TestAcidOnTez.testNonStandardConversion01 (batchId=215)
          org.apache.hive.hcatalog.pig.TestTextFileHCatStorer.testWriteVarchar (batchId=183)
          

          Test results: https://builds.apache.org/job/PreCommit-HIVE-Build/6836/testReport
          Console output: https://builds.apache.org/job/PreCommit-HIVE-Build/6836/console
          Test logs: http://104.198.109.242/logs/PreCommit-HIVE-Build-6836/

          Messages:

          Executing org.apache.hive.ptest.execution.TestCheckPhase
          Executing org.apache.hive.ptest.execution.PrepPhase
          Executing org.apache.hive.ptest.execution.ExecutionPhase
          Executing org.apache.hive.ptest.execution.ReportingPhase
          Tests exited with: TestsFailedException: 14 tests failed
          

          This message is automatically generated.

          ATTACHMENT ID: 12887283 - PreCommit-HIVE-Build

          Show
          hiveqa Hive QA added a comment - Here are the results of testing the latest attachment: https://issues.apache.org/jira/secure/attachment/12887283/HIVE-17529.2.patch SUCCESS: +1 due to 2 test(s) being added or modified. ERROR: -1 due to 14 failed/errored test(s), 11040 tests executed Failed tests: TestAccumuloCliDriver - did not produce a TEST-*.xml file (likely timed out) (batchId=230) TestDummy - did not produce a TEST-*.xml file (likely timed out) (batchId=230) org.apache.hadoop.hive.cli.TestCliDriver.testCliDriver[create_view] (batchId=39) org.apache.hadoop.hive.cli.TestCliDriver.testCliDriver[insert_values_orig_table_use_metadata] (batchId=61) org.apache.hadoop.hive.cli.TestCliDriver.testCliDriver[udf_mask_hash] (batchId=28) org.apache.hadoop.hive.cli.TestHBaseCliDriver.testCliDriver[hbase_handler_snapshot] (batchId=96) org.apache.hadoop.hive.cli.TestMiniLlapLocalCliDriver.testCliDriver[union_fast_stats] (batchId=156) org.apache.hadoop.hive.cli.TestNegativeCliDriver.testCliDriver[drop_table_failure2] (batchId=89) org.apache.hadoop.hive.cli.TestPerfCliDriver.testCliDriver[query14] (batchId=234) org.apache.hadoop.hive.cli.TestPerfCliDriver.testCliDriver[query23] (batchId=234) org.apache.hadoop.hive.cli.TestSparkCliDriver.testCliDriver[bucket_map_join_tez1] (batchId=137) org.apache.hadoop.hive.ql.TestAcidOnTez.testCtasTezUnion (batchId=215) org.apache.hadoop.hive.ql.TestAcidOnTez.testNonStandardConversion01 (batchId=215) org.apache.hive.hcatalog.pig.TestTextFileHCatStorer.testWriteVarchar (batchId=183) Test results: https://builds.apache.org/job/PreCommit-HIVE-Build/6836/testReport Console output: https://builds.apache.org/job/PreCommit-HIVE-Build/6836/console Test logs: http://104.198.109.242/logs/PreCommit-HIVE-Build-6836/ Messages: Executing org.apache.hive.ptest.execution.TestCheckPhase Executing org.apache.hive.ptest.execution.PrepPhase Executing org.apache.hive.ptest.execution.ExecutionPhase Executing org.apache.hive.ptest.execution.ReportingPhase Tests exited with: TestsFailedException: 14 tests failed This message is automatically generated. ATTACHMENT ID: 12887283 - PreCommit-HIVE-Build
          Hide
          jdere Jason Dere added a comment -

          I think the code changes look alright, but the latest test result has a failure in TestSparkCliDriver.testCliDriver[bucket_map_join_tez1] .. can you take a look at that?

          Show
          jdere Jason Dere added a comment - I think the code changes look alright, but the latest test result has a failure in TestSparkCliDriver.testCliDriver [bucket_map_join_tez1] .. can you take a look at that?
          Hide
          djaiswal Deepak Jaiswal added a comment -

          I ran the test several times locally and it passed all the time for me.

          Show
          djaiswal Deepak Jaiswal added a comment - I ran the test several times locally and it passed all the time for me.
          Hide
          jdere Jason Dere added a comment -

          Can you try re-posting the patch so we can see another pre-commit run?

          Show
          jdere Jason Dere added a comment - Can you try re-posting the patch so we can see another pre-commit run?
          Hide
          djaiswal Deepak Jaiswal added a comment -

          Re-applying the same patch to see if bucket_map_join_tez1 fails with SparkCliDriver

          Show
          djaiswal Deepak Jaiswal added a comment - Re-applying the same patch to see if bucket_map_join_tez1 fails with SparkCliDriver
          Hide
          hiveqa Hive QA added a comment -

          Here are the results of testing the latest attachment:
          https://issues.apache.org/jira/secure/attachment/12887746/HIVE-17529.3.patch

          SUCCESS: +1 due to 2 test(s) being added or modified.

          ERROR: -1 due to 12 failed/errored test(s), 11042 tests executed
          Failed tests:

          TestAccumuloCliDriver - did not produce a TEST-*.xml file (likely timed out) (batchId=230)
          TestDummy - did not produce a TEST-*.xml file (likely timed out) (batchId=230)
          org.apache.hadoop.hive.cli.TestCliDriver.testCliDriver[create_view] (batchId=39)
          org.apache.hadoop.hive.cli.TestCliDriver.testCliDriver[udf_mask_hash] (batchId=28)
          org.apache.hadoop.hive.cli.TestMiniLlapLocalCliDriver.testCliDriver[union_fast_stats] (batchId=156)
          org.apache.hadoop.hive.cli.TestMiniSparkOnYarnCliDriver.testCliDriver[spark_explainuser_1] (batchId=170)
          org.apache.hadoop.hive.cli.TestNegativeCliDriver.testCliDriver[drop_table_failure2] (batchId=89)
          org.apache.hadoop.hive.cli.TestPerfCliDriver.testCliDriver[query14] (batchId=234)
          org.apache.hadoop.hive.cli.TestSparkCliDriver.testCliDriver[bucket_map_join_tez1] (batchId=137)
          org.apache.hadoop.hive.ql.TestAcidOnTez.testCtasTezUnion (batchId=215)
          org.apache.hadoop.hive.ql.TestAcidOnTez.testNonStandardConversion01 (batchId=215)
          org.apache.hive.hcatalog.pig.TestTextFileHCatStorer.testWriteChar (batchId=183)
          

          Test results: https://builds.apache.org/job/PreCommit-HIVE-Build/6875/testReport
          Console output: https://builds.apache.org/job/PreCommit-HIVE-Build/6875/console
          Test logs: http://104.198.109.242/logs/PreCommit-HIVE-Build-6875/

          Messages:

          Executing org.apache.hive.ptest.execution.TestCheckPhase
          Executing org.apache.hive.ptest.execution.PrepPhase
          Executing org.apache.hive.ptest.execution.ExecutionPhase
          Executing org.apache.hive.ptest.execution.ReportingPhase
          Tests exited with: TestsFailedException: 12 tests failed
          

          This message is automatically generated.

          ATTACHMENT ID: 12887746 - PreCommit-HIVE-Build

          Show
          hiveqa Hive QA added a comment - Here are the results of testing the latest attachment: https://issues.apache.org/jira/secure/attachment/12887746/HIVE-17529.3.patch SUCCESS: +1 due to 2 test(s) being added or modified. ERROR: -1 due to 12 failed/errored test(s), 11042 tests executed Failed tests: TestAccumuloCliDriver - did not produce a TEST-*.xml file (likely timed out) (batchId=230) TestDummy - did not produce a TEST-*.xml file (likely timed out) (batchId=230) org.apache.hadoop.hive.cli.TestCliDriver.testCliDriver[create_view] (batchId=39) org.apache.hadoop.hive.cli.TestCliDriver.testCliDriver[udf_mask_hash] (batchId=28) org.apache.hadoop.hive.cli.TestMiniLlapLocalCliDriver.testCliDriver[union_fast_stats] (batchId=156) org.apache.hadoop.hive.cli.TestMiniSparkOnYarnCliDriver.testCliDriver[spark_explainuser_1] (batchId=170) org.apache.hadoop.hive.cli.TestNegativeCliDriver.testCliDriver[drop_table_failure2] (batchId=89) org.apache.hadoop.hive.cli.TestPerfCliDriver.testCliDriver[query14] (batchId=234) org.apache.hadoop.hive.cli.TestSparkCliDriver.testCliDriver[bucket_map_join_tez1] (batchId=137) org.apache.hadoop.hive.ql.TestAcidOnTez.testCtasTezUnion (batchId=215) org.apache.hadoop.hive.ql.TestAcidOnTez.testNonStandardConversion01 (batchId=215) org.apache.hive.hcatalog.pig.TestTextFileHCatStorer.testWriteChar (batchId=183) Test results: https://builds.apache.org/job/PreCommit-HIVE-Build/6875/testReport Console output: https://builds.apache.org/job/PreCommit-HIVE-Build/6875/console Test logs: http://104.198.109.242/logs/PreCommit-HIVE-Build-6875/ Messages: Executing org.apache.hive.ptest.execution.TestCheckPhase Executing org.apache.hive.ptest.execution.PrepPhase Executing org.apache.hive.ptest.execution.ExecutionPhase Executing org.apache.hive.ptest.execution.ReportingPhase Tests exited with: TestsFailedException: 12 tests failed This message is automatically generated. ATTACHMENT ID: 12887746 - PreCommit-HIVE-Build
          Hide
          djaiswal Deepak Jaiswal added a comment -

          Retrying again after refreshing the code.

          Show
          djaiswal Deepak Jaiswal added a comment - Retrying again after refreshing the code.
          Hide
          hiveqa Hive QA added a comment -

          Here are the results of testing the latest attachment:
          https://issues.apache.org/jira/secure/attachment/12887964/HIVE-17529.4.patch

          SUCCESS: +1 due to 2 test(s) being added or modified.

          ERROR: -1 due to 12 failed/errored test(s), 11044 tests executed
          Failed tests:

          TestAccumuloCliDriver - did not produce a TEST-*.xml file (likely timed out) (batchId=230)
          TestDummy - did not produce a TEST-*.xml file (likely timed out) (batchId=230)
          org.apache.hadoop.hive.cli.TestCliDriver.testCliDriver[create_view] (batchId=39)
          org.apache.hadoop.hive.cli.TestCliDriver.testCliDriver[udf_mask_hash] (batchId=28)
          org.apache.hadoop.hive.cli.TestMiniLlapLocalCliDriver.testCliDriver[union_fast_stats] (batchId=156)
          org.apache.hadoop.hive.cli.TestMiniSparkOnYarnCliDriver.testCliDriver[spark_explainuser_1] (batchId=170)
          org.apache.hadoop.hive.cli.TestMiniTezCliDriver.testCliDriver[explainanalyze_2] (batchId=100)
          org.apache.hadoop.hive.cli.TestNegativeCliDriver.testCliDriver[drop_table_failure2] (batchId=89)
          org.apache.hadoop.hive.cli.TestPerfCliDriver.testCliDriver[query14] (batchId=234)
          org.apache.hadoop.hive.cli.TestSparkCliDriver.testCliDriver[bucket_map_join_tez1] (batchId=137)
          org.apache.hadoop.hive.ql.TestAcidOnTez.testCtasTezUnion (batchId=215)
          org.apache.hadoop.hive.ql.TestAcidOnTez.testNonStandardConversion01 (batchId=215)
          

          Test results: https://builds.apache.org/job/PreCommit-HIVE-Build/6896/testReport
          Console output: https://builds.apache.org/job/PreCommit-HIVE-Build/6896/console
          Test logs: http://104.198.109.242/logs/PreCommit-HIVE-Build-6896/

          Messages:

          Executing org.apache.hive.ptest.execution.TestCheckPhase
          Executing org.apache.hive.ptest.execution.PrepPhase
          Executing org.apache.hive.ptest.execution.ExecutionPhase
          Executing org.apache.hive.ptest.execution.ReportingPhase
          Tests exited with: TestsFailedException: 12 tests failed
          

          This message is automatically generated.

          ATTACHMENT ID: 12887964 - PreCommit-HIVE-Build

          Show
          hiveqa Hive QA added a comment - Here are the results of testing the latest attachment: https://issues.apache.org/jira/secure/attachment/12887964/HIVE-17529.4.patch SUCCESS: +1 due to 2 test(s) being added or modified. ERROR: -1 due to 12 failed/errored test(s), 11044 tests executed Failed tests: TestAccumuloCliDriver - did not produce a TEST-*.xml file (likely timed out) (batchId=230) TestDummy - did not produce a TEST-*.xml file (likely timed out) (batchId=230) org.apache.hadoop.hive.cli.TestCliDriver.testCliDriver[create_view] (batchId=39) org.apache.hadoop.hive.cli.TestCliDriver.testCliDriver[udf_mask_hash] (batchId=28) org.apache.hadoop.hive.cli.TestMiniLlapLocalCliDriver.testCliDriver[union_fast_stats] (batchId=156) org.apache.hadoop.hive.cli.TestMiniSparkOnYarnCliDriver.testCliDriver[spark_explainuser_1] (batchId=170) org.apache.hadoop.hive.cli.TestMiniTezCliDriver.testCliDriver[explainanalyze_2] (batchId=100) org.apache.hadoop.hive.cli.TestNegativeCliDriver.testCliDriver[drop_table_failure2] (batchId=89) org.apache.hadoop.hive.cli.TestPerfCliDriver.testCliDriver[query14] (batchId=234) org.apache.hadoop.hive.cli.TestSparkCliDriver.testCliDriver[bucket_map_join_tez1] (batchId=137) org.apache.hadoop.hive.ql.TestAcidOnTez.testCtasTezUnion (batchId=215) org.apache.hadoop.hive.ql.TestAcidOnTez.testNonStandardConversion01 (batchId=215) Test results: https://builds.apache.org/job/PreCommit-HIVE-Build/6896/testReport Console output: https://builds.apache.org/job/PreCommit-HIVE-Build/6896/console Test logs: http://104.198.109.242/logs/PreCommit-HIVE-Build-6896/ Messages: Executing org.apache.hive.ptest.execution.TestCheckPhase Executing org.apache.hive.ptest.execution.PrepPhase Executing org.apache.hive.ptest.execution.ExecutionPhase Executing org.apache.hive.ptest.execution.ReportingPhase Tests exited with: TestsFailedException: 12 tests failed This message is automatically generated. ATTACHMENT ID: 12887964 - PreCommit-HIVE-Build
          Hide
          djaiswal Deepak Jaiswal added a comment -

          Added order by in the failing tests due to mismatched order of results.

          Show
          djaiswal Deepak Jaiswal added a comment - Added order by in the failing tests due to mismatched order of results.
          Hide
          hiveqa Hive QA added a comment -

          Here are the results of testing the latest attachment:
          https://issues.apache.org/jira/secure/attachment/12888102/HIVE-17529.5.patch

          SUCCESS: +1 due to 2 test(s) being added or modified.

          ERROR: -1 due to 8 failed/errored test(s), 11049 tests executed
          Failed tests:

          TestAccumuloCliDriver - did not produce a TEST-*.xml file (likely timed out) (batchId=231)
          TestDummy - did not produce a TEST-*.xml file (likely timed out) (batchId=231)
          org.apache.hadoop.hive.cli.TestCliDriver.testCliDriver[create_view] (batchId=39)
          org.apache.hadoop.hive.cli.TestMiniLlapLocalCliDriver.testCliDriver[union_fast_stats] (batchId=156)
          org.apache.hadoop.hive.cli.TestMiniSparkOnYarnCliDriver.testCliDriver[spark_explainuser_1] (batchId=170)
          org.apache.hadoop.hive.cli.TestNegativeCliDriver.testCliDriver[drop_table_failure2] (batchId=89)
          org.apache.hadoop.hive.cli.TestPerfCliDriver.testCliDriver[query14] (batchId=235)
          org.apache.hadoop.hive.cli.TestPerfCliDriver.testCliDriver[query23] (batchId=235)
          

          Test results: https://builds.apache.org/job/PreCommit-HIVE-Build/6918/testReport
          Console output: https://builds.apache.org/job/PreCommit-HIVE-Build/6918/console
          Test logs: http://104.198.109.242/logs/PreCommit-HIVE-Build-6918/

          Messages:

          Executing org.apache.hive.ptest.execution.TestCheckPhase
          Executing org.apache.hive.ptest.execution.PrepPhase
          Executing org.apache.hive.ptest.execution.ExecutionPhase
          Executing org.apache.hive.ptest.execution.ReportingPhase
          Tests exited with: TestsFailedException: 8 tests failed
          

          This message is automatically generated.

          ATTACHMENT ID: 12888102 - PreCommit-HIVE-Build

          Show
          hiveqa Hive QA added a comment - Here are the results of testing the latest attachment: https://issues.apache.org/jira/secure/attachment/12888102/HIVE-17529.5.patch SUCCESS: +1 due to 2 test(s) being added or modified. ERROR: -1 due to 8 failed/errored test(s), 11049 tests executed Failed tests: TestAccumuloCliDriver - did not produce a TEST-*.xml file (likely timed out) (batchId=231) TestDummy - did not produce a TEST-*.xml file (likely timed out) (batchId=231) org.apache.hadoop.hive.cli.TestCliDriver.testCliDriver[create_view] (batchId=39) org.apache.hadoop.hive.cli.TestMiniLlapLocalCliDriver.testCliDriver[union_fast_stats] (batchId=156) org.apache.hadoop.hive.cli.TestMiniSparkOnYarnCliDriver.testCliDriver[spark_explainuser_1] (batchId=170) org.apache.hadoop.hive.cli.TestNegativeCliDriver.testCliDriver[drop_table_failure2] (batchId=89) org.apache.hadoop.hive.cli.TestPerfCliDriver.testCliDriver[query14] (batchId=235) org.apache.hadoop.hive.cli.TestPerfCliDriver.testCliDriver[query23] (batchId=235) Test results: https://builds.apache.org/job/PreCommit-HIVE-Build/6918/testReport Console output: https://builds.apache.org/job/PreCommit-HIVE-Build/6918/console Test logs: http://104.198.109.242/logs/PreCommit-HIVE-Build-6918/ Messages: Executing org.apache.hive.ptest.execution.TestCheckPhase Executing org.apache.hive.ptest.execution.PrepPhase Executing org.apache.hive.ptest.execution.ExecutionPhase Executing org.apache.hive.ptest.execution.ReportingPhase Tests exited with: TestsFailedException: 8 tests failed This message is automatically generated. ATTACHMENT ID: 12888102 - PreCommit-HIVE-Build
          Hide
          djaiswal Deepak Jaiswal added a comment - - edited

          The updated query worked. The test is now passing. Jason Dere can you please review?

          Show
          djaiswal Deepak Jaiswal added a comment - - edited The updated query worked. The test is now passing. Jason Dere can you please review?
          Hide
          jdere Jason Dere added a comment -

          +1

          Show
          jdere Jason Dere added a comment - +1
          Hide
          jdere Jason Dere added a comment -

          Committed to master

          Show
          jdere Jason Dere added a comment - Committed to master
          Hide
          djaiswal Deepak Jaiswal added a comment -

          Thanks for the review and commit Jason Dere

          Show
          djaiswal Deepak Jaiswal added a comment - Thanks for the review and commit Jason Dere

            People

            • Assignee:
              djaiswal Deepak Jaiswal
              Reporter:
              djaiswal Deepak Jaiswal
            • Votes:
              0 Vote for this issue
              Watchers:
              2 Start watching this issue

              Dates

              • Created:
                Updated:
                Resolved:

                Development