Details

    • Type: Improvement
    • Status: Resolved
    • Priority: Minor
    • Resolution: Fixed
    • Affects Version/s: 3.0.0-alpha1
    • Fix Version/s: 2.8.0, 3.0.0-alpha1
    • Component/s: performance
    • Labels:
      None
    • Hadoop Flags:
      Reviewed

      Description

      There are lots of places where useless boxing/unboxing occur.
      To avoid performance issue, let's remove them.

      1. HDFS-9686.0.patch
        24 kB
        Kousuke Saruta
      2. HDFS-9686.1.patch
        24 kB
        Kousuke Saruta

        Activity

        Hide
        ajisakaa Akira Ajisaka added a comment -

        hadoop-mapreduce-project/hadoop-mapreduce-client/hadoop-mapreduce-client-app/src/test/java/org/apache/hadoop/mapreduce/v2/app/TestStagingCleanup.java

        I wrongly committed the patch and MAPREDUCE-6607 patch at the same time, so I reverted this commit and committed only the HDFS-9686 patch. Thanks Kai for reporting this.

        Show
        ajisakaa Akira Ajisaka added a comment - hadoop-mapreduce-project/hadoop-mapreduce-client/hadoop-mapreduce-client-app/src/test/java/org/apache/hadoop/mapreduce/v2/app/TestStagingCleanup.java I wrongly committed the patch and MAPREDUCE-6607 patch at the same time, so I reverted this commit and committed only the HDFS-9686 patch. Thanks Kai for reporting this.
        Hide
        hudson Hudson added a comment -

        FAILURE: Integrated in Hadoop-trunk-Commit #9273 (See https://builds.apache.org/job/Hadoop-trunk-Commit/9273/)
        Revert "HDFS-9686. Remove useless boxing/unboxing code. Contributed by (aajisaka: rev 5e565ce7a7e194f82e935b0e9808744e6bd64287)

        • hadoop-hdfs-project/hadoop-hdfs/CHANGES.txt
        • hadoop-hdfs-project/hadoop-hdfs/src/main/java/org/apache/hadoop/hdfs/server/namenode/top/window/RollingWindowManager.java
        • hadoop-hdfs-project/hadoop-hdfs-httpfs/src/main/java/org/apache/hadoop/lib/servlet/ServerWebApp.java
        • hadoop-mapreduce-project/hadoop-mapreduce-client/hadoop-mapreduce-client-app/src/test/java/org/apache/hadoop/mapreduce/v2/app/TestStagingCleanup.java
        • hadoop-hdfs-project/hadoop-hdfs/src/test/java/org/apache/hadoop/hdfs/shortcircuit/TestShortCircuitLocalRead.java
        • hadoop-hdfs-project/hadoop-hdfs/src/test/java/org/apache/hadoop/hdfs/ErasureCodeBenchmarkThroughput.java
        • hadoop-hdfs-project/hadoop-hdfs/src/main/java/org/apache/hadoop/hdfs/server/namenode/FSEditLogOp.java
          HDFS-9686. Remove useless boxing/unboxing code. Contributed by Kousuke (aajisaka: rev 802a7edfaed778daaa471ee96466c6d69b35934c)
        • hadoop-hdfs-project/hadoop-hdfs-httpfs/src/main/java/org/apache/hadoop/lib/servlet/ServerWebApp.java
        • hadoop-hdfs-project/hadoop-hdfs/CHANGES.txt
        • hadoop-hdfs-project/hadoop-hdfs/src/main/java/org/apache/hadoop/hdfs/server/namenode/top/window/RollingWindowManager.java
        • hadoop-hdfs-project/hadoop-hdfs/src/test/java/org/apache/hadoop/hdfs/shortcircuit/TestShortCircuitLocalRead.java
        • hadoop-hdfs-project/hadoop-hdfs/src/main/java/org/apache/hadoop/hdfs/server/namenode/FSEditLogOp.java
        • hadoop-hdfs-project/hadoop-hdfs/src/test/java/org/apache/hadoop/hdfs/ErasureCodeBenchmarkThroughput.java
        Show
        hudson Hudson added a comment - FAILURE: Integrated in Hadoop-trunk-Commit #9273 (See https://builds.apache.org/job/Hadoop-trunk-Commit/9273/ ) Revert " HDFS-9686 . Remove useless boxing/unboxing code. Contributed by (aajisaka: rev 5e565ce7a7e194f82e935b0e9808744e6bd64287) hadoop-hdfs-project/hadoop-hdfs/CHANGES.txt hadoop-hdfs-project/hadoop-hdfs/src/main/java/org/apache/hadoop/hdfs/server/namenode/top/window/RollingWindowManager.java hadoop-hdfs-project/hadoop-hdfs-httpfs/src/main/java/org/apache/hadoop/lib/servlet/ServerWebApp.java hadoop-mapreduce-project/hadoop-mapreduce-client/hadoop-mapreduce-client-app/src/test/java/org/apache/hadoop/mapreduce/v2/app/TestStagingCleanup.java hadoop-hdfs-project/hadoop-hdfs/src/test/java/org/apache/hadoop/hdfs/shortcircuit/TestShortCircuitLocalRead.java hadoop-hdfs-project/hadoop-hdfs/src/test/java/org/apache/hadoop/hdfs/ErasureCodeBenchmarkThroughput.java hadoop-hdfs-project/hadoop-hdfs/src/main/java/org/apache/hadoop/hdfs/server/namenode/FSEditLogOp.java HDFS-9686 . Remove useless boxing/unboxing code. Contributed by Kousuke (aajisaka: rev 802a7edfaed778daaa471ee96466c6d69b35934c) hadoop-hdfs-project/hadoop-hdfs-httpfs/src/main/java/org/apache/hadoop/lib/servlet/ServerWebApp.java hadoop-hdfs-project/hadoop-hdfs/CHANGES.txt hadoop-hdfs-project/hadoop-hdfs/src/main/java/org/apache/hadoop/hdfs/server/namenode/top/window/RollingWindowManager.java hadoop-hdfs-project/hadoop-hdfs/src/test/java/org/apache/hadoop/hdfs/shortcircuit/TestShortCircuitLocalRead.java hadoop-hdfs-project/hadoop-hdfs/src/main/java/org/apache/hadoop/hdfs/server/namenode/FSEditLogOp.java hadoop-hdfs-project/hadoop-hdfs/src/test/java/org/apache/hadoop/hdfs/ErasureCodeBenchmarkThroughput.java
        Hide
        hudson Hudson added a comment -

        FAILURE: Integrated in Hadoop-trunk-Commit #9253 (See https://builds.apache.org/job/Hadoop-trunk-Commit/9253/)
        HDFS-9686. Remove useless boxing/unboxing code. Contributed by Kousuke (aajisaka: rev fe124da5ffc16e4795c3dd5542accd58361e1b08)

        • hadoop-hdfs-project/hadoop-hdfs/src/test/java/org/apache/hadoop/hdfs/shortcircuit/TestShortCircuitLocalRead.java
        • hadoop-hdfs-project/hadoop-hdfs/src/main/java/org/apache/hadoop/hdfs/server/namenode/FSEditLogOp.java
        • hadoop-hdfs-project/hadoop-hdfs/src/main/java/org/apache/hadoop/hdfs/server/namenode/top/window/RollingWindowManager.java
        • hadoop-hdfs-project/hadoop-hdfs-httpfs/src/main/java/org/apache/hadoop/lib/servlet/ServerWebApp.java
        • hadoop-hdfs-project/hadoop-hdfs/src/test/java/org/apache/hadoop/hdfs/ErasureCodeBenchmarkThroughput.java
        • hadoop-hdfs-project/hadoop-hdfs/CHANGES.txt
        • hadoop-mapreduce-project/hadoop-mapreduce-client/hadoop-mapreduce-client-app/src/test/java/org/apache/hadoop/mapreduce/v2/app/TestStagingCleanup.java
        Show
        hudson Hudson added a comment - FAILURE: Integrated in Hadoop-trunk-Commit #9253 (See https://builds.apache.org/job/Hadoop-trunk-Commit/9253/ ) HDFS-9686 . Remove useless boxing/unboxing code. Contributed by Kousuke (aajisaka: rev fe124da5ffc16e4795c3dd5542accd58361e1b08) hadoop-hdfs-project/hadoop-hdfs/src/test/java/org/apache/hadoop/hdfs/shortcircuit/TestShortCircuitLocalRead.java hadoop-hdfs-project/hadoop-hdfs/src/main/java/org/apache/hadoop/hdfs/server/namenode/FSEditLogOp.java hadoop-hdfs-project/hadoop-hdfs/src/main/java/org/apache/hadoop/hdfs/server/namenode/top/window/RollingWindowManager.java hadoop-hdfs-project/hadoop-hdfs-httpfs/src/main/java/org/apache/hadoop/lib/servlet/ServerWebApp.java hadoop-hdfs-project/hadoop-hdfs/src/test/java/org/apache/hadoop/hdfs/ErasureCodeBenchmarkThroughput.java hadoop-hdfs-project/hadoop-hdfs/CHANGES.txt hadoop-mapreduce-project/hadoop-mapreduce-client/hadoop-mapreduce-client-app/src/test/java/org/apache/hadoop/mapreduce/v2/app/TestStagingCleanup.java
        Hide
        ajisakaa Akira Ajisaka added a comment -

        Committed this to trunk, branch-2, and branch-2.8. Thanks Kousuke Saruta for the contribution.

        Show
        ajisakaa Akira Ajisaka added a comment - Committed this to trunk, branch-2, and branch-2.8. Thanks Kousuke Saruta for the contribution.
        Hide
        ajisakaa Akira Ajisaka added a comment -

        +1, LGTM. I ran all the failed unit tests (https://builds.apache.org/job/PreCommit-HDFS-Build/14289/testReport/) locally and all of them passed.

        Show
        ajisakaa Akira Ajisaka added a comment - +1, LGTM. I ran all the failed unit tests ( https://builds.apache.org/job/PreCommit-HDFS-Build/14289/testReport/ ) locally and all of them passed.
        Hide
        hadoopqa Hadoop QA added a comment -
        -1 overall



        Vote Subsystem Runtime Comment
        0 reexec 0m 0s Docker mode activated.
        +1 @author 0m 0s The patch does not contain any @author tags.
        +1 test4tests 0m 0s The patch appears to include 2 new or modified test files.
        0 mvndep 0m 22s Maven dependency ordering for branch
        +1 mvninstall 12m 33s trunk passed
        +1 compile 3m 49s trunk passed with JDK v1.8.0_66
        +1 compile 3m 0s trunk passed with JDK v1.7.0_91
        +1 checkstyle 0m 58s trunk passed
        +1 mvnsite 3m 29s trunk passed
        +1 mvneclipse 0m 53s trunk passed
        +1 findbugs 5m 46s trunk passed
        +1 javadoc 3m 46s trunk passed with JDK v1.8.0_66
        +1 javadoc 6m 8s trunk passed with JDK v1.7.0_91
        0 mvndep 0m 22s Maven dependency ordering for patch
        +1 mvninstall 2m 41s the patch passed
        +1 compile 4m 11s the patch passed with JDK v1.8.0_66
        +1 javac 4m 11s the patch passed
        +1 compile 2m 56s the patch passed with JDK v1.7.0_91
        +1 javac 2m 56s the patch passed
        +1 checkstyle 0m 50s hadoop-hdfs-project: patch generated 0 new + 359 unchanged - 11 fixed = 359 total (was 370)
        +1 mvnsite 2m 57s the patch passed
        +1 mvneclipse 0m 43s the patch passed
        +1 whitespace 0m 0s Patch has no whitespace issues.
        +1 findbugs 7m 20s the patch passed
        +1 javadoc 4m 23s the patch passed with JDK v1.8.0_66
        +1 javadoc 5m 43s the patch passed with JDK v1.7.0_91
        -1 unit 128m 48s hadoop-hdfs in the patch failed with JDK v1.8.0_66.
        -1 unit 132m 4s hadoop-hdfs in the patch failed with JDK v1.8.0_66.
        -1 unit 197m 22s hadoop-hdfs in the patch failed with JDK v1.7.0_91.
        -1 unit 204m 38s hadoop-hdfs in the patch failed with JDK v1.7.0_91.
        +1 asflicense 1m 47s Patch does not generate ASF License warnings.
        742m 39s



        Reason Tests
        JDK v1.8.0_66 Failed junit tests hadoop.hdfs.shortcircuit.TestShortCircuitCache
          hadoop.hdfs.security.TestDelegationTokenForProxyUser
          hadoop.hdfs.server.datanode.TestDataNodeVolumeFailure
          hadoop.hdfs.TestSafeModeWithStripedFile
          hadoop.hdfs.server.namenode.TestSecurityTokenEditLog
          hadoop.hdfs.server.datanode.fsdataset.impl.TestSpaceReservation
          hadoop.hdfs.server.datanode.TestBlockReplacement
          hadoop.hdfs.server.namenode.ha.TestHAAppend
          hadoop.fs.TestSymlinkHdfsFileContext
          hadoop.hdfs.qjournal.TestSecureNNWithQJM
          hadoop.hdfs.TestEncryptionZones
          hadoop.hdfs.server.namenode.ha.TestRequestHedgingProxyProvider
          hadoop.hdfs.server.datanode.TestDirectoryScanner
          hadoop.hdfs.shortcircuit.TestShortCircuitCache
          hadoop.hdfs.security.TestDelegationTokenForProxyUser
          hadoop.hdfs.server.datanode.TestDataNodeVolumeFailure
          hadoop.hdfs.TestSafeModeWithStripedFile
          hadoop.hdfs.server.namenode.TestSecurityTokenEditLog
          hadoop.hdfs.server.datanode.fsdataset.impl.TestSpaceReservation
          hadoop.hdfs.server.datanode.TestBlockReplacement
          hadoop.hdfs.server.namenode.ha.TestHAAppend
          hadoop.fs.TestSymlinkHdfsFileContext
          hadoop.hdfs.qjournal.TestSecureNNWithQJM
          hadoop.hdfs.TestEncryptionZones
          hadoop.hdfs.server.namenode.ha.TestRequestHedgingProxyProvider
          hadoop.hdfs.server.datanode.TestDirectoryScanner
        JDK v1.7.0_91 Failed junit tests hadoop.hdfs.TestDFSStripedOutputStreamWithFailure200
          hadoop.hdfs.TestDFSUpgradeFromImage
          hadoop.hdfs.TestDFSStripedOutputStreamWithFailure
          hadoop.hdfs.server.datanode.TestBlockScanner
          hadoop.hdfs.server.namenode.ha.TestEditLogTailer
          hadoop.hdfs.TestPersistBlocks
          hadoop.hdfs.TestDFSStripedOutputStreamWithFailure180
          hadoop.hdfs.server.datanode.TestDataNodeMultipleRegistrations
          hadoop.hdfs.TestDataTransferKeepalive
          hadoop.hdfs.security.TestDelegationTokenForProxyUser
          hadoop.hdfs.TestLocalDFS
          hadoop.hdfs.TestDFSStripedOutputStreamWithFailure170
          hadoop.hdfs.server.datanode.TestIncrementalBrVariations
          hadoop.hdfs.server.datanode.TestDataNodeVolumeFailure
          hadoop.hdfs.tools.TestDFSAdminWithHA
          hadoop.hdfs.web.TestWebHdfsTokens
          hadoop.hdfs.server.namenode.TestSecurityTokenEditLog
          hadoop.hdfs.server.datanode.fsdataset.impl.TestSpaceReservation
          hadoop.hdfs.server.datanode.TestBlockReplacement
          hadoop.hdfs.server.datanode.TestBlockRecovery
          hadoop.hdfs.TestDFSStripedOutputStreamWithFailure080
          hadoop.hdfs.server.namenode.ha.TestHAAppend
          hadoop.fs.TestSymlinkHdfsFileContext
          hadoop.hdfs.qjournal.TestSecureNNWithQJM
          hadoop.hdfs.TestEncryptionZones
          hadoop.hdfs.server.blockmanagement.TestComputeInvalidateWork
          hadoop.hdfs.server.datanode.TestDirectoryScanner
          hadoop.hdfs.TestDFSStripedOutputStreamWithFailure200
          hadoop.hdfs.TestDFSUpgradeFromImage
          hadoop.hdfs.TestDFSStripedOutputStreamWithFailure
          hadoop.hdfs.server.datanode.TestBlockScanner
          hadoop.hdfs.server.namenode.ha.TestEditLogTailer
          hadoop.hdfs.TestPersistBlocks
          hadoop.hdfs.TestDFSStripedOutputStreamWithFailure180
          hadoop.hdfs.server.datanode.TestDataNodeMultipleRegistrations
          hadoop.hdfs.TestDataTransferKeepalive
          hadoop.hdfs.security.TestDelegationTokenForProxyUser
          hadoop.hdfs.TestLocalDFS
          hadoop.hdfs.TestDFSStripedOutputStreamWithFailure170
          hadoop.hdfs.server.datanode.TestIncrementalBrVariations
          hadoop.hdfs.server.datanode.TestDataNodeVolumeFailure
          hadoop.hdfs.tools.TestDFSAdminWithHA
          hadoop.hdfs.web.TestWebHdfsTokens
          hadoop.hdfs.server.namenode.TestSecurityTokenEditLog
          hadoop.hdfs.server.datanode.fsdataset.impl.TestSpaceReservation
          hadoop.hdfs.server.datanode.TestBlockReplacement
          hadoop.hdfs.server.datanode.TestBlockRecovery
          hadoop.hdfs.TestDFSStripedOutputStreamWithFailure080
          hadoop.hdfs.server.namenode.ha.TestHAAppend
          hadoop.fs.TestSymlinkHdfsFileContext
          hadoop.hdfs.qjournal.TestSecureNNWithQJM
          hadoop.hdfs.TestEncryptionZones
          hadoop.hdfs.server.blockmanagement.TestComputeInvalidateWork
          hadoop.hdfs.server.datanode.TestDirectoryScanner
        JDK v1.7.0_91 Timed out junit tests org.apache.hadoop.hdfs.server.blockmanagement.TestOverReplicatedBlocks
          org.apache.hadoop.hdfs.TestReadStripedFileWithDecoding
          org.apache.hadoop.hdfs.server.blockmanagement.TestOverReplicatedBlocks
          org.apache.hadoop.hdfs.TestReadStripedFileWithDecoding



        Subsystem Report/Notes
        Docker Image:yetus/hadoop:0ca8df7
        JIRA Patch URL https://issues.apache.org/jira/secure/attachment/12785171/HDFS-9686.1.patch
        JIRA Issue HDFS-9686
        Optional Tests asflicense compile javac javadoc mvninstall mvnsite unit findbugs checkstyle
        uname Linux 2a6efb06a265 3.13.0-36-lowlatency #63-Ubuntu SMP PREEMPT Wed Sep 3 21:56:12 UTC 2014 x86_64 x86_64 x86_64 GNU/Linux
        Build tool maven
        Personality /testptch/hadoop/patchprocess/precommit/personality/provided.sh
        git revision trunk / a277bdc
        Default Java 1.7.0_91
        Multi-JDK versions /usr/lib/jvm/java-8-oracle:1.8.0_66 /usr/lib/jvm/java-7-openjdk-amd64:1.7.0_91
        findbugs v3.0.0
        unit https://builds.apache.org/job/PreCommit-HDFS-Build/14289/artifact/patchprocess/patch-unit-hadoop-hdfs-project_hadoop-hdfs-jdk1.8.0_66.txt
        unit https://builds.apache.org/job/PreCommit-HDFS-Build/14289/artifact/patchprocess/patch-unit-hadoop-hdfs-project_hadoop-hdfs-jdk1.8.0_66.txt
        unit https://builds.apache.org/job/PreCommit-HDFS-Build/14289/artifact/patchprocess/patch-unit-hadoop-hdfs-project_hadoop-hdfs-jdk1.7.0_91.txt
        unit https://builds.apache.org/job/PreCommit-HDFS-Build/14289/artifact/patchprocess/patch-unit-hadoop-hdfs-project_hadoop-hdfs-jdk1.7.0_91.txt
        unit test logs https://builds.apache.org/job/PreCommit-HDFS-Build/14289/artifact/patchprocess/patch-unit-hadoop-hdfs-project_hadoop-hdfs-jdk1.8.0_66.txt https://builds.apache.org/job/PreCommit-HDFS-Build/14289/artifact/patchprocess/patch-unit-hadoop-hdfs-project_hadoop-hdfs-jdk1.8.0_66.txt https://builds.apache.org/job/PreCommit-HDFS-Build/14289/artifact/patchprocess/patch-unit-hadoop-hdfs-project_hadoop-hdfs-jdk1.7.0_91.txt https://builds.apache.org/job/PreCommit-HDFS-Build/14289/artifact/patchprocess/patch-unit-hadoop-hdfs-project_hadoop-hdfs-jdk1.7.0_91.txt
        JDK v1.7.0_91 Test Results https://builds.apache.org/job/PreCommit-HDFS-Build/14289/testReport/
        modules C: hadoop-hdfs-project/hadoop-hdfs hadoop-hdfs-project/hadoop-hdfs-httpfs U: hadoop-hdfs-project
        Max memory used 76MB
        Powered by Apache Yetus 0.2.0-SNAPSHOT http://yetus.apache.org
        Console output https://builds.apache.org/job/PreCommit-HDFS-Build/14289/console

        This message was automatically generated.

        Show
        hadoopqa Hadoop QA added a comment - -1 overall Vote Subsystem Runtime Comment 0 reexec 0m 0s Docker mode activated. +1 @author 0m 0s The patch does not contain any @author tags. +1 test4tests 0m 0s The patch appears to include 2 new or modified test files. 0 mvndep 0m 22s Maven dependency ordering for branch +1 mvninstall 12m 33s trunk passed +1 compile 3m 49s trunk passed with JDK v1.8.0_66 +1 compile 3m 0s trunk passed with JDK v1.7.0_91 +1 checkstyle 0m 58s trunk passed +1 mvnsite 3m 29s trunk passed +1 mvneclipse 0m 53s trunk passed +1 findbugs 5m 46s trunk passed +1 javadoc 3m 46s trunk passed with JDK v1.8.0_66 +1 javadoc 6m 8s trunk passed with JDK v1.7.0_91 0 mvndep 0m 22s Maven dependency ordering for patch +1 mvninstall 2m 41s the patch passed +1 compile 4m 11s the patch passed with JDK v1.8.0_66 +1 javac 4m 11s the patch passed +1 compile 2m 56s the patch passed with JDK v1.7.0_91 +1 javac 2m 56s the patch passed +1 checkstyle 0m 50s hadoop-hdfs-project: patch generated 0 new + 359 unchanged - 11 fixed = 359 total (was 370) +1 mvnsite 2m 57s the patch passed +1 mvneclipse 0m 43s the patch passed +1 whitespace 0m 0s Patch has no whitespace issues. +1 findbugs 7m 20s the patch passed +1 javadoc 4m 23s the patch passed with JDK v1.8.0_66 +1 javadoc 5m 43s the patch passed with JDK v1.7.0_91 -1 unit 128m 48s hadoop-hdfs in the patch failed with JDK v1.8.0_66. -1 unit 132m 4s hadoop-hdfs in the patch failed with JDK v1.8.0_66. -1 unit 197m 22s hadoop-hdfs in the patch failed with JDK v1.7.0_91. -1 unit 204m 38s hadoop-hdfs in the patch failed with JDK v1.7.0_91. +1 asflicense 1m 47s Patch does not generate ASF License warnings. 742m 39s Reason Tests JDK v1.8.0_66 Failed junit tests hadoop.hdfs.shortcircuit.TestShortCircuitCache   hadoop.hdfs.security.TestDelegationTokenForProxyUser   hadoop.hdfs.server.datanode.TestDataNodeVolumeFailure   hadoop.hdfs.TestSafeModeWithStripedFile   hadoop.hdfs.server.namenode.TestSecurityTokenEditLog   hadoop.hdfs.server.datanode.fsdataset.impl.TestSpaceReservation   hadoop.hdfs.server.datanode.TestBlockReplacement   hadoop.hdfs.server.namenode.ha.TestHAAppend   hadoop.fs.TestSymlinkHdfsFileContext   hadoop.hdfs.qjournal.TestSecureNNWithQJM   hadoop.hdfs.TestEncryptionZones   hadoop.hdfs.server.namenode.ha.TestRequestHedgingProxyProvider   hadoop.hdfs.server.datanode.TestDirectoryScanner   hadoop.hdfs.shortcircuit.TestShortCircuitCache   hadoop.hdfs.security.TestDelegationTokenForProxyUser   hadoop.hdfs.server.datanode.TestDataNodeVolumeFailure   hadoop.hdfs.TestSafeModeWithStripedFile   hadoop.hdfs.server.namenode.TestSecurityTokenEditLog   hadoop.hdfs.server.datanode.fsdataset.impl.TestSpaceReservation   hadoop.hdfs.server.datanode.TestBlockReplacement   hadoop.hdfs.server.namenode.ha.TestHAAppend   hadoop.fs.TestSymlinkHdfsFileContext   hadoop.hdfs.qjournal.TestSecureNNWithQJM   hadoop.hdfs.TestEncryptionZones   hadoop.hdfs.server.namenode.ha.TestRequestHedgingProxyProvider   hadoop.hdfs.server.datanode.TestDirectoryScanner JDK v1.7.0_91 Failed junit tests hadoop.hdfs.TestDFSStripedOutputStreamWithFailure200   hadoop.hdfs.TestDFSUpgradeFromImage   hadoop.hdfs.TestDFSStripedOutputStreamWithFailure   hadoop.hdfs.server.datanode.TestBlockScanner   hadoop.hdfs.server.namenode.ha.TestEditLogTailer   hadoop.hdfs.TestPersistBlocks   hadoop.hdfs.TestDFSStripedOutputStreamWithFailure180   hadoop.hdfs.server.datanode.TestDataNodeMultipleRegistrations   hadoop.hdfs.TestDataTransferKeepalive   hadoop.hdfs.security.TestDelegationTokenForProxyUser   hadoop.hdfs.TestLocalDFS   hadoop.hdfs.TestDFSStripedOutputStreamWithFailure170   hadoop.hdfs.server.datanode.TestIncrementalBrVariations   hadoop.hdfs.server.datanode.TestDataNodeVolumeFailure   hadoop.hdfs.tools.TestDFSAdminWithHA   hadoop.hdfs.web.TestWebHdfsTokens   hadoop.hdfs.server.namenode.TestSecurityTokenEditLog   hadoop.hdfs.server.datanode.fsdataset.impl.TestSpaceReservation   hadoop.hdfs.server.datanode.TestBlockReplacement   hadoop.hdfs.server.datanode.TestBlockRecovery   hadoop.hdfs.TestDFSStripedOutputStreamWithFailure080   hadoop.hdfs.server.namenode.ha.TestHAAppend   hadoop.fs.TestSymlinkHdfsFileContext   hadoop.hdfs.qjournal.TestSecureNNWithQJM   hadoop.hdfs.TestEncryptionZones   hadoop.hdfs.server.blockmanagement.TestComputeInvalidateWork   hadoop.hdfs.server.datanode.TestDirectoryScanner   hadoop.hdfs.TestDFSStripedOutputStreamWithFailure200   hadoop.hdfs.TestDFSUpgradeFromImage   hadoop.hdfs.TestDFSStripedOutputStreamWithFailure   hadoop.hdfs.server.datanode.TestBlockScanner   hadoop.hdfs.server.namenode.ha.TestEditLogTailer   hadoop.hdfs.TestPersistBlocks   hadoop.hdfs.TestDFSStripedOutputStreamWithFailure180   hadoop.hdfs.server.datanode.TestDataNodeMultipleRegistrations   hadoop.hdfs.TestDataTransferKeepalive   hadoop.hdfs.security.TestDelegationTokenForProxyUser   hadoop.hdfs.TestLocalDFS   hadoop.hdfs.TestDFSStripedOutputStreamWithFailure170   hadoop.hdfs.server.datanode.TestIncrementalBrVariations   hadoop.hdfs.server.datanode.TestDataNodeVolumeFailure   hadoop.hdfs.tools.TestDFSAdminWithHA   hadoop.hdfs.web.TestWebHdfsTokens   hadoop.hdfs.server.namenode.TestSecurityTokenEditLog   hadoop.hdfs.server.datanode.fsdataset.impl.TestSpaceReservation   hadoop.hdfs.server.datanode.TestBlockReplacement   hadoop.hdfs.server.datanode.TestBlockRecovery   hadoop.hdfs.TestDFSStripedOutputStreamWithFailure080   hadoop.hdfs.server.namenode.ha.TestHAAppend   hadoop.fs.TestSymlinkHdfsFileContext   hadoop.hdfs.qjournal.TestSecureNNWithQJM   hadoop.hdfs.TestEncryptionZones   hadoop.hdfs.server.blockmanagement.TestComputeInvalidateWork   hadoop.hdfs.server.datanode.TestDirectoryScanner JDK v1.7.0_91 Timed out junit tests org.apache.hadoop.hdfs.server.blockmanagement.TestOverReplicatedBlocks   org.apache.hadoop.hdfs.TestReadStripedFileWithDecoding   org.apache.hadoop.hdfs.server.blockmanagement.TestOverReplicatedBlocks   org.apache.hadoop.hdfs.TestReadStripedFileWithDecoding Subsystem Report/Notes Docker Image:yetus/hadoop:0ca8df7 JIRA Patch URL https://issues.apache.org/jira/secure/attachment/12785171/HDFS-9686.1.patch JIRA Issue HDFS-9686 Optional Tests asflicense compile javac javadoc mvninstall mvnsite unit findbugs checkstyle uname Linux 2a6efb06a265 3.13.0-36-lowlatency #63-Ubuntu SMP PREEMPT Wed Sep 3 21:56:12 UTC 2014 x86_64 x86_64 x86_64 GNU/Linux Build tool maven Personality /testptch/hadoop/patchprocess/precommit/personality/provided.sh git revision trunk / a277bdc Default Java 1.7.0_91 Multi-JDK versions /usr/lib/jvm/java-8-oracle:1.8.0_66 /usr/lib/jvm/java-7-openjdk-amd64:1.7.0_91 findbugs v3.0.0 unit https://builds.apache.org/job/PreCommit-HDFS-Build/14289/artifact/patchprocess/patch-unit-hadoop-hdfs-project_hadoop-hdfs-jdk1.8.0_66.txt unit https://builds.apache.org/job/PreCommit-HDFS-Build/14289/artifact/patchprocess/patch-unit-hadoop-hdfs-project_hadoop-hdfs-jdk1.8.0_66.txt unit https://builds.apache.org/job/PreCommit-HDFS-Build/14289/artifact/patchprocess/patch-unit-hadoop-hdfs-project_hadoop-hdfs-jdk1.7.0_91.txt unit https://builds.apache.org/job/PreCommit-HDFS-Build/14289/artifact/patchprocess/patch-unit-hadoop-hdfs-project_hadoop-hdfs-jdk1.7.0_91.txt unit test logs https://builds.apache.org/job/PreCommit-HDFS-Build/14289/artifact/patchprocess/patch-unit-hadoop-hdfs-project_hadoop-hdfs-jdk1.8.0_66.txt https://builds.apache.org/job/PreCommit-HDFS-Build/14289/artifact/patchprocess/patch-unit-hadoop-hdfs-project_hadoop-hdfs-jdk1.8.0_66.txt https://builds.apache.org/job/PreCommit-HDFS-Build/14289/artifact/patchprocess/patch-unit-hadoop-hdfs-project_hadoop-hdfs-jdk1.7.0_91.txt https://builds.apache.org/job/PreCommit-HDFS-Build/14289/artifact/patchprocess/patch-unit-hadoop-hdfs-project_hadoop-hdfs-jdk1.7.0_91.txt JDK v1.7.0_91 Test Results https://builds.apache.org/job/PreCommit-HDFS-Build/14289/testReport/ modules C: hadoop-hdfs-project/hadoop-hdfs hadoop-hdfs-project/hadoop-hdfs-httpfs U: hadoop-hdfs-project Max memory used 76MB Powered by Apache Yetus 0.2.0-SNAPSHOT http://yetus.apache.org Console output https://builds.apache.org/job/PreCommit-HDFS-Build/14289/console This message was automatically generated.
        Hide
        sarutak Kousuke Saruta added a comment -

        Updated the patch.

        Show
        sarutak Kousuke Saruta added a comment - Updated the patch.
        Hide
        ajisakaa Akira Ajisaka added a comment -

        The patch mostly looks good to me. One minor comment: Please don't remove the following if statement.

        TestShortCircuitLocalRead
        -      conf.setBoolean(HdfsClientConfigKeys.DFS_CLIENT_USE_LEGACY_BLOCKREADERLOCAL, true);
        -    }
        -    if (simulatedStorage) {
        -      SimulatedFSDataset.setFactory(conf);
        +      conf.setBoolean(
        +          HdfsClientConfigKeys.DFS_CLIENT_USE_LEGACY_BLOCKREADERLOCAL, true);
             }
        +    SimulatedFSDataset.setFactory(conf);
        +
        

        I'm +1 if that is addressed.

        Show
        ajisakaa Akira Ajisaka added a comment - The patch mostly looks good to me. One minor comment: Please don't remove the following if statement. TestShortCircuitLocalRead - conf.setBoolean(HdfsClientConfigKeys.DFS_CLIENT_USE_LEGACY_BLOCKREADERLOCAL, true ); - } - if (simulatedStorage) { - SimulatedFSDataset.setFactory(conf); + conf.setBoolean( + HdfsClientConfigKeys.DFS_CLIENT_USE_LEGACY_BLOCKREADERLOCAL, true ); } + SimulatedFSDataset.setFactory(conf); + I'm +1 if that is addressed.
        Hide
        hadoopqa Hadoop QA added a comment -
        -1 overall



        Vote Subsystem Runtime Comment
        0 reexec 0m 0s Docker mode activated.
        +1 @author 0m 0s The patch does not contain any @author tags.
        +1 test4tests 0m 0s The patch appears to include 2 new or modified test files.
        0 mvndep 0m 24s Maven dependency ordering for branch
        +1 mvninstall 10m 43s trunk passed
        +1 compile 2m 19s trunk passed with JDK v1.8.0_66
        +1 compile 2m 2s trunk passed with JDK v1.7.0_91
        +1 checkstyle 0m 42s trunk passed
        +1 mvnsite 2m 27s trunk passed
        +1 mvneclipse 0m 38s trunk passed
        +1 findbugs 5m 10s trunk passed
        +1 javadoc 3m 22s trunk passed with JDK v1.8.0_66
        +1 javadoc 5m 12s trunk passed with JDK v1.7.0_91
        0 mvndep 0m 22s Maven dependency ordering for patch
        +1 mvninstall 2m 10s the patch passed
        +1 compile 2m 18s the patch passed with JDK v1.8.0_66
        +1 javac 2m 18s the patch passed
        +1 compile 1m 57s the patch passed with JDK v1.7.0_91
        +1 javac 1m 57s the patch passed
        +1 checkstyle 0m 38s hadoop-hdfs-project: patch generated 0 new + 359 unchanged - 11 fixed = 359 total (was 370)
        +1 mvnsite 2m 19s the patch passed
        +1 mvneclipse 0m 32s the patch passed
        +1 whitespace 0m 0s Patch has no whitespace issues.
        +1 findbugs 5m 33s the patch passed
        +1 javadoc 3m 13s the patch passed with JDK v1.8.0_66
        +1 javadoc 5m 10s the patch passed with JDK v1.7.0_91
        -1 unit 83m 58s hadoop-hdfs in the patch failed with JDK v1.8.0_66.
        -1 unit 83m 48s hadoop-hdfs in the patch failed with JDK v1.8.0_66.
        -1 unit 77m 29s hadoop-hdfs in the patch failed with JDK v1.7.0_91.
        -1 unit 80m 28s hadoop-hdfs in the patch failed with JDK v1.7.0_91.
        +1 asflicense 0m 31s Patch does not generate ASF License warnings.
        387m 15s



        Reason Tests
        JDK v1.8.0_66 Failed junit tests hadoop.hdfs.server.datanode.TestDataNodeMetrics
          hadoop.hdfs.server.namenode.ha.TestHAFsck
          hadoop.hdfs.shortcircuit.TestShortCircuitLocalRead
          hadoop.hdfs.TestFileAppend
          hadoop.hdfs.TestDFSUpgradeFromImage
          hadoop.hdfs.server.datanode.TestBlockScanner
          hadoop.hdfs.server.datanode.TestDirectoryScanner
          hadoop.hdfs.security.TestDelegationTokenForProxyUser
          hadoop.hdfs.server.datanode.TestDataNodeMetrics
          hadoop.hdfs.server.namenode.ha.TestHAFsck
          hadoop.hdfs.shortcircuit.TestShortCircuitLocalRead
          hadoop.hdfs.TestFileAppend
          hadoop.hdfs.TestDFSUpgradeFromImage
          hadoop.hdfs.server.datanode.TestBlockScanner
          hadoop.hdfs.server.datanode.TestDirectoryScanner
          hadoop.hdfs.security.TestDelegationTokenForProxyUser
        JDK v1.7.0_91 Failed junit tests hadoop.hdfs.shortcircuit.TestShortCircuitCache
          hadoop.hdfs.shortcircuit.TestShortCircuitLocalRead
          hadoop.hdfs.TestRecoverStripedFile
          hadoop.hdfs.server.datanode.TestBlockScanner
          hadoop.hdfs.server.datanode.TestDirectoryScanner
          hadoop.fs.TestSymlinkHdfsFileContext
          hadoop.hdfs.security.TestDelegationTokenForProxyUser
          hadoop.hdfs.shortcircuit.TestShortCircuitCache
          hadoop.hdfs.shortcircuit.TestShortCircuitLocalRead
          hadoop.hdfs.TestRecoverStripedFile
          hadoop.hdfs.server.datanode.TestBlockScanner
          hadoop.hdfs.server.datanode.TestDirectoryScanner
          hadoop.fs.TestSymlinkHdfsFileContext
          hadoop.hdfs.security.TestDelegationTokenForProxyUser



        Subsystem Report/Notes
        Docker Image:yetus/hadoop:0ca8df7
        JIRA Patch URL https://issues.apache.org/jira/secure/attachment/12784691/HDFS-9686.0.patch
        JIRA Issue HDFS-9686
        Optional Tests asflicense compile javac javadoc mvninstall mvnsite unit findbugs checkstyle
        uname Linux a612f3349b23 3.13.0-36-lowlatency #63-Ubuntu SMP PREEMPT Wed Sep 3 21:56:12 UTC 2014 x86_64 x86_64 x86_64 GNU/Linux
        Build tool maven
        Personality /testptch/hadoop/patchprocess/precommit/personality/provided.sh
        git revision trunk / 97056c3
        Default Java 1.7.0_91
        Multi-JDK versions /usr/lib/jvm/java-8-oracle:1.8.0_66 /usr/lib/jvm/java-7-openjdk-amd64:1.7.0_91
        findbugs v3.0.0
        unit https://builds.apache.org/job/PreCommit-HDFS-Build/14264/artifact/patchprocess/patch-unit-hadoop-hdfs-project_hadoop-hdfs-jdk1.8.0_66.txt
        unit https://builds.apache.org/job/PreCommit-HDFS-Build/14264/artifact/patchprocess/patch-unit-hadoop-hdfs-project_hadoop-hdfs-jdk1.8.0_66.txt
        unit https://builds.apache.org/job/PreCommit-HDFS-Build/14264/artifact/patchprocess/patch-unit-hadoop-hdfs-project_hadoop-hdfs-jdk1.7.0_91.txt
        unit https://builds.apache.org/job/PreCommit-HDFS-Build/14264/artifact/patchprocess/patch-unit-hadoop-hdfs-project_hadoop-hdfs-jdk1.7.0_91.txt
        unit test logs https://builds.apache.org/job/PreCommit-HDFS-Build/14264/artifact/patchprocess/patch-unit-hadoop-hdfs-project_hadoop-hdfs-jdk1.8.0_66.txt https://builds.apache.org/job/PreCommit-HDFS-Build/14264/artifact/patchprocess/patch-unit-hadoop-hdfs-project_hadoop-hdfs-jdk1.8.0_66.txt https://builds.apache.org/job/PreCommit-HDFS-Build/14264/artifact/patchprocess/patch-unit-hadoop-hdfs-project_hadoop-hdfs-jdk1.7.0_91.txt https://builds.apache.org/job/PreCommit-HDFS-Build/14264/artifact/patchprocess/patch-unit-hadoop-hdfs-project_hadoop-hdfs-jdk1.7.0_91.txt
        JDK v1.7.0_91 Test Results https://builds.apache.org/job/PreCommit-HDFS-Build/14264/testReport/
        modules C: hadoop-hdfs-project/hadoop-hdfs hadoop-hdfs-project/hadoop-hdfs-httpfs U: hadoop-hdfs-project
        Max memory used 77MB
        Powered by Apache Yetus 0.2.0-SNAPSHOT http://yetus.apache.org
        Console output https://builds.apache.org/job/PreCommit-HDFS-Build/14264/console

        This message was automatically generated.

        Show
        hadoopqa Hadoop QA added a comment - -1 overall Vote Subsystem Runtime Comment 0 reexec 0m 0s Docker mode activated. +1 @author 0m 0s The patch does not contain any @author tags. +1 test4tests 0m 0s The patch appears to include 2 new or modified test files. 0 mvndep 0m 24s Maven dependency ordering for branch +1 mvninstall 10m 43s trunk passed +1 compile 2m 19s trunk passed with JDK v1.8.0_66 +1 compile 2m 2s trunk passed with JDK v1.7.0_91 +1 checkstyle 0m 42s trunk passed +1 mvnsite 2m 27s trunk passed +1 mvneclipse 0m 38s trunk passed +1 findbugs 5m 10s trunk passed +1 javadoc 3m 22s trunk passed with JDK v1.8.0_66 +1 javadoc 5m 12s trunk passed with JDK v1.7.0_91 0 mvndep 0m 22s Maven dependency ordering for patch +1 mvninstall 2m 10s the patch passed +1 compile 2m 18s the patch passed with JDK v1.8.0_66 +1 javac 2m 18s the patch passed +1 compile 1m 57s the patch passed with JDK v1.7.0_91 +1 javac 1m 57s the patch passed +1 checkstyle 0m 38s hadoop-hdfs-project: patch generated 0 new + 359 unchanged - 11 fixed = 359 total (was 370) +1 mvnsite 2m 19s the patch passed +1 mvneclipse 0m 32s the patch passed +1 whitespace 0m 0s Patch has no whitespace issues. +1 findbugs 5m 33s the patch passed +1 javadoc 3m 13s the patch passed with JDK v1.8.0_66 +1 javadoc 5m 10s the patch passed with JDK v1.7.0_91 -1 unit 83m 58s hadoop-hdfs in the patch failed with JDK v1.8.0_66. -1 unit 83m 48s hadoop-hdfs in the patch failed with JDK v1.8.0_66. -1 unit 77m 29s hadoop-hdfs in the patch failed with JDK v1.7.0_91. -1 unit 80m 28s hadoop-hdfs in the patch failed with JDK v1.7.0_91. +1 asflicense 0m 31s Patch does not generate ASF License warnings. 387m 15s Reason Tests JDK v1.8.0_66 Failed junit tests hadoop.hdfs.server.datanode.TestDataNodeMetrics   hadoop.hdfs.server.namenode.ha.TestHAFsck   hadoop.hdfs.shortcircuit.TestShortCircuitLocalRead   hadoop.hdfs.TestFileAppend   hadoop.hdfs.TestDFSUpgradeFromImage   hadoop.hdfs.server.datanode.TestBlockScanner   hadoop.hdfs.server.datanode.TestDirectoryScanner   hadoop.hdfs.security.TestDelegationTokenForProxyUser   hadoop.hdfs.server.datanode.TestDataNodeMetrics   hadoop.hdfs.server.namenode.ha.TestHAFsck   hadoop.hdfs.shortcircuit.TestShortCircuitLocalRead   hadoop.hdfs.TestFileAppend   hadoop.hdfs.TestDFSUpgradeFromImage   hadoop.hdfs.server.datanode.TestBlockScanner   hadoop.hdfs.server.datanode.TestDirectoryScanner   hadoop.hdfs.security.TestDelegationTokenForProxyUser JDK v1.7.0_91 Failed junit tests hadoop.hdfs.shortcircuit.TestShortCircuitCache   hadoop.hdfs.shortcircuit.TestShortCircuitLocalRead   hadoop.hdfs.TestRecoverStripedFile   hadoop.hdfs.server.datanode.TestBlockScanner   hadoop.hdfs.server.datanode.TestDirectoryScanner   hadoop.fs.TestSymlinkHdfsFileContext   hadoop.hdfs.security.TestDelegationTokenForProxyUser   hadoop.hdfs.shortcircuit.TestShortCircuitCache   hadoop.hdfs.shortcircuit.TestShortCircuitLocalRead   hadoop.hdfs.TestRecoverStripedFile   hadoop.hdfs.server.datanode.TestBlockScanner   hadoop.hdfs.server.datanode.TestDirectoryScanner   hadoop.fs.TestSymlinkHdfsFileContext   hadoop.hdfs.security.TestDelegationTokenForProxyUser Subsystem Report/Notes Docker Image:yetus/hadoop:0ca8df7 JIRA Patch URL https://issues.apache.org/jira/secure/attachment/12784691/HDFS-9686.0.patch JIRA Issue HDFS-9686 Optional Tests asflicense compile javac javadoc mvninstall mvnsite unit findbugs checkstyle uname Linux a612f3349b23 3.13.0-36-lowlatency #63-Ubuntu SMP PREEMPT Wed Sep 3 21:56:12 UTC 2014 x86_64 x86_64 x86_64 GNU/Linux Build tool maven Personality /testptch/hadoop/patchprocess/precommit/personality/provided.sh git revision trunk / 97056c3 Default Java 1.7.0_91 Multi-JDK versions /usr/lib/jvm/java-8-oracle:1.8.0_66 /usr/lib/jvm/java-7-openjdk-amd64:1.7.0_91 findbugs v3.0.0 unit https://builds.apache.org/job/PreCommit-HDFS-Build/14264/artifact/patchprocess/patch-unit-hadoop-hdfs-project_hadoop-hdfs-jdk1.8.0_66.txt unit https://builds.apache.org/job/PreCommit-HDFS-Build/14264/artifact/patchprocess/patch-unit-hadoop-hdfs-project_hadoop-hdfs-jdk1.8.0_66.txt unit https://builds.apache.org/job/PreCommit-HDFS-Build/14264/artifact/patchprocess/patch-unit-hadoop-hdfs-project_hadoop-hdfs-jdk1.7.0_91.txt unit https://builds.apache.org/job/PreCommit-HDFS-Build/14264/artifact/patchprocess/patch-unit-hadoop-hdfs-project_hadoop-hdfs-jdk1.7.0_91.txt unit test logs https://builds.apache.org/job/PreCommit-HDFS-Build/14264/artifact/patchprocess/patch-unit-hadoop-hdfs-project_hadoop-hdfs-jdk1.8.0_66.txt https://builds.apache.org/job/PreCommit-HDFS-Build/14264/artifact/patchprocess/patch-unit-hadoop-hdfs-project_hadoop-hdfs-jdk1.8.0_66.txt https://builds.apache.org/job/PreCommit-HDFS-Build/14264/artifact/patchprocess/patch-unit-hadoop-hdfs-project_hadoop-hdfs-jdk1.7.0_91.txt https://builds.apache.org/job/PreCommit-HDFS-Build/14264/artifact/patchprocess/patch-unit-hadoop-hdfs-project_hadoop-hdfs-jdk1.7.0_91.txt JDK v1.7.0_91 Test Results https://builds.apache.org/job/PreCommit-HDFS-Build/14264/testReport/ modules C: hadoop-hdfs-project/hadoop-hdfs hadoop-hdfs-project/hadoop-hdfs-httpfs U: hadoop-hdfs-project Max memory used 77MB Powered by Apache Yetus 0.2.0-SNAPSHOT http://yetus.apache.org Console output https://builds.apache.org/job/PreCommit-HDFS-Build/14264/console This message was automatically generated.
        Hide
        sarutak Kousuke Saruta added a comment -

        Fixed style.

        Show
        sarutak Kousuke Saruta added a comment - Fixed style.
        Hide
        hadoopqa Hadoop QA added a comment -
        -1 overall



        Vote Subsystem Runtime Comment
        0 reexec 0m 0s Docker mode activated.
        0 patch 0m 10s The patch file was not named according to hadoop's naming conventions. Please see https://wiki.apache.org/hadoop/HowToContribute for instructions.
        +1 @author 0m 0s The patch does not contain any @author tags.
        +1 test4tests 0m 0s The patch appears to include 2 new or modified test files.
        0 mvndep 0m 20s Maven dependency ordering for branch
        +1 mvninstall 10m 13s trunk passed
        +1 compile 2m 32s trunk passed with JDK v1.8.0_66
        +1 compile 1m 56s trunk passed with JDK v1.7.0_91
        +1 checkstyle 0m 32s trunk passed
        +1 mvnsite 2m 16s trunk passed
        +1 mvneclipse 0m 30s trunk passed
        +1 findbugs 4m 52s trunk passed
        +1 javadoc 3m 15s trunk passed with JDK v1.8.0_66
        +1 javadoc 5m 25s trunk passed with JDK v1.7.0_91
        0 mvndep 0m 27s Maven dependency ordering for patch
        +1 mvninstall 2m 39s the patch passed
        +1 compile 3m 14s the patch passed with JDK v1.8.0_66
        +1 javac 3m 14s the patch passed
        +1 compile 2m 14s the patch passed with JDK v1.7.0_91
        +1 javac 2m 14s the patch passed
        +1 checkstyle 0m 37s hadoop-hdfs-project: patch generated 0 new + 369 unchanged - 1 fixed = 369 total (was 370)
        +1 mvnsite 2m 37s the patch passed
        +1 mvneclipse 0m 40s the patch passed
        +1 whitespace 0m 0s Patch has no whitespace issues.
        +1 findbugs 6m 32s the patch passed
        +1 javadoc 3m 41s the patch passed with JDK v1.8.0_66
        +1 javadoc 4m 48s the patch passed with JDK v1.7.0_91
        -1 unit 115m 49s hadoop-hdfs in the patch failed with JDK v1.8.0_66.
        -1 unit 113m 56s hadoop-hdfs in the patch failed with JDK v1.8.0_66.
        -1 unit 94m 9s hadoop-hdfs in the patch failed with JDK v1.7.0_91.
        -1 unit 118m 51s hadoop-hdfs in the patch failed with JDK v1.7.0_91.
        +1 asflicense 0m 41s Patch does not generate ASF License warnings.
        506m 46s



        Reason Tests
        JDK v1.8.0_66 Failed junit tests hadoop.hdfs.TestDFSUpgradeFromImage
          hadoop.hdfs.server.datanode.TestBlockScanner
          hadoop.hdfs.server.namenode.ha.TestEditLogTailer
          hadoop.hdfs.security.TestDelegationTokenForProxyUser
          hadoop.hdfs.server.datanode.TestDataNodeVolumeFailure
          hadoop.hdfs.TestSafeModeWithStripedFile
          hadoop.hdfs.tools.TestDFSAdminWithHA
          hadoop.hdfs.server.datanode.TestBlockReplacement
          hadoop.hdfs.TestEncryptionZones
          hadoop.hdfs.server.datanode.TestDirectoryScanner
          hadoop.hdfs.TestDFSUpgradeFromImage
          hadoop.hdfs.server.datanode.TestBlockScanner
          hadoop.hdfs.server.namenode.ha.TestEditLogTailer
          hadoop.hdfs.security.TestDelegationTokenForProxyUser
          hadoop.hdfs.server.datanode.TestDataNodeVolumeFailure
          hadoop.hdfs.TestSafeModeWithStripedFile
          hadoop.hdfs.tools.TestDFSAdminWithHA
          hadoop.hdfs.server.datanode.TestBlockReplacement
          hadoop.hdfs.TestEncryptionZones
          hadoop.hdfs.server.datanode.TestDirectoryScanner
        JDK v1.7.0_91 Failed junit tests hadoop.hdfs.server.datanode.TestBlockScanner
          hadoop.hdfs.server.namenode.ha.TestEditLogTailer
          hadoop.hdfs.TestRecoverStripedFile
          hadoop.hdfs.security.TestDelegationTokenForProxyUser
          hadoop.hdfs.server.datanode.TestDataNodeVolumeFailure
          hadoop.hdfs.server.namenode.ha.TestStandbyCheckpoints
          hadoop.hdfs.server.datanode.TestBlockReplacement
          hadoop.hdfs.server.namenode.TestNamenodeCapacityReport
          hadoop.hdfs.server.namenode.TestFileTruncate
          hadoop.hdfs.TestEncryptionZones
          hadoop.hdfs.TestDFSClientRetries
          hadoop.hdfs.server.datanode.TestDirectoryScanner
          hadoop.hdfs.server.datanode.TestBlockScanner
          hadoop.hdfs.server.namenode.ha.TestEditLogTailer
          hadoop.hdfs.TestRecoverStripedFile
          hadoop.hdfs.security.TestDelegationTokenForProxyUser
          hadoop.hdfs.server.datanode.TestDataNodeVolumeFailure
          hadoop.hdfs.server.namenode.ha.TestStandbyCheckpoints
          hadoop.hdfs.server.datanode.TestBlockReplacement
          hadoop.hdfs.server.namenode.TestNamenodeCapacityReport
          hadoop.hdfs.server.namenode.TestFileTruncate
          hadoop.hdfs.TestEncryptionZones
          hadoop.hdfs.TestDFSClientRetries
          hadoop.hdfs.server.datanode.TestDirectoryScanner



        Subsystem Report/Notes
        Docker Image:yetus/hadoop:0ca8df7
        JIRA Patch URL https://issues.apache.org/jira/secure/attachment/12783997/HDFS-9686.patch.0
        JIRA Issue HDFS-9686
        Optional Tests asflicense compile javac javadoc mvninstall mvnsite unit findbugs checkstyle
        uname Linux 8743487a1150 3.13.0-36-lowlatency #63-Ubuntu SMP PREEMPT Wed Sep 3 21:56:12 UTC 2014 x86_64 x86_64 x86_64 GNU/Linux
        Build tool maven
        Personality /testptch/hadoop/patchprocess/precommit/personality/provided.sh
        git revision trunk / 99829eb
        Default Java 1.7.0_91
        Multi-JDK versions /usr/lib/jvm/java-8-oracle:1.8.0_66 /usr/lib/jvm/java-7-openjdk-amd64:1.7.0_91
        findbugs v3.0.0
        unit https://builds.apache.org/job/PreCommit-HDFS-Build/14226/artifact/patchprocess/patch-unit-hadoop-hdfs-project_hadoop-hdfs-jdk1.8.0_66.txt
        unit https://builds.apache.org/job/PreCommit-HDFS-Build/14226/artifact/patchprocess/patch-unit-hadoop-hdfs-project_hadoop-hdfs-jdk1.8.0_66.txt
        unit https://builds.apache.org/job/PreCommit-HDFS-Build/14226/artifact/patchprocess/patch-unit-hadoop-hdfs-project_hadoop-hdfs-jdk1.7.0_91.txt
        unit https://builds.apache.org/job/PreCommit-HDFS-Build/14226/artifact/patchprocess/patch-unit-hadoop-hdfs-project_hadoop-hdfs-jdk1.7.0_91.txt
        unit test logs https://builds.apache.org/job/PreCommit-HDFS-Build/14226/artifact/patchprocess/patch-unit-hadoop-hdfs-project_hadoop-hdfs-jdk1.8.0_66.txt https://builds.apache.org/job/PreCommit-HDFS-Build/14226/artifact/patchprocess/patch-unit-hadoop-hdfs-project_hadoop-hdfs-jdk1.8.0_66.txt https://builds.apache.org/job/PreCommit-HDFS-Build/14226/artifact/patchprocess/patch-unit-hadoop-hdfs-project_hadoop-hdfs-jdk1.7.0_91.txt https://builds.apache.org/job/PreCommit-HDFS-Build/14226/artifact/patchprocess/patch-unit-hadoop-hdfs-project_hadoop-hdfs-jdk1.7.0_91.txt
        JDK v1.7.0_91 Test Results https://builds.apache.org/job/PreCommit-HDFS-Build/14226/testReport/
        modules C: hadoop-hdfs-project/hadoop-hdfs hadoop-hdfs-project/hadoop-hdfs-httpfs U: hadoop-hdfs-project
        Max memory used 76MB
        Powered by Apache Yetus 0.2.0-SNAPSHOT http://yetus.apache.org
        Console output https://builds.apache.org/job/PreCommit-HDFS-Build/14226/console

        This message was automatically generated.

        Show
        hadoopqa Hadoop QA added a comment - -1 overall Vote Subsystem Runtime Comment 0 reexec 0m 0s Docker mode activated. 0 patch 0m 10s The patch file was not named according to hadoop's naming conventions. Please see https://wiki.apache.org/hadoop/HowToContribute for instructions. +1 @author 0m 0s The patch does not contain any @author tags. +1 test4tests 0m 0s The patch appears to include 2 new or modified test files. 0 mvndep 0m 20s Maven dependency ordering for branch +1 mvninstall 10m 13s trunk passed +1 compile 2m 32s trunk passed with JDK v1.8.0_66 +1 compile 1m 56s trunk passed with JDK v1.7.0_91 +1 checkstyle 0m 32s trunk passed +1 mvnsite 2m 16s trunk passed +1 mvneclipse 0m 30s trunk passed +1 findbugs 4m 52s trunk passed +1 javadoc 3m 15s trunk passed with JDK v1.8.0_66 +1 javadoc 5m 25s trunk passed with JDK v1.7.0_91 0 mvndep 0m 27s Maven dependency ordering for patch +1 mvninstall 2m 39s the patch passed +1 compile 3m 14s the patch passed with JDK v1.8.0_66 +1 javac 3m 14s the patch passed +1 compile 2m 14s the patch passed with JDK v1.7.0_91 +1 javac 2m 14s the patch passed +1 checkstyle 0m 37s hadoop-hdfs-project: patch generated 0 new + 369 unchanged - 1 fixed = 369 total (was 370) +1 mvnsite 2m 37s the patch passed +1 mvneclipse 0m 40s the patch passed +1 whitespace 0m 0s Patch has no whitespace issues. +1 findbugs 6m 32s the patch passed +1 javadoc 3m 41s the patch passed with JDK v1.8.0_66 +1 javadoc 4m 48s the patch passed with JDK v1.7.0_91 -1 unit 115m 49s hadoop-hdfs in the patch failed with JDK v1.8.0_66. -1 unit 113m 56s hadoop-hdfs in the patch failed with JDK v1.8.0_66. -1 unit 94m 9s hadoop-hdfs in the patch failed with JDK v1.7.0_91. -1 unit 118m 51s hadoop-hdfs in the patch failed with JDK v1.7.0_91. +1 asflicense 0m 41s Patch does not generate ASF License warnings. 506m 46s Reason Tests JDK v1.8.0_66 Failed junit tests hadoop.hdfs.TestDFSUpgradeFromImage   hadoop.hdfs.server.datanode.TestBlockScanner   hadoop.hdfs.server.namenode.ha.TestEditLogTailer   hadoop.hdfs.security.TestDelegationTokenForProxyUser   hadoop.hdfs.server.datanode.TestDataNodeVolumeFailure   hadoop.hdfs.TestSafeModeWithStripedFile   hadoop.hdfs.tools.TestDFSAdminWithHA   hadoop.hdfs.server.datanode.TestBlockReplacement   hadoop.hdfs.TestEncryptionZones   hadoop.hdfs.server.datanode.TestDirectoryScanner   hadoop.hdfs.TestDFSUpgradeFromImage   hadoop.hdfs.server.datanode.TestBlockScanner   hadoop.hdfs.server.namenode.ha.TestEditLogTailer   hadoop.hdfs.security.TestDelegationTokenForProxyUser   hadoop.hdfs.server.datanode.TestDataNodeVolumeFailure   hadoop.hdfs.TestSafeModeWithStripedFile   hadoop.hdfs.tools.TestDFSAdminWithHA   hadoop.hdfs.server.datanode.TestBlockReplacement   hadoop.hdfs.TestEncryptionZones   hadoop.hdfs.server.datanode.TestDirectoryScanner JDK v1.7.0_91 Failed junit tests hadoop.hdfs.server.datanode.TestBlockScanner   hadoop.hdfs.server.namenode.ha.TestEditLogTailer   hadoop.hdfs.TestRecoverStripedFile   hadoop.hdfs.security.TestDelegationTokenForProxyUser   hadoop.hdfs.server.datanode.TestDataNodeVolumeFailure   hadoop.hdfs.server.namenode.ha.TestStandbyCheckpoints   hadoop.hdfs.server.datanode.TestBlockReplacement   hadoop.hdfs.server.namenode.TestNamenodeCapacityReport   hadoop.hdfs.server.namenode.TestFileTruncate   hadoop.hdfs.TestEncryptionZones   hadoop.hdfs.TestDFSClientRetries   hadoop.hdfs.server.datanode.TestDirectoryScanner   hadoop.hdfs.server.datanode.TestBlockScanner   hadoop.hdfs.server.namenode.ha.TestEditLogTailer   hadoop.hdfs.TestRecoverStripedFile   hadoop.hdfs.security.TestDelegationTokenForProxyUser   hadoop.hdfs.server.datanode.TestDataNodeVolumeFailure   hadoop.hdfs.server.namenode.ha.TestStandbyCheckpoints   hadoop.hdfs.server.datanode.TestBlockReplacement   hadoop.hdfs.server.namenode.TestNamenodeCapacityReport   hadoop.hdfs.server.namenode.TestFileTruncate   hadoop.hdfs.TestEncryptionZones   hadoop.hdfs.TestDFSClientRetries   hadoop.hdfs.server.datanode.TestDirectoryScanner Subsystem Report/Notes Docker Image:yetus/hadoop:0ca8df7 JIRA Patch URL https://issues.apache.org/jira/secure/attachment/12783997/HDFS-9686.patch.0 JIRA Issue HDFS-9686 Optional Tests asflicense compile javac javadoc mvninstall mvnsite unit findbugs checkstyle uname Linux 8743487a1150 3.13.0-36-lowlatency #63-Ubuntu SMP PREEMPT Wed Sep 3 21:56:12 UTC 2014 x86_64 x86_64 x86_64 GNU/Linux Build tool maven Personality /testptch/hadoop/patchprocess/precommit/personality/provided.sh git revision trunk / 99829eb Default Java 1.7.0_91 Multi-JDK versions /usr/lib/jvm/java-8-oracle:1.8.0_66 /usr/lib/jvm/java-7-openjdk-amd64:1.7.0_91 findbugs v3.0.0 unit https://builds.apache.org/job/PreCommit-HDFS-Build/14226/artifact/patchprocess/patch-unit-hadoop-hdfs-project_hadoop-hdfs-jdk1.8.0_66.txt unit https://builds.apache.org/job/PreCommit-HDFS-Build/14226/artifact/patchprocess/patch-unit-hadoop-hdfs-project_hadoop-hdfs-jdk1.8.0_66.txt unit https://builds.apache.org/job/PreCommit-HDFS-Build/14226/artifact/patchprocess/patch-unit-hadoop-hdfs-project_hadoop-hdfs-jdk1.7.0_91.txt unit https://builds.apache.org/job/PreCommit-HDFS-Build/14226/artifact/patchprocess/patch-unit-hadoop-hdfs-project_hadoop-hdfs-jdk1.7.0_91.txt unit test logs https://builds.apache.org/job/PreCommit-HDFS-Build/14226/artifact/patchprocess/patch-unit-hadoop-hdfs-project_hadoop-hdfs-jdk1.8.0_66.txt https://builds.apache.org/job/PreCommit-HDFS-Build/14226/artifact/patchprocess/patch-unit-hadoop-hdfs-project_hadoop-hdfs-jdk1.8.0_66.txt https://builds.apache.org/job/PreCommit-HDFS-Build/14226/artifact/patchprocess/patch-unit-hadoop-hdfs-project_hadoop-hdfs-jdk1.7.0_91.txt https://builds.apache.org/job/PreCommit-HDFS-Build/14226/artifact/patchprocess/patch-unit-hadoop-hdfs-project_hadoop-hdfs-jdk1.7.0_91.txt JDK v1.7.0_91 Test Results https://builds.apache.org/job/PreCommit-HDFS-Build/14226/testReport/ modules C: hadoop-hdfs-project/hadoop-hdfs hadoop-hdfs-project/hadoop-hdfs-httpfs U: hadoop-hdfs-project Max memory used 76MB Powered by Apache Yetus 0.2.0-SNAPSHOT http://yetus.apache.org Console output https://builds.apache.org/job/PreCommit-HDFS-Build/14226/console This message was automatically generated.
        Hide
        hadoopqa Hadoop QA added a comment -
        -1 overall



        Vote Subsystem Runtime Comment
        0 reexec 0m 0s Docker mode activated.
        0 patch 0m 8s The patch file was not named according to hadoop's naming conventions. Please see https://wiki.apache.org/hadoop/HowToContribute for instructions.
        +1 @author 0m 0s The patch does not contain any @author tags.
        +1 test4tests 0m 0s The patch appears to include 2 new or modified test files.
        0 mvndep 0m 18s Maven dependency ordering for branch
        +1 mvninstall 10m 22s trunk passed
        +1 compile 2m 53s trunk passed with JDK v1.8.0_66
        +1 compile 2m 33s trunk passed with JDK v1.7.0_91
        +1 checkstyle 0m 43s trunk passed
        +1 mvnsite 3m 2s trunk passed
        +1 mvneclipse 0m 35s trunk passed
        +1 findbugs 5m 35s trunk passed
        +1 javadoc 4m 7s trunk passed with JDK v1.8.0_66
        +1 javadoc 5m 53s trunk passed with JDK v1.7.0_91
        0 mvndep 0m 20s Maven dependency ordering for patch
        -1 mvninstall 0m 36s hadoop-hdfs in the patch failed.
        -1 mvninstall 0m 35s hadoop-hdfs in the patch failed.
        -1 compile 1m 16s hadoop-hdfs-project in the patch failed with JDK v1.8.0_66.
        -1 javac 1m 16s hadoop-hdfs-project in the patch failed with JDK v1.8.0_66.
        -1 compile 1m 0s hadoop-hdfs-project in the patch failed with JDK v1.7.0_91.
        -1 javac 1m 0s hadoop-hdfs-project in the patch failed with JDK v1.7.0_91.
        -1 checkstyle 0m 33s hadoop-hdfs-project: patch generated 1 new + 369 unchanged - 1 fixed = 370 total (was 370)
        -1 mvnsite 0m 37s hadoop-hdfs in the patch failed.
        -1 mvnsite 0m 37s hadoop-hdfs in the patch failed.
        +1 mvneclipse 0m 30s the patch passed
        +1 whitespace 0m 0s Patch has no whitespace issues.
        -1 findbugs 0m 34s hadoop-hdfs in the patch failed.
        -1 findbugs 0m 34s hadoop-hdfs in the patch failed.
        +1 javadoc 3m 9s the patch passed with JDK v1.8.0_66
        +1 javadoc 5m 53s the patch passed with JDK v1.7.0_91
        -1 unit 1m 8s hadoop-hdfs in the patch failed with JDK v1.8.0_66.
        -1 unit 1m 12s hadoop-hdfs in the patch failed with JDK v1.8.0_66.
        -1 unit 0m 52s hadoop-hdfs in the patch failed with JDK v1.7.0_91.
        -1 unit 0m 54s hadoop-hdfs in the patch failed with JDK v1.7.0_91.
        +1 asflicense 0m 32s Patch does not generate ASF License warnings.
        60m 57s



        Subsystem Report/Notes
        Docker Image:yetus/hadoop:0ca8df7
        JIRA Patch URL https://issues.apache.org/jira/secure/attachment/12783992/HDFS-9686.patch.0
        JIRA Issue HDFS-9686
        Optional Tests asflicense compile javac javadoc mvninstall mvnsite unit findbugs checkstyle
        uname Linux 03a81642c27d 3.13.0-36-lowlatency #63-Ubuntu SMP PREEMPT Wed Sep 3 21:56:12 UTC 2014 x86_64 x86_64 x86_64 GNU/Linux
        Build tool maven
        Personality /testptch/hadoop/patchprocess/precommit/personality/provided.sh
        git revision trunk / 99829eb
        Default Java 1.7.0_91
        Multi-JDK versions /usr/lib/jvm/java-8-oracle:1.8.0_66 /usr/lib/jvm/java-7-openjdk-amd64:1.7.0_91
        findbugs v3.0.0
        mvninstall https://builds.apache.org/job/PreCommit-HDFS-Build/14224/artifact/patchprocess/patch-mvninstall-hadoop-hdfs-project_hadoop-hdfs.txt
        mvninstall https://builds.apache.org/job/PreCommit-HDFS-Build/14224/artifact/patchprocess/patch-mvninstall-hadoop-hdfs-project_hadoop-hdfs.txt
        compile https://builds.apache.org/job/PreCommit-HDFS-Build/14224/artifact/patchprocess/patch-compile-hadoop-hdfs-project-jdk1.8.0_66.txt
        javac https://builds.apache.org/job/PreCommit-HDFS-Build/14224/artifact/patchprocess/patch-compile-hadoop-hdfs-project-jdk1.8.0_66.txt
        compile https://builds.apache.org/job/PreCommit-HDFS-Build/14224/artifact/patchprocess/patch-compile-hadoop-hdfs-project-jdk1.7.0_91.txt
        javac https://builds.apache.org/job/PreCommit-HDFS-Build/14224/artifact/patchprocess/patch-compile-hadoop-hdfs-project-jdk1.7.0_91.txt
        checkstyle https://builds.apache.org/job/PreCommit-HDFS-Build/14224/artifact/patchprocess/diff-checkstyle-hadoop-hdfs-project.txt
        mvnsite https://builds.apache.org/job/PreCommit-HDFS-Build/14224/artifact/patchprocess/patch-mvnsite-hadoop-hdfs-project_hadoop-hdfs.txt
        mvnsite https://builds.apache.org/job/PreCommit-HDFS-Build/14224/artifact/patchprocess/patch-mvnsite-hadoop-hdfs-project_hadoop-hdfs.txt
        findbugs https://builds.apache.org/job/PreCommit-HDFS-Build/14224/artifact/patchprocess/patch-findbugs-hadoop-hdfs-project_hadoop-hdfs.txt
        findbugs https://builds.apache.org/job/PreCommit-HDFS-Build/14224/artifact/patchprocess/patch-findbugs-hadoop-hdfs-project_hadoop-hdfs.txt
        unit https://builds.apache.org/job/PreCommit-HDFS-Build/14224/artifact/patchprocess/patch-unit-hadoop-hdfs-project_hadoop-hdfs-jdk1.8.0_66.txt
        unit https://builds.apache.org/job/PreCommit-HDFS-Build/14224/artifact/patchprocess/patch-unit-hadoop-hdfs-project_hadoop-hdfs-jdk1.8.0_66.txt
        unit https://builds.apache.org/job/PreCommit-HDFS-Build/14224/artifact/patchprocess/patch-unit-hadoop-hdfs-project_hadoop-hdfs-jdk1.7.0_91.txt
        unit https://builds.apache.org/job/PreCommit-HDFS-Build/14224/artifact/patchprocess/patch-unit-hadoop-hdfs-project_hadoop-hdfs-jdk1.7.0_91.txt
        JDK v1.7.0_91 Test Results https://builds.apache.org/job/PreCommit-HDFS-Build/14224/testReport/
        modules C: hadoop-hdfs-project/hadoop-hdfs hadoop-hdfs-project/hadoop-hdfs-httpfs U: hadoop-hdfs-project
        Max memory used 77MB
        Powered by Apache Yetus 0.2.0-SNAPSHOT http://yetus.apache.org
        Console output https://builds.apache.org/job/PreCommit-HDFS-Build/14224/console

        This message was automatically generated.

        Show
        hadoopqa Hadoop QA added a comment - -1 overall Vote Subsystem Runtime Comment 0 reexec 0m 0s Docker mode activated. 0 patch 0m 8s The patch file was not named according to hadoop's naming conventions. Please see https://wiki.apache.org/hadoop/HowToContribute for instructions. +1 @author 0m 0s The patch does not contain any @author tags. +1 test4tests 0m 0s The patch appears to include 2 new or modified test files. 0 mvndep 0m 18s Maven dependency ordering for branch +1 mvninstall 10m 22s trunk passed +1 compile 2m 53s trunk passed with JDK v1.8.0_66 +1 compile 2m 33s trunk passed with JDK v1.7.0_91 +1 checkstyle 0m 43s trunk passed +1 mvnsite 3m 2s trunk passed +1 mvneclipse 0m 35s trunk passed +1 findbugs 5m 35s trunk passed +1 javadoc 4m 7s trunk passed with JDK v1.8.0_66 +1 javadoc 5m 53s trunk passed with JDK v1.7.0_91 0 mvndep 0m 20s Maven dependency ordering for patch -1 mvninstall 0m 36s hadoop-hdfs in the patch failed. -1 mvninstall 0m 35s hadoop-hdfs in the patch failed. -1 compile 1m 16s hadoop-hdfs-project in the patch failed with JDK v1.8.0_66. -1 javac 1m 16s hadoop-hdfs-project in the patch failed with JDK v1.8.0_66. -1 compile 1m 0s hadoop-hdfs-project in the patch failed with JDK v1.7.0_91. -1 javac 1m 0s hadoop-hdfs-project in the patch failed with JDK v1.7.0_91. -1 checkstyle 0m 33s hadoop-hdfs-project: patch generated 1 new + 369 unchanged - 1 fixed = 370 total (was 370) -1 mvnsite 0m 37s hadoop-hdfs in the patch failed. -1 mvnsite 0m 37s hadoop-hdfs in the patch failed. +1 mvneclipse 0m 30s the patch passed +1 whitespace 0m 0s Patch has no whitespace issues. -1 findbugs 0m 34s hadoop-hdfs in the patch failed. -1 findbugs 0m 34s hadoop-hdfs in the patch failed. +1 javadoc 3m 9s the patch passed with JDK v1.8.0_66 +1 javadoc 5m 53s the patch passed with JDK v1.7.0_91 -1 unit 1m 8s hadoop-hdfs in the patch failed with JDK v1.8.0_66. -1 unit 1m 12s hadoop-hdfs in the patch failed with JDK v1.8.0_66. -1 unit 0m 52s hadoop-hdfs in the patch failed with JDK v1.7.0_91. -1 unit 0m 54s hadoop-hdfs in the patch failed with JDK v1.7.0_91. +1 asflicense 0m 32s Patch does not generate ASF License warnings. 60m 57s Subsystem Report/Notes Docker Image:yetus/hadoop:0ca8df7 JIRA Patch URL https://issues.apache.org/jira/secure/attachment/12783992/HDFS-9686.patch.0 JIRA Issue HDFS-9686 Optional Tests asflicense compile javac javadoc mvninstall mvnsite unit findbugs checkstyle uname Linux 03a81642c27d 3.13.0-36-lowlatency #63-Ubuntu SMP PREEMPT Wed Sep 3 21:56:12 UTC 2014 x86_64 x86_64 x86_64 GNU/Linux Build tool maven Personality /testptch/hadoop/patchprocess/precommit/personality/provided.sh git revision trunk / 99829eb Default Java 1.7.0_91 Multi-JDK versions /usr/lib/jvm/java-8-oracle:1.8.0_66 /usr/lib/jvm/java-7-openjdk-amd64:1.7.0_91 findbugs v3.0.0 mvninstall https://builds.apache.org/job/PreCommit-HDFS-Build/14224/artifact/patchprocess/patch-mvninstall-hadoop-hdfs-project_hadoop-hdfs.txt mvninstall https://builds.apache.org/job/PreCommit-HDFS-Build/14224/artifact/patchprocess/patch-mvninstall-hadoop-hdfs-project_hadoop-hdfs.txt compile https://builds.apache.org/job/PreCommit-HDFS-Build/14224/artifact/patchprocess/patch-compile-hadoop-hdfs-project-jdk1.8.0_66.txt javac https://builds.apache.org/job/PreCommit-HDFS-Build/14224/artifact/patchprocess/patch-compile-hadoop-hdfs-project-jdk1.8.0_66.txt compile https://builds.apache.org/job/PreCommit-HDFS-Build/14224/artifact/patchprocess/patch-compile-hadoop-hdfs-project-jdk1.7.0_91.txt javac https://builds.apache.org/job/PreCommit-HDFS-Build/14224/artifact/patchprocess/patch-compile-hadoop-hdfs-project-jdk1.7.0_91.txt checkstyle https://builds.apache.org/job/PreCommit-HDFS-Build/14224/artifact/patchprocess/diff-checkstyle-hadoop-hdfs-project.txt mvnsite https://builds.apache.org/job/PreCommit-HDFS-Build/14224/artifact/patchprocess/patch-mvnsite-hadoop-hdfs-project_hadoop-hdfs.txt mvnsite https://builds.apache.org/job/PreCommit-HDFS-Build/14224/artifact/patchprocess/patch-mvnsite-hadoop-hdfs-project_hadoop-hdfs.txt findbugs https://builds.apache.org/job/PreCommit-HDFS-Build/14224/artifact/patchprocess/patch-findbugs-hadoop-hdfs-project_hadoop-hdfs.txt findbugs https://builds.apache.org/job/PreCommit-HDFS-Build/14224/artifact/patchprocess/patch-findbugs-hadoop-hdfs-project_hadoop-hdfs.txt unit https://builds.apache.org/job/PreCommit-HDFS-Build/14224/artifact/patchprocess/patch-unit-hadoop-hdfs-project_hadoop-hdfs-jdk1.8.0_66.txt unit https://builds.apache.org/job/PreCommit-HDFS-Build/14224/artifact/patchprocess/patch-unit-hadoop-hdfs-project_hadoop-hdfs-jdk1.8.0_66.txt unit https://builds.apache.org/job/PreCommit-HDFS-Build/14224/artifact/patchprocess/patch-unit-hadoop-hdfs-project_hadoop-hdfs-jdk1.7.0_91.txt unit https://builds.apache.org/job/PreCommit-HDFS-Build/14224/artifact/patchprocess/patch-unit-hadoop-hdfs-project_hadoop-hdfs-jdk1.7.0_91.txt JDK v1.7.0_91 Test Results https://builds.apache.org/job/PreCommit-HDFS-Build/14224/testReport/ modules C: hadoop-hdfs-project/hadoop-hdfs hadoop-hdfs-project/hadoop-hdfs-httpfs U: hadoop-hdfs-project Max memory used 77MB Powered by Apache Yetus 0.2.0-SNAPSHOT http://yetus.apache.org Console output https://builds.apache.org/job/PreCommit-HDFS-Build/14224/console This message was automatically generated.
        Hide
        sarutak Kousuke Saruta added a comment -

        I've fixed the compile error.

        Show
        sarutak Kousuke Saruta added a comment - I've fixed the compile error.
        Hide
        hadoopqa Hadoop QA added a comment -
        -1 overall



        Vote Subsystem Runtime Comment
        0 reexec 0m 0s Docker mode activated.
        0 patch 0m 19s The patch file was not named according to hadoop's naming conventions. Please see https://wiki.apache.org/hadoop/HowToContribute for instructions.
        +1 @author 0m 0s The patch does not contain any @author tags.
        +1 test4tests 0m 0s The patch appears to include 2 new or modified test files.
        0 mvndep 0m 39s Maven dependency ordering for branch
        +1 mvninstall 10m 35s trunk passed
        +1 compile 2m 42s trunk passed with JDK v1.8.0_66
        +1 compile 2m 4s trunk passed with JDK v1.7.0_91
        +1 checkstyle 0m 39s trunk passed
        +1 mvnsite 2m 53s trunk passed
        +1 mvneclipse 0m 35s trunk passed
        +1 findbugs 6m 31s trunk passed
        +1 javadoc 4m 57s trunk passed with JDK v1.8.0_66
        +1 javadoc 6m 27s trunk passed with JDK v1.7.0_91
        0 mvndep 0m 29s Maven dependency ordering for patch
        -1 mvninstall 0m 24s hadoop-hdfs in the patch failed.
        -1 mvninstall 0m 25s hadoop-hdfs in the patch failed.
        -1 compile 1m 34s hadoop-hdfs-project in the patch failed with JDK v1.8.0_66.
        -1 javac 1m 34s hadoop-hdfs-project in the patch failed with JDK v1.8.0_66.
        -1 compile 1m 4s hadoop-hdfs-project in the patch failed with JDK v1.7.0_91.
        -1 javac 1m 4s hadoop-hdfs-project in the patch failed with JDK v1.7.0_91.
        -1 checkstyle 0m 39s hadoop-hdfs-project: patch generated 3 new + 14 unchanged - 356 fixed = 17 total (was 370)
        -1 mvnsite 0m 26s hadoop-hdfs in the patch failed.
        -1 mvnsite 0m 27s hadoop-hdfs in the patch failed.
        +1 mvneclipse 0m 42s the patch passed
        +1 whitespace 0m 0s Patch has no whitespace issues.
        -1 findbugs 0m 24s hadoop-hdfs in the patch failed.
        -1 findbugs 0m 23s hadoop-hdfs in the patch failed.
        -1 javadoc 0m 35s hadoop-hdfs in the patch failed with JDK v1.8.0_66.
        -1 javadoc 0m 33s hadoop-hdfs in the patch failed with JDK v1.8.0_66.
        -1 javadoc 0m 25s hadoop-hdfs in the patch failed with JDK v1.7.0_91.
        -1 javadoc 0m 23s hadoop-hdfs in the patch failed with JDK v1.7.0_91.
        -1 unit 0m 19s hadoop-hdfs in the patch failed with JDK v1.8.0_66.
        -1 unit 0m 20s hadoop-hdfs in the patch failed with JDK v1.8.0_66.
        -1 unit 0m 16s hadoop-hdfs in the patch failed with JDK v1.7.0_91.
        -1 unit 0m 16s hadoop-hdfs in the patch failed with JDK v1.7.0_91.
        +1 asflicense 0m 26s Patch does not generate ASF License warnings.
        52m 50s



        Subsystem Report/Notes
        Docker Image:yetus/hadoop:0ca8df7
        JIRA Patch URL https://issues.apache.org/jira/secure/attachment/12783887/HDFS-9686.patch.0
        JIRA Issue HDFS-9686
        Optional Tests asflicense compile javac javadoc mvninstall mvnsite unit findbugs checkstyle
        uname Linux 3264b91ab47f 3.13.0-36-lowlatency #63-Ubuntu SMP PREEMPT Wed Sep 3 21:56:12 UTC 2014 x86_64 x86_64 x86_64 GNU/Linux
        Build tool maven
        Personality /testptch/hadoop/patchprocess/precommit/personality/provided.sh
        git revision trunk / 99829eb
        Default Java 1.7.0_91
        Multi-JDK versions /usr/lib/jvm/java-8-oracle:1.8.0_66 /usr/lib/jvm/java-7-openjdk-amd64:1.7.0_91
        findbugs v3.0.0
        mvninstall https://builds.apache.org/job/PreCommit-HDFS-Build/14223/artifact/patchprocess/patch-mvninstall-hadoop-hdfs-project_hadoop-hdfs.txt
        mvninstall https://builds.apache.org/job/PreCommit-HDFS-Build/14223/artifact/patchprocess/patch-mvninstall-hadoop-hdfs-project_hadoop-hdfs.txt
        compile https://builds.apache.org/job/PreCommit-HDFS-Build/14223/artifact/patchprocess/patch-compile-hadoop-hdfs-project-jdk1.8.0_66.txt
        javac https://builds.apache.org/job/PreCommit-HDFS-Build/14223/artifact/patchprocess/patch-compile-hadoop-hdfs-project-jdk1.8.0_66.txt
        compile https://builds.apache.org/job/PreCommit-HDFS-Build/14223/artifact/patchprocess/patch-compile-hadoop-hdfs-project-jdk1.7.0_91.txt
        javac https://builds.apache.org/job/PreCommit-HDFS-Build/14223/artifact/patchprocess/patch-compile-hadoop-hdfs-project-jdk1.7.0_91.txt
        checkstyle https://builds.apache.org/job/PreCommit-HDFS-Build/14223/artifact/patchprocess/diff-checkstyle-hadoop-hdfs-project.txt
        mvnsite https://builds.apache.org/job/PreCommit-HDFS-Build/14223/artifact/patchprocess/patch-mvnsite-hadoop-hdfs-project_hadoop-hdfs.txt
        mvnsite https://builds.apache.org/job/PreCommit-HDFS-Build/14223/artifact/patchprocess/patch-mvnsite-hadoop-hdfs-project_hadoop-hdfs.txt
        findbugs https://builds.apache.org/job/PreCommit-HDFS-Build/14223/artifact/patchprocess/patch-findbugs-hadoop-hdfs-project_hadoop-hdfs.txt
        findbugs https://builds.apache.org/job/PreCommit-HDFS-Build/14223/artifact/patchprocess/patch-findbugs-hadoop-hdfs-project_hadoop-hdfs.txt
        javadoc https://builds.apache.org/job/PreCommit-HDFS-Build/14223/artifact/patchprocess/patch-javadoc-hadoop-hdfs-project_hadoop-hdfs-jdk1.8.0_66.txt
        javadoc https://builds.apache.org/job/PreCommit-HDFS-Build/14223/artifact/patchprocess/patch-javadoc-hadoop-hdfs-project_hadoop-hdfs-jdk1.8.0_66.txt
        javadoc https://builds.apache.org/job/PreCommit-HDFS-Build/14223/artifact/patchprocess/patch-javadoc-hadoop-hdfs-project_hadoop-hdfs-jdk1.7.0_91.txt
        javadoc https://builds.apache.org/job/PreCommit-HDFS-Build/14223/artifact/patchprocess/patch-javadoc-hadoop-hdfs-project_hadoop-hdfs-jdk1.7.0_91.txt
        unit https://builds.apache.org/job/PreCommit-HDFS-Build/14223/artifact/patchprocess/patch-unit-hadoop-hdfs-project_hadoop-hdfs-jdk1.8.0_66.txt
        unit https://builds.apache.org/job/PreCommit-HDFS-Build/14223/artifact/patchprocess/patch-unit-hadoop-hdfs-project_hadoop-hdfs-jdk1.8.0_66.txt
        unit https://builds.apache.org/job/PreCommit-HDFS-Build/14223/artifact/patchprocess/patch-unit-hadoop-hdfs-project_hadoop-hdfs-jdk1.7.0_91.txt
        unit https://builds.apache.org/job/PreCommit-HDFS-Build/14223/artifact/patchprocess/patch-unit-hadoop-hdfs-project_hadoop-hdfs-jdk1.7.0_91.txt
        JDK v1.7.0_91 Test Results https://builds.apache.org/job/PreCommit-HDFS-Build/14223/testReport/
        modules C: hadoop-hdfs-project/hadoop-hdfs hadoop-hdfs-project/hadoop-hdfs-httpfs U: hadoop-hdfs-project
        Max memory used 77MB
        Powered by Apache Yetus 0.2.0-SNAPSHOT http://yetus.apache.org
        Console output https://builds.apache.org/job/PreCommit-HDFS-Build/14223/console

        This message was automatically generated.

        Show
        hadoopqa Hadoop QA added a comment - -1 overall Vote Subsystem Runtime Comment 0 reexec 0m 0s Docker mode activated. 0 patch 0m 19s The patch file was not named according to hadoop's naming conventions. Please see https://wiki.apache.org/hadoop/HowToContribute for instructions. +1 @author 0m 0s The patch does not contain any @author tags. +1 test4tests 0m 0s The patch appears to include 2 new or modified test files. 0 mvndep 0m 39s Maven dependency ordering for branch +1 mvninstall 10m 35s trunk passed +1 compile 2m 42s trunk passed with JDK v1.8.0_66 +1 compile 2m 4s trunk passed with JDK v1.7.0_91 +1 checkstyle 0m 39s trunk passed +1 mvnsite 2m 53s trunk passed +1 mvneclipse 0m 35s trunk passed +1 findbugs 6m 31s trunk passed +1 javadoc 4m 57s trunk passed with JDK v1.8.0_66 +1 javadoc 6m 27s trunk passed with JDK v1.7.0_91 0 mvndep 0m 29s Maven dependency ordering for patch -1 mvninstall 0m 24s hadoop-hdfs in the patch failed. -1 mvninstall 0m 25s hadoop-hdfs in the patch failed. -1 compile 1m 34s hadoop-hdfs-project in the patch failed with JDK v1.8.0_66. -1 javac 1m 34s hadoop-hdfs-project in the patch failed with JDK v1.8.0_66. -1 compile 1m 4s hadoop-hdfs-project in the patch failed with JDK v1.7.0_91. -1 javac 1m 4s hadoop-hdfs-project in the patch failed with JDK v1.7.0_91. -1 checkstyle 0m 39s hadoop-hdfs-project: patch generated 3 new + 14 unchanged - 356 fixed = 17 total (was 370) -1 mvnsite 0m 26s hadoop-hdfs in the patch failed. -1 mvnsite 0m 27s hadoop-hdfs in the patch failed. +1 mvneclipse 0m 42s the patch passed +1 whitespace 0m 0s Patch has no whitespace issues. -1 findbugs 0m 24s hadoop-hdfs in the patch failed. -1 findbugs 0m 23s hadoop-hdfs in the patch failed. -1 javadoc 0m 35s hadoop-hdfs in the patch failed with JDK v1.8.0_66. -1 javadoc 0m 33s hadoop-hdfs in the patch failed with JDK v1.8.0_66. -1 javadoc 0m 25s hadoop-hdfs in the patch failed with JDK v1.7.0_91. -1 javadoc 0m 23s hadoop-hdfs in the patch failed with JDK v1.7.0_91. -1 unit 0m 19s hadoop-hdfs in the patch failed with JDK v1.8.0_66. -1 unit 0m 20s hadoop-hdfs in the patch failed with JDK v1.8.0_66. -1 unit 0m 16s hadoop-hdfs in the patch failed with JDK v1.7.0_91. -1 unit 0m 16s hadoop-hdfs in the patch failed with JDK v1.7.0_91. +1 asflicense 0m 26s Patch does not generate ASF License warnings. 52m 50s Subsystem Report/Notes Docker Image:yetus/hadoop:0ca8df7 JIRA Patch URL https://issues.apache.org/jira/secure/attachment/12783887/HDFS-9686.patch.0 JIRA Issue HDFS-9686 Optional Tests asflicense compile javac javadoc mvninstall mvnsite unit findbugs checkstyle uname Linux 3264b91ab47f 3.13.0-36-lowlatency #63-Ubuntu SMP PREEMPT Wed Sep 3 21:56:12 UTC 2014 x86_64 x86_64 x86_64 GNU/Linux Build tool maven Personality /testptch/hadoop/patchprocess/precommit/personality/provided.sh git revision trunk / 99829eb Default Java 1.7.0_91 Multi-JDK versions /usr/lib/jvm/java-8-oracle:1.8.0_66 /usr/lib/jvm/java-7-openjdk-amd64:1.7.0_91 findbugs v3.0.0 mvninstall https://builds.apache.org/job/PreCommit-HDFS-Build/14223/artifact/patchprocess/patch-mvninstall-hadoop-hdfs-project_hadoop-hdfs.txt mvninstall https://builds.apache.org/job/PreCommit-HDFS-Build/14223/artifact/patchprocess/patch-mvninstall-hadoop-hdfs-project_hadoop-hdfs.txt compile https://builds.apache.org/job/PreCommit-HDFS-Build/14223/artifact/patchprocess/patch-compile-hadoop-hdfs-project-jdk1.8.0_66.txt javac https://builds.apache.org/job/PreCommit-HDFS-Build/14223/artifact/patchprocess/patch-compile-hadoop-hdfs-project-jdk1.8.0_66.txt compile https://builds.apache.org/job/PreCommit-HDFS-Build/14223/artifact/patchprocess/patch-compile-hadoop-hdfs-project-jdk1.7.0_91.txt javac https://builds.apache.org/job/PreCommit-HDFS-Build/14223/artifact/patchprocess/patch-compile-hadoop-hdfs-project-jdk1.7.0_91.txt checkstyle https://builds.apache.org/job/PreCommit-HDFS-Build/14223/artifact/patchprocess/diff-checkstyle-hadoop-hdfs-project.txt mvnsite https://builds.apache.org/job/PreCommit-HDFS-Build/14223/artifact/patchprocess/patch-mvnsite-hadoop-hdfs-project_hadoop-hdfs.txt mvnsite https://builds.apache.org/job/PreCommit-HDFS-Build/14223/artifact/patchprocess/patch-mvnsite-hadoop-hdfs-project_hadoop-hdfs.txt findbugs https://builds.apache.org/job/PreCommit-HDFS-Build/14223/artifact/patchprocess/patch-findbugs-hadoop-hdfs-project_hadoop-hdfs.txt findbugs https://builds.apache.org/job/PreCommit-HDFS-Build/14223/artifact/patchprocess/patch-findbugs-hadoop-hdfs-project_hadoop-hdfs.txt javadoc https://builds.apache.org/job/PreCommit-HDFS-Build/14223/artifact/patchprocess/patch-javadoc-hadoop-hdfs-project_hadoop-hdfs-jdk1.8.0_66.txt javadoc https://builds.apache.org/job/PreCommit-HDFS-Build/14223/artifact/patchprocess/patch-javadoc-hadoop-hdfs-project_hadoop-hdfs-jdk1.8.0_66.txt javadoc https://builds.apache.org/job/PreCommit-HDFS-Build/14223/artifact/patchprocess/patch-javadoc-hadoop-hdfs-project_hadoop-hdfs-jdk1.7.0_91.txt javadoc https://builds.apache.org/job/PreCommit-HDFS-Build/14223/artifact/patchprocess/patch-javadoc-hadoop-hdfs-project_hadoop-hdfs-jdk1.7.0_91.txt unit https://builds.apache.org/job/PreCommit-HDFS-Build/14223/artifact/patchprocess/patch-unit-hadoop-hdfs-project_hadoop-hdfs-jdk1.8.0_66.txt unit https://builds.apache.org/job/PreCommit-HDFS-Build/14223/artifact/patchprocess/patch-unit-hadoop-hdfs-project_hadoop-hdfs-jdk1.8.0_66.txt unit https://builds.apache.org/job/PreCommit-HDFS-Build/14223/artifact/patchprocess/patch-unit-hadoop-hdfs-project_hadoop-hdfs-jdk1.7.0_91.txt unit https://builds.apache.org/job/PreCommit-HDFS-Build/14223/artifact/patchprocess/patch-unit-hadoop-hdfs-project_hadoop-hdfs-jdk1.7.0_91.txt JDK v1.7.0_91 Test Results https://builds.apache.org/job/PreCommit-HDFS-Build/14223/testReport/ modules C: hadoop-hdfs-project/hadoop-hdfs hadoop-hdfs-project/hadoop-hdfs-httpfs U: hadoop-hdfs-project Max memory used 77MB Powered by Apache Yetus 0.2.0-SNAPSHOT http://yetus.apache.org Console output https://builds.apache.org/job/PreCommit-HDFS-Build/14223/console This message was automatically generated.
        Hide
        sarutak Kousuke Saruta added a comment -

        I've attached the initial patch.

        Show
        sarutak Kousuke Saruta added a comment - I've attached the initial patch.

          People

          • Assignee:
            sarutak Kousuke Saruta
            Reporter:
            sarutak Kousuke Saruta
          • Votes:
            0 Vote for this issue
            Watchers:
            5 Start watching this issue

            Dates

            • Created:
              Updated:
              Resolved:

              Development