Details

    • Type: Bug
    • Status: Resolved
    • Priority: Major
    • Resolution: Fixed
    • Affects Version/s: None
    • Fix Version/s: 2.8.0, 3.0.0-alpha1
    • Component/s: None
    • Labels:
      None
    • Hadoop Flags:
      Reviewed

      Description

      Tests run: 7, Failures: 2, Errors: 0, Skipped: 0, Time elapsed: 181.278 sec <<< FAILURE! - in org.apache.hadoop.hdfs.web.TestWebHdfsContentLength
      testPutOp(org.apache.hadoop.hdfs.web.TestWebHdfsContentLength) Time elapsed: 60.05 sec <<< FAILURE!
      java.lang.AssertionError: expected:<0> but was:<null>
      at org.junit.Assert.fail(Assert.java:88)
      at org.junit.Assert.failNotEquals(Assert.java:743)
      at org.junit.Assert.assertEquals(Assert.java:118)
      at org.junit.Assert.assertEquals(Assert.java:144)
      at org.apache.hadoop.hdfs.web.TestWebHdfsContentLength.testPutOp(TestWebHdfsContentLength.java:116)

      testPutOpWithRedirect(org.apache.hadoop.hdfs.web.TestWebHdfsContentLength) Time elapsed: 0.01 sec <<< FAILURE!
      org.junit.ComparisonFailure: expected:<[chunked]> but was:<[0]>
      at org.junit.Assert.assertEquals(Assert.java:115)
      at org.junit.Assert.assertEquals(Assert.java:144)
      at org.apache.hadoop.hdfs.web.TestWebHdfsContentLength.testPutOpWithRedirect(TestWebHdfsContentLength.java:130)

        Attachments

        1. HDFS-9196.001.patch
          0.9 kB
          Masatake Iwasaki

          Activity

            People

            • Assignee:
              iwasakims Masatake Iwasaki
              Reporter:
              ozawa Tsuyoshi Ozawa
            • Votes:
              0 Vote for this issue
              Watchers:
              5 Start watching this issue

              Dates

              • Created:
                Updated:
                Resolved: