Hadoop HDFS
  1. Hadoop HDFS
  2. HDFS-6177

TestHttpFSServer fails occasionally in trunk

    Details

    • Type: Test Test
    • Status: Resolved
    • Priority: Minor Minor
    • Resolution: Cannot Reproduce
    • Affects Version/s: None
    • Fix Version/s: None
    • Component/s: None
    • Labels:
      None

      Description

      From https://builds.apache.org/job/Hadoop-hdfs-trunk/1716/consoleFull :

      Running org.apache.hadoop.fs.http.server.TestHttpFSServer
      Tests run: 7, Failures: 1, Errors: 0, Skipped: 0, Time elapsed: 8.424 sec <<< FAILURE! - in org.apache.hadoop.fs.http.server.TestHttpFSServer
      testDelegationTokenOperations(org.apache.hadoop.fs.http.server.TestHttpFSServer)  Time elapsed: 0.559 sec  <<< FAILURE!
      java.lang.AssertionError: expected:<401> but was:<403>
      	at org.junit.Assert.fail(Assert.java:93)
      	at org.junit.Assert.failNotEquals(Assert.java:647)
      	at org.junit.Assert.assertEquals(Assert.java:128)
      	at org.junit.Assert.assertEquals(Assert.java:472)
      	at org.junit.Assert.assertEquals(Assert.java:456)
      	at org.apache.hadoop.fs.http.server.TestHttpFSServer.testDelegationTokenOperations(TestHttpFSServer.java:352)
      

        Activity

        Ted Yu created issue -
        Ted Yu made changes -
        Field Original Value New Value
        Resolution Cannot Reproduce [ 5 ]
        Status Open [ 1 ] Resolved [ 5 ]
        Transition Time In Source Status Execution Times Last Executer Last Execution Date
        Open Open Resolved Resolved
        322d 1h 9m 1 Ted Yu 15/Feb/15 15:23

          People

          • Assignee:
            Unassigned
            Reporter:
            Ted Yu
          • Votes:
            0 Vote for this issue
            Watchers:
            1 Start watching this issue

            Dates

            • Created:
              Updated:
              Resolved:

              Development