Uploaded image for project: 'Hadoop HDFS'
  1. Hadoop HDFS
  2. HDFS-15646 Track failing tests in HDFS
  3. HDFS-16170

TestFileTruncate#testTruncateWithDataNodesShutdownImmediately fails

    XMLWordPrintableJSON

Details

    • Sub-task
    • Status: Open
    • Major
    • Resolution: Unresolved
    • 3.4.0
    • None
    • test
    • None

    Description

      [ERROR] Tests run: 26, Failures: 2, Errors: 0, Skipped: 0, Time elapsed: 263.442 s <<< FAILURE! - in org.apache.hadoop.hdfs.server.namenode.TestFileTruncate [ERROR] testTruncateWithDataNodesShutdownImmediately(org.apache.hadoop.hdfs.server.namenode.TestFileTruncate) Time elapsed: 4.291 s <<< FAILURE! java.lang.AssertionError at org.junit.Assert.fail(Assert.java:87) at org.junit.Assert.assertTrue(Assert.java:42) at org.junit.Assert.assertTrue(Assert.java:53) at org.apache.hadoop.hdfs.server.namenode.TestFileTruncate.testTruncateWithDataNodesShutdownImmediately(TestFileTruncate.java:927) at sun.reflect.NativeMethodAccessorImpl.invoke0(Native Method) at sun.reflect.NativeMethodAccessorImpl.invoke(NativeMethodAccessorImpl.java:62) at sun.reflect.DelegatingMethodAccessorImpl.invoke(DelegatingMethodAccessorImpl.java:43) at java.lang.reflect.Method.invoke(Method.java:498) at org.junit.runners.model.FrameworkMethod$1.runReflectiveCall(FrameworkMethod.java:59) at org.junit.internal.runners.model.ReflectiveCallable.run(ReflectiveCallable.java:12) at org.junit.runners.model.FrameworkMethod.invokeExplosively(FrameworkMethod.java:56) at org.junit.internal.runners.statements.InvokeMethod.evaluate(InvokeMethod.java:17) at org.junit.internal.runners.statements.FailOnTimeout$CallableStatement.call(FailOnTimeout.java:299) at org.junit.internal.runners.statements.FailOnTimeout$CallableStatement.call(FailOnTimeout.java:293) at java.util.concurrent.FutureTask.run(FutureTask.java:266) at java.lang.Thread.run(Thread.java:748) [ERROR] testTruncateWithDataNodesShutdownImmediately(org.apache.hadoop.hdfs.server.namenode.TestFileTruncate) Time elapsed: 3.868 s <<< FAILURE! java.lang.AssertionError at org.junit.Assert.fail(Assert.java:87) at org.junit.Assert.assertTrue(Assert.java:42) at org.junit.Assert.assertTrue(Assert.java:53) at org.apache.hadoop.hdfs.server.namenode.TestFileTruncate.testTruncateWithDataNodesShutdownImmediately(TestFileTruncate.java:927) at sun.reflect.NativeMethodAccessorImpl.invoke0(Native Method) at sun.reflect.NativeMethodAccessorImpl.invoke(NativeMethodAccessorImpl.java:62) at sun.reflect.DelegatingMethodAccessorImpl.invoke(DelegatingMethodAccessorImpl.java:43) at java.lang.reflect.Method.invoke(Method.java:498) at org.junit.runners.model.FrameworkMethod$1.runReflectiveCall(FrameworkMethod.java:59) at org.junit.internal.runners.model.ReflectiveCallable.run(ReflectiveCallable.java:12) at org.junit.runners.model.FrameworkMethod.invokeExplosively(FrameworkMethod.java:56) at org.junit.internal.runners.statements.InvokeMethod.evaluate(InvokeMethod.java:17) at org.junit.internal.runners.statements.FailOnTimeout$CallableStatement.call(FailOnTimeout.java:299) at org.junit.internal.runners.statements.FailOnTimeout$CallableStatement.call(FailOnTimeout.java:293) at java.util.concurrent.FutureTask.run(FutureTask.java:266) at java.lang.Thread.run(Thread.java:748)

       

      CI result is https://ci-hadoop.apache.org/job/hadoop-multibranch/job/PR-3296/1/artifact/out/patch-unit-hadoop-hdfs-project_hadoop-hdfs.txt

      Attachments

        Activity

          People

            Unassigned Unassigned
            ferhui Hui Fei
            Votes:
            0 Vote for this issue
            Watchers:
            1 Start watching this issue

            Dates

              Created:
              Updated: