XMLWordPrintableJSON

Details

    • Sub-task
    • Status: Resolved
    • Major
    • Resolution: Fixed
    • None
    • 0.5.0
    • test
    • None

    Description

      2020-02-19T17:11:43.6526807Z [ERROR] Tests run: 6, Failures: 1, Errors: 0, Skipped: 0, Time elapsed: 1.289 s <<< FAILURE! - in org.apache.hadoop.hdds.scm.pipeline.TestRatisPipelineProvider
      2020-02-19T17:11:43.6543694Z [ERROR] testCreatePipelineWithFactorThree(org.apache.hadoop.hdds.scm.pipeline.TestRatisPipelineProvider)  Time elapsed: 0.07 s  <<< FAILURE!
      2020-02-19T17:11:43.6579316Z java.lang.AssertionError
      2020-02-19T17:11:43.6579566Z 	at org.junit.Assert.fail(Assert.java:86)
      2020-02-19T17:11:43.6579700Z 	at org.junit.Assert.assertTrue(Assert.java:41)
      2020-02-19T17:11:43.6579844Z 	at org.junit.Assert.assertTrue(Assert.java:52)
      2020-02-19T17:11:43.6580005Z 	at org.apache.hadoop.hdds.scm.pipeline.TestRatisPipelineProvider.createPipelineAndAssertions(TestRatisPipelineProvider.java:82)
      2020-02-19T17:11:43.6580280Z 	at org.apache.hadoop.hdds.scm.pipeline.TestRatisPipelineProvider.testCreatePipelineWithFactorThree(TestRatisPipelineProvider.java:112)
      

      Attachments

        Activity

          People

            bharat Bharat Viswanadham
            adoroszlai Attila Doroszlai
            Votes:
            0 Vote for this issue
            Watchers:
            2 Start watching this issue

            Dates

              Created:
              Updated:
              Resolved: