Uploaded image for project: 'Apache Ozone'
  1. Apache Ozone
  2. HDDS-5626 Track and Address Flaky tests
  3. HDDS-2263

Intermittent failure in TestOzoneContainer#testContainerCreateDiskFull

Attach filesAttach ScreenshotVotersWatch issueWatchersLinkCloneUpdate Comment AuthorReplace String in CommentUpdate Comment VisibilityDelete Comments
    XMLWordPrintableJSON

Details

    • Sub-task
    • Status: Resolved
    • Minor
    • Resolution: Cannot Reproduce
    • None
    • None
    • test
    • None

    Description

      Tests run: 2, Failures: 1, Errors: 0, Skipped: 0, Time elapsed: 16.246 s <<< FAILURE! - in org.apache.hadoop.ozone.container.ozoneimpl.TestOzoneContainer
      testContainerCreateDiskFull(org.apache.hadoop.ozone.container.ozoneimpl.TestOzoneContainer)  Time elapsed: 11.562 s  <<< FAILURE!
      java.lang.AssertionError: expected:<true> but was:<false>
      ...
      	at org.apache.hadoop.ozone.container.ozoneimpl.TestOzoneContainer.testContainerCreateDiskFull(TestOzoneContainer.java:176)
      

      Attachments

        Activity

          This comment will be Viewable by All Users Viewable by All Users
          Cancel

          People

            Unassigned Unassigned
            adoroszlai Attila Doroszlai
            Votes:
            0 Vote for this issue
            Watchers:
            3 Start watching this issue

            Dates

              Created:
              Updated:
              Resolved:

              Slack

                Issue deployment