Uploaded image for project: 'HBase'
  1. HBase
  2. HBASE-6891 Hadoop 2 unit test failures
  3. HBASE-8324

TestHFileOutputFormat.testMRIncremental* fails against hadoop2 profile

VotersWatch issueWatchersLinkCloneUpdate Comment AuthorReplace String in CommentUpdate Comment VisibilityDelete Comments
    XMLWordPrintableJSON

Details

    • Sub-task
    • Status: Closed
    • Major
    • Resolution: Fixed
    • 0.95.0
    • 0.98.0, 0.95.1
    • hadoop2, test
    • None

    Description

      Two tests cases are failing:

      testMRIncrementalLoad, testMRIncrementalloadWithSplit

      <testcase time="33.942" classname="org.apache.hadoop.hbase.mapreduce.TestHFileOutputFormat" name="testMRIncrementalLoad">
          <failure type="java.lang.AssertionError">java.lang.AssertionError
              at org.junit.Assert.fail(Assert.java:86)
              at org.junit.Assert.assertTrue(Assert.java:41)
              at org.junit.Assert.assertTrue(Assert.java:52)
              at org.apache.hadoop.hbase.mapreduce.TestHFileOutputFormat.runIncrementalPELoad(TestHFileOutputFormat.java:468)
              at org.apache.hadoop.hbase.mapreduce.TestHFileOutputFormat.doIncrementalLoadTest(TestHFileOutputFormat.java:378)
              at org.apache.hadoop.hbase.mapreduce.TestHFileOutputFormat.testMRIncrementalLoad(TestHFileOutputFormat.java:348)
              at sun.reflect.NativeMethodAccessorImpl.invoke0(Native Method)
      ...
      
        <testcase time="34.324" classname="org.apache.hadoop.hbase.mapreduce.TestHFileOutputFormat" name="testMRIncrementalLoadWithSplit">
          <failure type="java.lang.AssertionError">java.lang.AssertionError
              at org.junit.Assert.fail(Assert.java:86)
              at org.junit.Assert.assertTrue(Assert.java:41)
              at org.junit.Assert.assertTrue(Assert.java:52)
              at org.apache.hadoop.hbase.mapreduce.TestHFileOutputFormat.runIncrementalPELoad(TestHFileOutputFormat.java:468)
              at org.apache.hadoop.hbase.mapreduce.TestHFileOutputFormat.doIncrementalLoadTest(TestHFileOutputFormat.java:378)
              at org.apache.hadoop.hbase.mapreduce.TestHFileOutputFormat.testMRIncrementalLoadWithSplit(TestHFileOutputFormat.java:354)
              at sun.reflect.NativeMethodAccessorImpl.invoke0(Native Method)
              ...
      

      Attachments

        1. hbase-8324.v2.patch
          1 kB
          Jonathan Hsieh
        2. hbase-8324.hadoop2.patch
          1 kB
          Jonathan Hsieh

        Activity

          This comment will be Viewable by All Users Viewable by All Users
          Cancel

          People

            jmhsieh Jonathan Hsieh
            jmhsieh Jonathan Hsieh
            Votes:
            0 Vote for this issue
            Watchers:
            3 Start watching this issue

            Dates

              Created:
              Updated:
              Resolved:

              Issue deployment