HBase
  1. HBase
  2. HBASE-6011

Unable to start master in local mode

    Details

    • Type: Bug Bug
    • Status: Closed
    • Priority: Major Major
    • Resolution: Fixed
    • Affects Version/s: 0.92.2, 0.94.1, 0.95.2
    • Fix Version/s: 0.94.1, 0.95.0
    • Component/s: None
    • Labels:
      None

      Description

      Got this trying to launch head of 0.94 branch in local mode from the build tree but it happens with trunk and 0.92 too:

      12/05/15 19:35:45 ERROR master.HMasterCommandLine: Failed to start master
      java.lang.ClassCastException: org.apache.hadoop.hbase.master.HMaster cannot be cast to org.apache.hadoop.hbase.master.HMasterCommandLine$LocalHMaster
      	at org.apache.hadoop.hbase.master.HMasterCommandLine.startMaster(HMasterCommandLine.java:142)
      	at org.apache.hadoop.hbase.master.HMasterCommandLine.run(HMasterCommandLine.java:103)
      	at org.apache.hadoop.util.ToolRunner.run(ToolRunner.java:65)
      	at org.apache.hadoop.hbase.util.ServerCommandLine.doMain(ServerCommandLine.java:76)
      	at org.apache.hadoop.hbase.master.HMaster.main(HMaster.java:1761)
      
      1. 6011.patch
        1 kB
        Andrew Purtell
      2. 6011-v2.patch
        6 kB
        Andrew Purtell
      3. HBASE-6011_1.patch
        5 kB
        ramkrishna.s.vasudevan
      4. HBASE-6011_addendum_0.92.patch
        0.7 kB
        ramkrishna.s.vasudevan
      5. HBASE-6011_addendum_0.94.patch
        0.7 kB
        ramkrishna.s.vasudevan
      6. HBASE-6011_addendum_trunk.patch
        0.7 kB
        ramkrishna.s.vasudevan

        Activity

        Hide
        Hudson added a comment -

        Integrated in HBase-0.92-security #108 (See https://builds.apache.org/job/HBase-0.92-security/108/)
        HBASE-6011. Addendum to support master mocking (Ram) (Revision 1340157)

        Result = FAILURE
        apurtell :
        Files :

        • /hbase/branches/0.92/src/main/java/org/apache/hadoop/hbase/LocalHBaseCluster.java
        Show
        Hudson added a comment - Integrated in HBase-0.92-security #108 (See https://builds.apache.org/job/HBase-0.92-security/108/ ) HBASE-6011 . Addendum to support master mocking (Ram) (Revision 1340157) Result = FAILURE apurtell : Files : /hbase/branches/0.92/src/main/java/org/apache/hadoop/hbase/LocalHBaseCluster.java
        Hide
        Hudson added a comment -

        Integrated in HBase-0.94-security #27 (See https://builds.apache.org/job/HBase-0.94-security/27/)
        HBASE-6011. Addendum to support master mocking (Ram) (Revision 1340156)
        HBASE-6011. Unable to start master in local mode (Revision 1339904)

        Result = SUCCESS
        apurtell :
        Files :

        • /hbase/branches/0.94/src/main/java/org/apache/hadoop/hbase/LocalHBaseCluster.java

        apurtell :
        Files :

        • /hbase/branches/0.94/src/main/java/org/apache/hadoop/hbase/LocalHBaseCluster.java
        • /hbase/branches/0.94/src/test/java/org/apache/hadoop/hbase/TestLocalHBaseCluster.java
        Show
        Hudson added a comment - Integrated in HBase-0.94-security #27 (See https://builds.apache.org/job/HBase-0.94-security/27/ ) HBASE-6011 . Addendum to support master mocking (Ram) (Revision 1340156) HBASE-6011 . Unable to start master in local mode (Revision 1339904) Result = SUCCESS apurtell : Files : /hbase/branches/0.94/src/main/java/org/apache/hadoop/hbase/LocalHBaseCluster.java apurtell : Files : /hbase/branches/0.94/src/main/java/org/apache/hadoop/hbase/LocalHBaseCluster.java /hbase/branches/0.94/src/test/java/org/apache/hadoop/hbase/TestLocalHBaseCluster.java
        Hide
        Hudson added a comment -

        Integrated in HBase-TRUNK-on-Hadoop-2.0.0 #10 (See https://builds.apache.org/job/HBase-TRUNK-on-Hadoop-2.0.0/10/)
        HBASE-6011. Addendum to support master mocking (Ram) (Revision 1340155)

        Result = FAILURE
        apurtell :
        Files :

        • /hbase/trunk/src/main/java/org/apache/hadoop/hbase/LocalHBaseCluster.java
        Show
        Hudson added a comment - Integrated in HBase-TRUNK-on-Hadoop-2.0.0 #10 (See https://builds.apache.org/job/HBase-TRUNK-on-Hadoop-2.0.0/10/ ) HBASE-6011 . Addendum to support master mocking (Ram) (Revision 1340155) Result = FAILURE apurtell : Files : /hbase/trunk/src/main/java/org/apache/hadoop/hbase/LocalHBaseCluster.java
        Hide
        Hudson added a comment -

        Integrated in HBase-0.92 #412 (See https://builds.apache.org/job/HBase-0.92/412/)
        HBASE-6011. Addendum to support master mocking (Ram) (Revision 1340157)

        Result = FAILURE
        apurtell :
        Files :

        • /hbase/branches/0.92/src/main/java/org/apache/hadoop/hbase/LocalHBaseCluster.java
        Show
        Hudson added a comment - Integrated in HBase-0.92 #412 (See https://builds.apache.org/job/HBase-0.92/412/ ) HBASE-6011 . Addendum to support master mocking (Ram) (Revision 1340157) Result = FAILURE apurtell : Files : /hbase/branches/0.92/src/main/java/org/apache/hadoop/hbase/LocalHBaseCluster.java
        Hide
        Hudson added a comment -

        Integrated in HBase-0.94 #200 (See https://builds.apache.org/job/HBase-0.94/200/)
        HBASE-6011. Addendum to support master mocking (Ram) (Revision 1340156)

        Result = FAILURE
        apurtell :
        Files :

        • /hbase/branches/0.94/src/main/java/org/apache/hadoop/hbase/LocalHBaseCluster.java
        Show
        Hudson added a comment - Integrated in HBase-0.94 #200 (See https://builds.apache.org/job/HBase-0.94/200/ ) HBASE-6011 . Addendum to support master mocking (Ram) (Revision 1340156) Result = FAILURE apurtell : Files : /hbase/branches/0.94/src/main/java/org/apache/hadoop/hbase/LocalHBaseCluster.java
        Hide
        Hudson added a comment -

        Integrated in HBase-TRUNK #2898 (See https://builds.apache.org/job/HBase-TRUNK/2898/)
        HBASE-6011. Addendum to support master mocking (Ram) (Revision 1340155)

        Result = FAILURE
        apurtell :
        Files :

        • /hbase/trunk/src/main/java/org/apache/hadoop/hbase/LocalHBaseCluster.java
        Show
        Hudson added a comment - Integrated in HBase-TRUNK #2898 (See https://builds.apache.org/job/HBase-TRUNK/2898/ ) HBASE-6011 . Addendum to support master mocking (Ram) (Revision 1340155) Result = FAILURE apurtell : Files : /hbase/trunk/src/main/java/org/apache/hadoop/hbase/LocalHBaseCluster.java
        Hide
        ramkrishna.s.vasudevan added a comment -

        No problem. Thanks Andy for committing them.

        Show
        ramkrishna.s.vasudevan added a comment - No problem. Thanks Andy for committing them.
        Hide
        Andrew Purtell added a comment -

        Committed all addendum patches. Sorry Ram.

        Show
        Andrew Purtell added a comment - Committed all addendum patches. Sorry Ram.
        Hide
        Andrew Purtell added a comment -

        Ah, I see, +1 on the addendum.

        Show
        Andrew Purtell added a comment - Ah, I see, +1 on the addendum.
        Hide
        Hadoop QA added a comment -

        -1 overall. Here are the results of testing the latest attachment
        http://issues.apache.org/jira/secure/attachment/12528062/HBASE-6011_addendum_trunk.patch
        against trunk revision .

        +1 @author. The patch does not contain any @author tags.

        -1 tests included. The patch doesn't appear to include any new or modified tests.
        Please justify why no new tests are needed for this patch.
        Also please list what manual steps were performed to verify this patch.

        +1 hadoop23. The patch compiles against the hadoop 0.23.x profile.

        +1 javadoc. The javadoc tool did not generate any warning messages.

        +1 javac. The applied patch does not increase the total number of javac compiler warnings.

        -1 findbugs. The patch appears to introduce 32 new Findbugs (version 1.3.9) warnings.

        +1 release audit. The applied patch does not increase the total number of release audit warnings.

        -1 core tests. The patch failed these unit tests:
        org.apache.hadoop.hbase.client.TestFromClientSide
        org.apache.hadoop.hbase.master.TestSplitLogManager

        Test results: https://builds.apache.org/job/PreCommit-HBASE-Build/1930//testReport/
        Findbugs warnings: https://builds.apache.org/job/PreCommit-HBASE-Build/1930//artifact/trunk/patchprocess/newPatchFindbugsWarnings.html
        Console output: https://builds.apache.org/job/PreCommit-HBASE-Build/1930//console

        This message is automatically generated.

        Show
        Hadoop QA added a comment - -1 overall. Here are the results of testing the latest attachment http://issues.apache.org/jira/secure/attachment/12528062/HBASE-6011_addendum_trunk.patch against trunk revision . +1 @author. The patch does not contain any @author tags. -1 tests included. The patch doesn't appear to include any new or modified tests. Please justify why no new tests are needed for this patch. Also please list what manual steps were performed to verify this patch. +1 hadoop23. The patch compiles against the hadoop 0.23.x profile. +1 javadoc. The javadoc tool did not generate any warning messages. +1 javac. The applied patch does not increase the total number of javac compiler warnings. -1 findbugs. The patch appears to introduce 32 new Findbugs (version 1.3.9) warnings. +1 release audit. The applied patch does not increase the total number of release audit warnings. -1 core tests. The patch failed these unit tests: org.apache.hadoop.hbase.client.TestFromClientSide org.apache.hadoop.hbase.master.TestSplitLogManager Test results: https://builds.apache.org/job/PreCommit-HBASE-Build/1930//testReport/ Findbugs warnings: https://builds.apache.org/job/PreCommit-HBASE-Build/1930//artifact/trunk/patchprocess/newPatchFindbugsWarnings.html Console output: https://builds.apache.org/job/PreCommit-HBASE-Build/1930//console This message is automatically generated.
        Hide
        ramkrishna.s.vasudevan added a comment -

        In the latest JIRA even HadoopQA and Hudson are becoming watchers

        Show
        ramkrishna.s.vasudevan added a comment - In the latest JIRA even HadoopQA and Hudson are becoming watchers
        Hide
        ramkrishna.s.vasudevan added a comment -

        Updated patches.

        Show
        ramkrishna.s.vasudevan added a comment - Updated patches.
        Hide
        ramkrishna.s.vasudevan added a comment -

        I attached patch for 0.94 as i was working on that. Will upload patch for Trunk.

        Show
        ramkrishna.s.vasudevan added a comment - I attached patch for 0.94 as i was working on that. Will upload patch for Trunk.
        Hide
        Hadoop QA added a comment -

        -1 overall. Here are the results of testing the latest attachment
        http://issues.apache.org/jira/secure/attachment/12528026/HBASE-6011_1.patch
        against trunk revision .

        +1 @author. The patch does not contain any @author tags.

        +1 tests included. The patch appears to include 7 new or modified tests.

        -1 patch. The patch command could not apply the patch.

        Console output: https://builds.apache.org/job/PreCommit-HBASE-Build/1929//console

        This message is automatically generated.

        Show
        Hadoop QA added a comment - -1 overall. Here are the results of testing the latest attachment http://issues.apache.org/jira/secure/attachment/12528026/HBASE-6011_1.patch against trunk revision . +1 @author. The patch does not contain any @author tags. +1 tests included. The patch appears to include 7 new or modified tests. -1 patch. The patch command could not apply the patch. Console output: https://builds.apache.org/job/PreCommit-HBASE-Build/1929//console This message is automatically generated.
        Hide
        ramkrishna.s.vasudevan added a comment -

        Just will reopen this defect and run the qa for the patch.
        Anyway if we need to raise a seperate issue i can close this and raise new one.

        Show
        ramkrishna.s.vasudevan added a comment - Just will reopen this defect and run the qa for the patch. Anyway if we need to raise a seperate issue i can close this and raise new one.
        Hide
        ramkrishna.s.vasudevan added a comment -

        Pls review this fix. It is running the TestLocalHBaseCluster and also HBASE-5806 related testcases.
        It will help us to mock the master and also can be run locally.

        Show
        ramkrishna.s.vasudevan added a comment - Pls review this fix. It is running the TestLocalHBaseCluster and also HBASE-5806 related testcases. It will help us to mock the master and also can be run locally.
        Hide
        ramkrishna.s.vasudevan added a comment -

        @Andy
        In HBASE-5806 we wanted to mock a HMaster that comes up after getting restarted. So we made the change in LocalHBaseCluster such that the master can be mocked.

        Show
        ramkrishna.s.vasudevan added a comment - @Andy In HBASE-5806 we wanted to mock a HMaster that comes up after getting restarted. So we made the change in LocalHBaseCluster such that the master can be mocked.
        Hide
        Andrew Purtell added a comment -

        Sorry Ram I don't follow, this change seems totally unrelated.

        Show
        Andrew Purtell added a comment - Sorry Ram I don't follow, this change seems totally unrelated.
        Hide
        ramkrishna.s.vasudevan added a comment -

        The testcase change was done by us in HBASe-5806. Anyway will check it and get back on the right addendum over here or for that fix.

        Show
        ramkrishna.s.vasudevan added a comment - The testcase change was done by us in HBASe-5806. Anyway will check it and get back on the right addendum over here or for that fix.
        Hide
        ramkrishna.s.vasudevan added a comment - - edited

        This fix makes testcase added in HBASE-5806 to fail.
        See build https://builds.apache.org/job/HBase-0.94/198/
        Subsequent hadoopqa bot is also failing.

        Show
        ramkrishna.s.vasudevan added a comment - - edited This fix makes testcase added in HBASE-5806 to fail. See build https://builds.apache.org/job/HBase-0.94/198/ Subsequent hadoopqa bot is also failing.
        Hide
        Hudson added a comment -

        Integrated in HBase-0.92-security #107 (See https://builds.apache.org/job/HBase-0.92-security/107/)
        HBASE-6011. Unable to start master in local mode (Revision 1339908)

        Result = FAILURE
        apurtell :
        Files :

        • /hbase/branches/0.92/CHANGES.txt
        • /hbase/branches/0.92/src/main/java/org/apache/hadoop/hbase/LocalHBaseCluster.java
        • /hbase/branches/0.92/src/main/java/org/apache/hadoop/hbase/zookeeper/MiniZooKeeperCluster.java
        • /hbase/branches/0.92/src/test/java/org/apache/hadoop/hbase/TestLocalHBaseCluster.java
        Show
        Hudson added a comment - Integrated in HBase-0.92-security #107 (See https://builds.apache.org/job/HBase-0.92-security/107/ ) HBASE-6011 . Unable to start master in local mode (Revision 1339908) Result = FAILURE apurtell : Files : /hbase/branches/0.92/CHANGES.txt /hbase/branches/0.92/src/main/java/org/apache/hadoop/hbase/LocalHBaseCluster.java /hbase/branches/0.92/src/main/java/org/apache/hadoop/hbase/zookeeper/MiniZooKeeperCluster.java /hbase/branches/0.92/src/test/java/org/apache/hadoop/hbase/TestLocalHBaseCluster.java
        Hide
        Hudson added a comment -

        Integrated in HBase-0.92 #410 (See https://builds.apache.org/job/HBase-0.92/410/)
        HBASE-6011. Unable to start master in local mode (Revision 1339908)

        Result = FAILURE
        apurtell :
        Files :

        • /hbase/branches/0.92/CHANGES.txt
        • /hbase/branches/0.92/src/main/java/org/apache/hadoop/hbase/LocalHBaseCluster.java
        • /hbase/branches/0.92/src/main/java/org/apache/hadoop/hbase/zookeeper/MiniZooKeeperCluster.java
        • /hbase/branches/0.92/src/test/java/org/apache/hadoop/hbase/TestLocalHBaseCluster.java
        Show
        Hudson added a comment - Integrated in HBase-0.92 #410 (See https://builds.apache.org/job/HBase-0.92/410/ ) HBASE-6011 . Unable to start master in local mode (Revision 1339908) Result = FAILURE apurtell : Files : /hbase/branches/0.92/CHANGES.txt /hbase/branches/0.92/src/main/java/org/apache/hadoop/hbase/LocalHBaseCluster.java /hbase/branches/0.92/src/main/java/org/apache/hadoop/hbase/zookeeper/MiniZooKeeperCluster.java /hbase/branches/0.92/src/test/java/org/apache/hadoop/hbase/TestLocalHBaseCluster.java
        Hide
        Andrew Purtell added a comment -

        Nope, you might want to double check. Maybe the git mirror is just behind?

        Yes the Git mirror is clearly behind. It went into SVN on 0.92 branch
        as r1339908 at 2012-05-17 15:51:00 -0700

        Show
        Andrew Purtell added a comment - Nope, you might want to double check. Maybe the git mirror is just behind? Yes the Git mirror is clearly behind. It went into SVN on 0.92 branch as r1339908 at 2012-05-17 15:51:00 -0700
        Hide
        Alex Newman added a comment -

        Nope, you might want to double check. Maybe the git mirror is just behind?

        Show
        Alex Newman added a comment - Nope, you might want to double check. Maybe the git mirror is just behind?
        Hide
        Andrew Purtell added a comment -

        Does it make sense to push this to 0.92?

        Already committed there. You mean did it make sense to do that?

        Show
        Andrew Purtell added a comment - Does it make sense to push this to 0.92? Already committed there. You mean did it make sense to do that?
        Hide
        Alex Newman added a comment -

        Does it make sense to push this to 0.92?

        Show
        Alex Newman added a comment - Does it make sense to push this to 0.92?
        Hide
        Hudson added a comment -

        Integrated in HBase-TRUNK-on-Hadoop-2.0.0 #8 (See https://builds.apache.org/job/HBase-TRUNK-on-Hadoop-2.0.0/8/)
        HBASE-6011. Unable to start master in local mode (Revision 1339902)

        Result = FAILURE
        apurtell :
        Files :

        • /hbase/trunk/src/main/java/org/apache/hadoop/hbase/LocalHBaseCluster.java
        • /hbase/trunk/src/test/java/org/apache/hadoop/hbase/TestLocalHBaseCluster.java
        Show
        Hudson added a comment - Integrated in HBase-TRUNK-on-Hadoop-2.0.0 #8 (See https://builds.apache.org/job/HBase-TRUNK-on-Hadoop-2.0.0/8/ ) HBASE-6011 . Unable to start master in local mode (Revision 1339902) Result = FAILURE apurtell : Files : /hbase/trunk/src/main/java/org/apache/hadoop/hbase/LocalHBaseCluster.java /hbase/trunk/src/test/java/org/apache/hadoop/hbase/TestLocalHBaseCluster.java
        Hide
        Hudson added a comment -

        Integrated in HBase-0.94 #198 (See https://builds.apache.org/job/HBase-0.94/198/)
        HBASE-6011. Unable to start master in local mode (Revision 1339904)

        Result = FAILURE
        apurtell :
        Files :

        • /hbase/branches/0.94/src/main/java/org/apache/hadoop/hbase/LocalHBaseCluster.java
        • /hbase/branches/0.94/src/test/java/org/apache/hadoop/hbase/TestLocalHBaseCluster.java
        Show
        Hudson added a comment - Integrated in HBase-0.94 #198 (See https://builds.apache.org/job/HBase-0.94/198/ ) HBASE-6011 . Unable to start master in local mode (Revision 1339904) Result = FAILURE apurtell : Files : /hbase/branches/0.94/src/main/java/org/apache/hadoop/hbase/LocalHBaseCluster.java /hbase/branches/0.94/src/test/java/org/apache/hadoop/hbase/TestLocalHBaseCluster.java
        Hide
        Hudson added a comment -

        Integrated in HBase-TRUNK #2896 (See https://builds.apache.org/job/HBase-TRUNK/2896/)
        HBASE-6011. Unable to start master in local mode (Revision 1339902)

        Result = FAILURE
        apurtell :
        Files :

        • /hbase/trunk/src/main/java/org/apache/hadoop/hbase/LocalHBaseCluster.java
        • /hbase/trunk/src/test/java/org/apache/hadoop/hbase/TestLocalHBaseCluster.java
        Show
        Hudson added a comment - Integrated in HBase-TRUNK #2896 (See https://builds.apache.org/job/HBase-TRUNK/2896/ ) HBASE-6011 . Unable to start master in local mode (Revision 1339902) Result = FAILURE apurtell : Files : /hbase/trunk/src/main/java/org/apache/hadoop/hbase/LocalHBaseCluster.java /hbase/trunk/src/test/java/org/apache/hadoop/hbase/TestLocalHBaseCluster.java
        Hide
        stack added a comment -

        +1

        Thanks for fixing. I noticed this last night but then got distracted. Was for sure it was me.

        Show
        stack added a comment - +1 Thanks for fixing. I noticed this last night but then got distracted. Was for sure it was me.
        Hide
        Andrew Purtell added a comment -

        Committed to trunk, 0.94, and 0.92 branches, was a problem on all. New test passes locally for all.

        Show
        Andrew Purtell added a comment - Committed to trunk, 0.94, and 0.92 branches, was a problem on all. New test passes locally for all.
        Hide
        Andrew Purtell added a comment -

        Will commit v2 soon if no objection.

        Show
        Andrew Purtell added a comment - Will commit v2 soon if no objection.
        Hide
        Hadoop QA added a comment -

        -1 overall. Here are the results of testing the latest attachment
        http://issues.apache.org/jira/secure/attachment/12527668/6011-v2.patch
        against trunk revision .

        +1 @author. The patch does not contain any @author tags.

        +1 tests included. The patch appears to include 3 new or modified tests.

        +1 hadoop23. The patch compiles against the hadoop 0.23.x profile.

        +1 javadoc. The javadoc tool did not generate any warning messages.

        +1 javac. The applied patch does not increase the total number of javac compiler warnings.

        -1 findbugs. The patch appears to introduce 31 new Findbugs (version 1.3.9) warnings.

        +1 release audit. The applied patch does not increase the total number of release audit warnings.

        -1 core tests. The patch failed these unit tests:
        org.apache.hadoop.hbase.regionserver.TestSplitTransactionOnCluster
        org.apache.hadoop.hbase.util.TestHBaseFsck

        Test results: https://builds.apache.org/job/PreCommit-HBASE-Build/1893//testReport/
        Findbugs warnings: https://builds.apache.org/job/PreCommit-HBASE-Build/1893//artifact/trunk/patchprocess/newPatchFindbugsWarnings.html
        Console output: https://builds.apache.org/job/PreCommit-HBASE-Build/1893//console

        This message is automatically generated.

        Show
        Hadoop QA added a comment - -1 overall. Here are the results of testing the latest attachment http://issues.apache.org/jira/secure/attachment/12527668/6011-v2.patch against trunk revision . +1 @author. The patch does not contain any @author tags. +1 tests included. The patch appears to include 3 new or modified tests. +1 hadoop23. The patch compiles against the hadoop 0.23.x profile. +1 javadoc. The javadoc tool did not generate any warning messages. +1 javac. The applied patch does not increase the total number of javac compiler warnings. -1 findbugs. The patch appears to introduce 31 new Findbugs (version 1.3.9) warnings. +1 release audit. The applied patch does not increase the total number of release audit warnings. -1 core tests. The patch failed these unit tests: org.apache.hadoop.hbase.regionserver.TestSplitTransactionOnCluster org.apache.hadoop.hbase.util.TestHBaseFsck Test results: https://builds.apache.org/job/PreCommit-HBASE-Build/1893//testReport/ Findbugs warnings: https://builds.apache.org/job/PreCommit-HBASE-Build/1893//artifact/trunk/patchprocess/newPatchFindbugsWarnings.html Console output: https://builds.apache.org/job/PreCommit-HBASE-Build/1893//console This message is automatically generated.
        Hide
        Andrew Purtell added a comment -

        v2 includes a test that passes locally for me.

        Show
        Andrew Purtell added a comment - v2 includes a test that passes locally for me.
        Hide
        Andrew Purtell added a comment -

        The test failures are unrelated but I'll add a test.

        Show
        Andrew Purtell added a comment - The test failures are unrelated but I'll add a test.
        Hide
        Hadoop QA added a comment -

        -1 overall. Here are the results of testing the latest attachment
        http://issues.apache.org/jira/secure/attachment/12527555/6011.patch
        against trunk revision .

        +1 @author. The patch does not contain any @author tags.

        -1 tests included. The patch doesn't appear to include any new or modified tests.
        Please justify why no new tests are needed for this patch.
        Also please list what manual steps were performed to verify this patch.

        +1 hadoop23. The patch compiles against the hadoop 0.23.x profile.

        +1 javadoc. The javadoc tool did not generate any warning messages.

        +1 javac. The applied patch does not increase the total number of javac compiler warnings.

        -1 findbugs. The patch appears to introduce 31 new Findbugs (version 1.3.9) warnings.

        +1 release audit. The applied patch does not increase the total number of release audit warnings.

        -1 core tests. The patch failed these unit tests:
        org.apache.hadoop.hbase.regionserver.TestSplitTransactionOnCluster
        org.apache.hadoop.hbase.regionserver.TestServerCustomProtocol

        Test results: https://builds.apache.org/job/PreCommit-HBASE-Build/1882//testReport/
        Findbugs warnings: https://builds.apache.org/job/PreCommit-HBASE-Build/1882//artifact/trunk/patchprocess/newPatchFindbugsWarnings.html
        Console output: https://builds.apache.org/job/PreCommit-HBASE-Build/1882//console

        This message is automatically generated.

        Show
        Hadoop QA added a comment - -1 overall. Here are the results of testing the latest attachment http://issues.apache.org/jira/secure/attachment/12527555/6011.patch against trunk revision . +1 @author. The patch does not contain any @author tags. -1 tests included. The patch doesn't appear to include any new or modified tests. Please justify why no new tests are needed for this patch. Also please list what manual steps were performed to verify this patch. +1 hadoop23. The patch compiles against the hadoop 0.23.x profile. +1 javadoc. The javadoc tool did not generate any warning messages. +1 javac. The applied patch does not increase the total number of javac compiler warnings. -1 findbugs. The patch appears to introduce 31 new Findbugs (version 1.3.9) warnings. +1 release audit. The applied patch does not increase the total number of release audit warnings. -1 core tests. The patch failed these unit tests: org.apache.hadoop.hbase.regionserver.TestSplitTransactionOnCluster org.apache.hadoop.hbase.regionserver.TestServerCustomProtocol Test results: https://builds.apache.org/job/PreCommit-HBASE-Build/1882//testReport/ Findbugs warnings: https://builds.apache.org/job/PreCommit-HBASE-Build/1882//artifact/trunk/patchprocess/newPatchFindbugsWarnings.html Console output: https://builds.apache.org/job/PreCommit-HBASE-Build/1882//console This message is automatically generated.
        Hide
        Andrew Purtell added a comment -

        Patch against trunk fixes the problem and it applies to 0.92 and 0.94 too with fuzz.

        Show
        Andrew Purtell added a comment - Patch against trunk fixes the problem and it applies to 0.92 and 0.94 too with fuzz.

          People

          • Assignee:
            Andrew Purtell
            Reporter:
            Andrew Purtell
          • Votes:
            0 Vote for this issue
            Watchers:
            6 Start watching this issue

            Dates

            • Created:
              Updated:
              Resolved:

              Development