Details

    • Type: Test Test
    • Status: Closed
    • Priority: Minor Minor
    • Resolution: Fixed
    • Affects Version/s: 0.95.2
    • Fix Version/s: 0.95.0
    • Component/s: test
    • Labels:
      None
    • Hadoop Flags:
      Reviewed

      Description

      Running org.apache.hadoop.hbase.client.TestAdmin
      Tests run: 39, Failures: 0, Errors: 1, Skipped: 0, Time elapsed: 132.155 sec <<< FAILURE!

      Tests in error:
      testCheckHBaseAvailableWithoutCluster(org.apache.hadoop.hbase.client.TestAdmin): For input string: "localhost"

      1. hbase_5989.patch
        0.8 kB
        Jimmy Xiang

        Activity

        Hide
        stack added a comment -

        Marking closed.

        Show
        stack added a comment - Marking closed.
        Hide
        Hudson added a comment -

        Integrated in HBase-TRUNK-on-Hadoop-2.0.0 #2 (See https://builds.apache.org/job/HBase-TRUNK-on-Hadoop-2.0.0/2/)
        HBASE-5989 TestAdmin failed on Hadoop 2.0.0 (Revision 1337450)

        Result = FAILURE
        stack :
        Files :

        • /hbase/trunk/src/test/java/org/apache/hadoop/hbase/client/TestAdmin.java
        Show
        Hudson added a comment - Integrated in HBase-TRUNK-on-Hadoop-2.0.0 #2 (See https://builds.apache.org/job/HBase-TRUNK-on-Hadoop-2.0.0/2/ ) HBASE-5989 TestAdmin failed on Hadoop 2.0.0 (Revision 1337450) Result = FAILURE stack : Files : /hbase/trunk/src/test/java/org/apache/hadoop/hbase/client/TestAdmin.java
        Hide
        Hudson added a comment -

        Integrated in HBase-TRUNK #2873 (See https://builds.apache.org/job/HBase-TRUNK/2873/)
        HBASE-5989 TestAdmin failed on Hadoop 2.0.0 (Revision 1337450)

        Result = FAILURE
        stack :
        Files :

        • /hbase/trunk/src/test/java/org/apache/hadoop/hbase/client/TestAdmin.java
        Show
        Hudson added a comment - Integrated in HBase-TRUNK #2873 (See https://builds.apache.org/job/HBase-TRUNK/2873/ ) HBASE-5989 TestAdmin failed on Hadoop 2.0.0 (Revision 1337450) Result = FAILURE stack : Files : /hbase/trunk/src/test/java/org/apache/hadoop/hbase/client/TestAdmin.java
        Hide
        stack added a comment -

        Committed to TRUNK. Thanks for the patch Jimmy. I looked in 0.94. The patch doesn't apply because there isn't code like this there.

        Show
        stack added a comment - Committed to TRUNK. Thanks for the patch Jimmy. I looked in 0.94. The patch doesn't apply because there isn't code like this there.
        Hide
        Jimmy Xiang added a comment -

        It is for trunk. I haven't checked other branch.

        Show
        Jimmy Xiang added a comment - It is for trunk. I haven't checked other branch.
        Hide
        stack added a comment -

        +1 on patch (duh). I should put this in 0.90 on up to trunk Jimmy?

        Show
        stack added a comment - +1 on patch (duh). I should put this in 0.90 on up to trunk Jimmy?
        Hide
        Hadoop QA added a comment -

        -1 overall. Here are the results of testing the latest attachment
        http://issues.apache.org/jira/secure/attachment/12526548/hbase_5989.patch
        against trunk revision .

        +1 @author. The patch does not contain any @author tags.

        +1 tests included. The patch appears to include 3 new or modified tests.

        +1 hadoop23. The patch compiles against the hadoop 0.23.x profile.

        +1 javadoc. The javadoc tool did not generate any warning messages.

        +1 javac. The applied patch does not increase the total number of javac compiler warnings.

        +1 findbugs. The patch does not introduce any new Findbugs (version 1.3.9) warnings.

        +1 release audit. The applied patch does not increase the total number of release audit warnings.

        -1 core tests. The patch failed these unit tests:
        org.apache.hadoop.hbase.coprocessor.TestClassLoading
        org.apache.hadoop.hbase.TestDrainingServer

        Test results: https://builds.apache.org/job/PreCommit-HBASE-Build/1848//testReport/
        Findbugs warnings: https://builds.apache.org/job/PreCommit-HBASE-Build/1848//artifact/trunk/patchprocess/newPatchFindbugsWarnings.html
        Console output: https://builds.apache.org/job/PreCommit-HBASE-Build/1848//console

        This message is automatically generated.

        Show
        Hadoop QA added a comment - -1 overall. Here are the results of testing the latest attachment http://issues.apache.org/jira/secure/attachment/12526548/hbase_5989.patch against trunk revision . +1 @author. The patch does not contain any @author tags. +1 tests included. The patch appears to include 3 new or modified tests. +1 hadoop23. The patch compiles against the hadoop 0.23.x profile. +1 javadoc. The javadoc tool did not generate any warning messages. +1 javac. The applied patch does not increase the total number of javac compiler warnings. +1 findbugs. The patch does not introduce any new Findbugs (version 1.3.9) warnings. +1 release audit. The applied patch does not increase the total number of release audit warnings. -1 core tests. The patch failed these unit tests: org.apache.hadoop.hbase.coprocessor.TestClassLoading org.apache.hadoop.hbase.TestDrainingServer Test results: https://builds.apache.org/job/PreCommit-HBASE-Build/1848//testReport/ Findbugs warnings: https://builds.apache.org/job/PreCommit-HBASE-Build/1848//artifact/trunk/patchprocess/newPatchFindbugsWarnings.html Console output: https://builds.apache.org/job/PreCommit-HBASE-Build/1848//console This message is automatically generated.
        Hide
        Jimmy Xiang added a comment -

        I was wondering how the test worked before. hbase.zookeeper.quorum should never be an int.

        Show
        Jimmy Xiang added a comment - I was wondering how the test worked before. hbase.zookeeper.quorum should never be an int.
        Hide
        Jimmy Xiang added a comment -

        Now, the test works for hadoop 1.0, 0.23 and 2.0.

        Show
        Jimmy Xiang added a comment - Now, the test works for hadoop 1.0, 0.23 and 2.0.

          People

          • Assignee:
            Jimmy Xiang
            Reporter:
            Jimmy Xiang
          • Votes:
            0 Vote for this issue
            Watchers:
            1 Start watching this issue

            Dates

            • Created:
              Updated:
              Resolved:

              Development