Uploaded image for project: 'HBase'
  1. HBase
  2. HBASE-18627

Fix TestRegionServerReadRequestMetrics

    Details

    • Type: Bug
    • Status: Resolved
    • Priority: Major
    • Resolution: Fixed
    • Affects Version/s: None
    • Fix Version/s: 2.0.0-alpha-3
    • Component/s: test
    • Labels:
      None
    • Hadoop Flags:
      Reviewed

      Description

      HBASE-18511 enable no-regions-on-master as default. That feature mess up the metrics in TestRegionServerReadRequestMetrics.

      1. HBASE-18627.v0.patch
        0.9 kB
        Chia-Ping Tsai
      2. HBASE-18627.v0.patch
        0.9 kB
        Chia-Ping Tsai

        Issue Links

          Activity

          Hide
          chia7712 Chia-Ping Tsai added a comment -

          I have run the tests 50 times. All pass.

          Show
          chia7712 Chia-Ping Tsai added a comment - I have run the tests 50 times. All pass.
          Hide
          hadoopqa Hadoop QA added a comment -
          -1 overall



          Vote Subsystem Runtime Comment
          0 reexec 0m 16s Docker mode activated.
          +1 hbaseanti 0m 0s Patch does not have any anti-patterns.
          +1 @author 0m 0s The patch does not contain any @author tags.
          +1 test4tests 0m 0s The patch appears to include 1 new or modified test files.
          +1 mvninstall 4m 40s master passed
          +1 compile 0m 51s master passed
          +1 checkstyle 1m 0s master passed
          +1 mvneclipse 0m 20s master passed
          +1 findbugs 4m 9s master passed
          +1 javadoc 0m 39s master passed
          +1 mvninstall 1m 3s the patch passed
          +1 compile 0m 54s the patch passed
          +1 javac 0m 54s the patch passed
          +1 checkstyle 1m 0s the patch passed
          +1 mvneclipse 0m 20s the patch passed
          +1 whitespace 0m 0s The patch has no whitespace issues.
          +1 hadoopcheck 44m 36s Patch does not cause any errors with Hadoop 2.6.1 2.6.2 2.6.3 2.6.4 2.6.5 2.7.1 2.7.2 2.7.3 or 3.0.0-alpha4.
          +1 findbugs 5m 8s the patch passed
          +1 javadoc 0m 45s the patch passed
          -1 unit 85m 46s hbase-server in the patch failed.
          +1 asflicense 0m 31s The patch does not generate ASF License warnings.
          152m 25s



          Reason Tests
          Failed junit tests hadoop.hbase.client.TestMetaWithReplicas
          Timed out junit tests org.apache.hadoop.hbase.master.procedure.TestServerCrashProcedure
            org.apache.hadoop.hbase.regionserver.TestRowTooBig
            org.apache.hadoop.hbase.regionserver.compactions.TestFIFOCompactionPolicy
            org.apache.hadoop.hbase.master.TestGetLastFlushedSequenceId
            org.apache.hadoop.hbase.regionserver.wal.TestFSHLog
            org.apache.hadoop.hbase.regionserver.TestCompaction
            org.apache.hadoop.hbase.master.balancer.TestStochasticLoadBalancer2
            org.apache.hadoop.hbase.regionserver.TestRegionServerMetrics
            org.apache.hadoop.hbase.snapshot.TestSnapshotClientRetries
            org.apache.hadoop.hbase.backup.TestRemoteBackup
            org.apache.hadoop.hbase.master.TestAssignmentManagerMetrics
            org.apache.hadoop.hbase.regionserver.TestTimestampFilterSeekHint
            org.apache.hadoop.hbase.TestHBaseTestingUtility
            org.apache.hadoop.hbase.wal.TestWALFiltering
            org.apache.hadoop.hbase.backup.TestFullBackup
            org.apache.hadoop.hbase.replication.regionserver.TestWALEntryStream
            org.apache.hadoop.hbase.master.TestGetInfoPort
            org.apache.hadoop.hbase.TestZooKeeper
            org.apache.hadoop.hbase.wal.TestWALSplitCompressed
            org.apache.hadoop.hbase.master.TestMasterFailoverBalancerPersistence
            org.apache.hadoop.hbase.filter.TestScanRowPrefix
            org.apache.hadoop.hbase.regionserver.TestColumnSeeking
            org.apache.hadoop.hbase.regionserver.TestRegionServerAbort
            org.apache.hadoop.hbase.quotas.TestRegionSizeUse
            org.apache.hadoop.hbase.backup.TestBackupDescribe
            org.apache.hadoop.hbase.io.asyncfs.TestSaslFanOutOneBlockAsyncDFSOutput
            org.apache.hadoop.hbase.regionserver.wal.TestLogRollAbort
            org.apache.hadoop.hbase.backup.TestRepairAfterFailedDelete
            org.apache.hadoop.hbase.util.TestHBaseFsckEncryption
            org.apache.hadoop.hbase.master.TestTableStateManager
            org.apache.hadoop.hbase.backup.TestBackupDeleteRestore
            org.apache.hadoop.hbase.master.assignment.TestAssignmentOnRSCrash
            org.apache.hadoop.hbase.regionserver.TestWalAndCompactingMemStoreFlush
            org.apache.hadoop.hbase.io.asyncfs.TestFanOutOneBlockAsyncDFSOutput
            org.apache.hadoop.hbase.master.TestMasterRestartAfterDisablingTable
            org.apache.hadoop.hbase.master.TestSplitLogManager
            org.apache.hadoop.hbase.master.procedure.TestWALProcedureStoreOnHDFS
            org.apache.hadoop.hbase.master.balancer.TestFavoredNodeTableImport
            org.apache.hadoop.hbase.master.balancer.TestStochasticLoadBalancer
            org.apache.hadoop.hbase.master.TestRollingRestart
            org.apache.hadoop.hbase.regionserver.TestSplitWalDataLoss
            org.apache.hadoop.hbase.io.encoding.TestDataBlockEncoders
            org.apache.hadoop.hbase.master.TestDistributedLogSplitting
            org.apache.hadoop.hbase.TestJMXConnectorServer
            org.apache.hadoop.hbase.util.TestMiniClusterLoadEncoded
            org.apache.hadoop.hbase.master.TestDeadServer
            org.apache.hadoop.hbase.backup.TestFullBackupSet
            org.apache.hadoop.hbase.backup.TestRemoteRestore
            org.apache.hadoop.hbase.backup.TestIncrementalBackupDeleteTable
            org.apache.hadoop.hbase.regionserver.TestRegionServerReportForDuty
            org.apache.hadoop.hbase.util.TestMiniClusterLoadSequential
            org.apache.hadoop.hbase.master.TestMasterShutdown
            org.apache.hadoop.hbase.regionserver.wal.TestLogRolling
            org.apache.hadoop.hbase.backup.TestFullRestore
            org.apache.hadoop.hbase.security.TestSecureIPC
            org.apache.hadoop.hbase.regionserver.throttle.TestCompactionWithThroughputController
            org.apache.hadoop.hbase.backup.TestBackupDelete
            org.apache.hadoop.hbase.regionserver.TestPerColumnFamilyFlush
            org.apache.hadoop.hbase.backup.master.TestBackupLogCleaner
            org.apache.hadoop.hbase.client.TestAdmin2
            org.apache.hadoop.hbase.io.hfile.TestScannerSelectionUsingTTL
            org.apache.hadoop.hbase.mapreduce.TestHFileOutputFormat2
            org.apache.hadoop.hbase.regionserver.wal.TestLogRollingNoCluster
            org.apache.hadoop.hbase.regionserver.TestJoinedScanners
            org.apache.hadoop.hbase.regionserver.TestScannerWithBulkload
            org.apache.hadoop.hbase.regionserver.wal.TestAsyncFSWAL
            org.apache.hadoop.hbase.backup.TestIncrementalBackupMergeWithFailures
            org.apache.hadoop.hbase.regionserver.throttle.TestFlushWithThroughputController
            org.apache.hadoop.hbase.regionserver.TestCompactingToCellFlatMapMemStore
            org.apache.hadoop.hbase.mob.TestExpiredMobFileCleaner
            org.apache.hadoop.hbase.filter.TestFuzzyRowAndColumnRangeFilter
            org.apache.hadoop.hbase.snapshot.TestExportSnapshotNoCluster
            org.apache.hadoop.hbase.TestAcidGuarantees
            org.apache.hadoop.hbase.TestGlobalMemStoreSize
            org.apache.hadoop.hbase.regionserver.TestCompactionWithCoprocessor
            org.apache.hadoop.hbase.master.assignment.TestRegionStates
            org.apache.hadoop.hbase.backup.TestIncrementalBackupWithFailures
            org.apache.hadoop.hbase.io.hfile.TestForceCacheImportantBlocks
            org.apache.hadoop.hbase.regionserver.TestHRegionOnCluster
            org.apache.hadoop.hbase.regionserver.TestCompoundBloomFilter
            org.apache.hadoop.hbase.regionserver.TestHRegionServerBulkLoadWithOldClient
            org.apache.hadoop.hbase.regionserver.TestRecoveredEdits
            org.apache.hadoop.hbase.backup.TestBackupDeleteWithFailures
            org.apache.hadoop.hbase.master.procedure.TestMasterProcedureSchedulerConcurrency
            org.apache.hadoop.hbase.security.visibility.TestVisibilityLabelReplicationWithExpAsString
            org.apache.hadoop.hbase.filter.TestMultiRowRangeFilter
            org.apache.hadoop.hbase.backup.TestFullBackupWithFailures
            org.apache.hadoop.hbase.security.visibility.TestVisibilityLabelsReplication
            org.apache.hadoop.hbase.TestHBaseOnOtherDfsCluster
            org.apache.hadoop.hbase.master.snapshot.TestSnapshotFileCache
            org.apache.hadoop.hbase.replication.TestReplicationTableBase
            org.apache.hadoop.hbase.filter.TestColumnRangeFilter
            org.apache.hadoop.hbase.master.TestRestartCluster
            org.apache.hadoop.hbase.quotas.TestQuotaObserverChoreRegionReports
            org.apache.hadoop.hbase.TestIOFencing
            org.apache.hadoop.hbase.regionserver.TestRSKilledWhenInitializing
            org.apache.hadoop.hbase.regionserver.TestHRegion
            org.apache.hadoop.hbase.util.TestMiniClusterLoadParallel
            org.apache.hadoop.hbase.master.balancer.TestRegionsOnMasterOptions
            org.apache.hadoop.hbase.io.hfile.TestCacheOnWrite
            org.apache.hadoop.hbase.io.encoding.TestLoadAndSwitchEncodeOnDisk
            org.apache.hadoop.hbase.TestLocalHBaseCluster
            org.apache.hadoop.hbase.regionserver.TestMultiColumnScanner
            org.apache.hadoop.hbase.backup.TestBackupStatusProgress
            org.apache.hadoop.hbase.regionserver.TestClusterId
            org.apache.hadoop.hbase.regionserver.TestRegionServerHostname
            org.apache.hadoop.hbase.backup.TestRestoreBoundaryTests
            org.apache.hadoop.hbase.backup.TestBackupBoundaryTests
            org.apache.hadoop.hbase.fs.TestBlockReorder
            org.apache.hadoop.hbase.client.TestTableSnapshotScanner
            org.apache.hadoop.hbase.regionserver.TestEndToEndSplitTransaction
            org.apache.hadoop.hbase.regionserver.TestHRegionReplayEvents
            org.apache.hadoop.hbase.security.access.TestCoprocessorWhitelistMasterObserver
            org.apache.hadoop.hbase.replication.TestMultiSlaveReplication
            org.apache.hadoop.hbase.io.hfile.TestHFileBlock
            org.apache.hadoop.hbase.regionserver.TestRegionReplicaFailover
            org.apache.hadoop.hbase.util.TestConnectionCache
            org.apache.hadoop.hbase.backup.TestBackupRepair
            org.apache.hadoop.hbase.client.TestBlockEvictionFromClient
            org.apache.hadoop.hbase.regionserver.TestStore
            org.apache.hadoop.hbase.wal.TestBoundedRegionGroupingStrategy
            org.apache.hadoop.hbase.wal.TestWALFactory
            org.apache.hadoop.hbase.backup.TestIncrementalBackupWithBulkLoad
            org.apache.hadoop.hbase.backup.TestBackupMultipleDeletes
            org.apache.hadoop.hbase.wal.TestFSHLogProvider
            org.apache.hadoop.hbase.util.TestIdReadWriteLock
            org.apache.hadoop.hbase.filter.TestFuzzyRowFilterEndToEnd
            org.apache.hadoop.hbase.regionserver.TestHRegionServerBulkLoad
            org.apache.hadoop.hbase.mapreduce.TestTableSnapshotInputFormat
            org.apache.hadoop.hbase.replication.regionserver.TestReplicationSourceManagerZkImpl
            org.apache.hadoop.hbase.replication.TestMasterReplication
            org.apache.hadoop.hbase.replication.TestReplicationSource
            org.apache.hadoop.hbase.master.procedure.TestFastFailOnProcedureNotRegistered
            org.apache.hadoop.hbase.regionserver.TestAtomicOperation
            org.apache.hadoop.hbase.backup.TestFullBackupSetRestoreSet
            org.apache.hadoop.hbase.tool.TestCanaryTool
            org.apache.hadoop.hbase.io.TestFileLink
            org.apache.hadoop.hbase.mapred.TestTableSnapshotInputFormat
            org.apache.hadoop.hbase.io.encoding.TestBufferedDataBlockEncoder
            org.apache.hadoop.hbase.regionserver.TestMajorCompaction
            org.apache.hadoop.hbase.regionserver.TestCompactionArchiveIOException
            org.apache.hadoop.hbase.util.TestFSUtils
            org.apache.hadoop.hbase.backup.TestBackupShowHistory
            org.apache.hadoop.hbase.io.encoding.TestEncodedSeekers
            org.apache.hadoop.hbase.wal.TestWALSplit
            org.apache.hadoop.hbase.backup.TestIncrementalBackup



          Subsystem Report/Notes
          Docker Client=1.11.2 Server=1.11.2 Image:yetus/hbase:bdc94b1
          JIRA Issue HBASE-18627
          JIRA Patch URL https://issues.apache.org/jira/secure/attachment/12882595/HBASE-18627.v0.patch
          Optional Tests asflicense javac javadoc unit findbugs hadoopcheck hbaseanti checkstyle compile
          uname Linux bf012da84808 3.13.0-116-generic #163-Ubuntu SMP Fri Mar 31 14:13:22 UTC 2017 x86_64 x86_64 x86_64 GNU/Linux
          Build tool maven
          Personality /home/jenkins/jenkins-slave/workspace/PreCommit-HBASE-Build/component/dev-support/hbase-personality.sh
          git revision master / 7fee03e
          Default Java 1.8.0_144
          findbugs v3.1.0-RC3
          unit https://builds.apache.org/job/PreCommit-HBASE-Build/8152/artifact/patchprocess/patch-unit-hbase-server.txt
          Test Results https://builds.apache.org/job/PreCommit-HBASE-Build/8152/testReport/
          modules C: hbase-server U: hbase-server
          Console output https://builds.apache.org/job/PreCommit-HBASE-Build/8152/console
          Powered by Apache Yetus 0.4.0 http://yetus.apache.org

          This message was automatically generated.

          Show
          hadoopqa Hadoop QA added a comment - -1 overall Vote Subsystem Runtime Comment 0 reexec 0m 16s Docker mode activated. +1 hbaseanti 0m 0s Patch does not have any anti-patterns. +1 @author 0m 0s The patch does not contain any @author tags. +1 test4tests 0m 0s The patch appears to include 1 new or modified test files. +1 mvninstall 4m 40s master passed +1 compile 0m 51s master passed +1 checkstyle 1m 0s master passed +1 mvneclipse 0m 20s master passed +1 findbugs 4m 9s master passed +1 javadoc 0m 39s master passed +1 mvninstall 1m 3s the patch passed +1 compile 0m 54s the patch passed +1 javac 0m 54s the patch passed +1 checkstyle 1m 0s the patch passed +1 mvneclipse 0m 20s the patch passed +1 whitespace 0m 0s The patch has no whitespace issues. +1 hadoopcheck 44m 36s Patch does not cause any errors with Hadoop 2.6.1 2.6.2 2.6.3 2.6.4 2.6.5 2.7.1 2.7.2 2.7.3 or 3.0.0-alpha4. +1 findbugs 5m 8s the patch passed +1 javadoc 0m 45s the patch passed -1 unit 85m 46s hbase-server in the patch failed. +1 asflicense 0m 31s The patch does not generate ASF License warnings. 152m 25s Reason Tests Failed junit tests hadoop.hbase.client.TestMetaWithReplicas Timed out junit tests org.apache.hadoop.hbase.master.procedure.TestServerCrashProcedure   org.apache.hadoop.hbase.regionserver.TestRowTooBig   org.apache.hadoop.hbase.regionserver.compactions.TestFIFOCompactionPolicy   org.apache.hadoop.hbase.master.TestGetLastFlushedSequenceId   org.apache.hadoop.hbase.regionserver.wal.TestFSHLog   org.apache.hadoop.hbase.regionserver.TestCompaction   org.apache.hadoop.hbase.master.balancer.TestStochasticLoadBalancer2   org.apache.hadoop.hbase.regionserver.TestRegionServerMetrics   org.apache.hadoop.hbase.snapshot.TestSnapshotClientRetries   org.apache.hadoop.hbase.backup.TestRemoteBackup   org.apache.hadoop.hbase.master.TestAssignmentManagerMetrics   org.apache.hadoop.hbase.regionserver.TestTimestampFilterSeekHint   org.apache.hadoop.hbase.TestHBaseTestingUtility   org.apache.hadoop.hbase.wal.TestWALFiltering   org.apache.hadoop.hbase.backup.TestFullBackup   org.apache.hadoop.hbase.replication.regionserver.TestWALEntryStream   org.apache.hadoop.hbase.master.TestGetInfoPort   org.apache.hadoop.hbase.TestZooKeeper   org.apache.hadoop.hbase.wal.TestWALSplitCompressed   org.apache.hadoop.hbase.master.TestMasterFailoverBalancerPersistence   org.apache.hadoop.hbase.filter.TestScanRowPrefix   org.apache.hadoop.hbase.regionserver.TestColumnSeeking   org.apache.hadoop.hbase.regionserver.TestRegionServerAbort   org.apache.hadoop.hbase.quotas.TestRegionSizeUse   org.apache.hadoop.hbase.backup.TestBackupDescribe   org.apache.hadoop.hbase.io.asyncfs.TestSaslFanOutOneBlockAsyncDFSOutput   org.apache.hadoop.hbase.regionserver.wal.TestLogRollAbort   org.apache.hadoop.hbase.backup.TestRepairAfterFailedDelete   org.apache.hadoop.hbase.util.TestHBaseFsckEncryption   org.apache.hadoop.hbase.master.TestTableStateManager   org.apache.hadoop.hbase.backup.TestBackupDeleteRestore   org.apache.hadoop.hbase.master.assignment.TestAssignmentOnRSCrash   org.apache.hadoop.hbase.regionserver.TestWalAndCompactingMemStoreFlush   org.apache.hadoop.hbase.io.asyncfs.TestFanOutOneBlockAsyncDFSOutput   org.apache.hadoop.hbase.master.TestMasterRestartAfterDisablingTable   org.apache.hadoop.hbase.master.TestSplitLogManager   org.apache.hadoop.hbase.master.procedure.TestWALProcedureStoreOnHDFS   org.apache.hadoop.hbase.master.balancer.TestFavoredNodeTableImport   org.apache.hadoop.hbase.master.balancer.TestStochasticLoadBalancer   org.apache.hadoop.hbase.master.TestRollingRestart   org.apache.hadoop.hbase.regionserver.TestSplitWalDataLoss   org.apache.hadoop.hbase.io.encoding.TestDataBlockEncoders   org.apache.hadoop.hbase.master.TestDistributedLogSplitting   org.apache.hadoop.hbase.TestJMXConnectorServer   org.apache.hadoop.hbase.util.TestMiniClusterLoadEncoded   org.apache.hadoop.hbase.master.TestDeadServer   org.apache.hadoop.hbase.backup.TestFullBackupSet   org.apache.hadoop.hbase.backup.TestRemoteRestore   org.apache.hadoop.hbase.backup.TestIncrementalBackupDeleteTable   org.apache.hadoop.hbase.regionserver.TestRegionServerReportForDuty   org.apache.hadoop.hbase.util.TestMiniClusterLoadSequential   org.apache.hadoop.hbase.master.TestMasterShutdown   org.apache.hadoop.hbase.regionserver.wal.TestLogRolling   org.apache.hadoop.hbase.backup.TestFullRestore   org.apache.hadoop.hbase.security.TestSecureIPC   org.apache.hadoop.hbase.regionserver.throttle.TestCompactionWithThroughputController   org.apache.hadoop.hbase.backup.TestBackupDelete   org.apache.hadoop.hbase.regionserver.TestPerColumnFamilyFlush   org.apache.hadoop.hbase.backup.master.TestBackupLogCleaner   org.apache.hadoop.hbase.client.TestAdmin2   org.apache.hadoop.hbase.io.hfile.TestScannerSelectionUsingTTL   org.apache.hadoop.hbase.mapreduce.TestHFileOutputFormat2   org.apache.hadoop.hbase.regionserver.wal.TestLogRollingNoCluster   org.apache.hadoop.hbase.regionserver.TestJoinedScanners   org.apache.hadoop.hbase.regionserver.TestScannerWithBulkload   org.apache.hadoop.hbase.regionserver.wal.TestAsyncFSWAL   org.apache.hadoop.hbase.backup.TestIncrementalBackupMergeWithFailures   org.apache.hadoop.hbase.regionserver.throttle.TestFlushWithThroughputController   org.apache.hadoop.hbase.regionserver.TestCompactingToCellFlatMapMemStore   org.apache.hadoop.hbase.mob.TestExpiredMobFileCleaner   org.apache.hadoop.hbase.filter.TestFuzzyRowAndColumnRangeFilter   org.apache.hadoop.hbase.snapshot.TestExportSnapshotNoCluster   org.apache.hadoop.hbase.TestAcidGuarantees   org.apache.hadoop.hbase.TestGlobalMemStoreSize   org.apache.hadoop.hbase.regionserver.TestCompactionWithCoprocessor   org.apache.hadoop.hbase.master.assignment.TestRegionStates   org.apache.hadoop.hbase.backup.TestIncrementalBackupWithFailures   org.apache.hadoop.hbase.io.hfile.TestForceCacheImportantBlocks   org.apache.hadoop.hbase.regionserver.TestHRegionOnCluster   org.apache.hadoop.hbase.regionserver.TestCompoundBloomFilter   org.apache.hadoop.hbase.regionserver.TestHRegionServerBulkLoadWithOldClient   org.apache.hadoop.hbase.regionserver.TestRecoveredEdits   org.apache.hadoop.hbase.backup.TestBackupDeleteWithFailures   org.apache.hadoop.hbase.master.procedure.TestMasterProcedureSchedulerConcurrency   org.apache.hadoop.hbase.security.visibility.TestVisibilityLabelReplicationWithExpAsString   org.apache.hadoop.hbase.filter.TestMultiRowRangeFilter   org.apache.hadoop.hbase.backup.TestFullBackupWithFailures   org.apache.hadoop.hbase.security.visibility.TestVisibilityLabelsReplication   org.apache.hadoop.hbase.TestHBaseOnOtherDfsCluster   org.apache.hadoop.hbase.master.snapshot.TestSnapshotFileCache   org.apache.hadoop.hbase.replication.TestReplicationTableBase   org.apache.hadoop.hbase.filter.TestColumnRangeFilter   org.apache.hadoop.hbase.master.TestRestartCluster   org.apache.hadoop.hbase.quotas.TestQuotaObserverChoreRegionReports   org.apache.hadoop.hbase.TestIOFencing   org.apache.hadoop.hbase.regionserver.TestRSKilledWhenInitializing   org.apache.hadoop.hbase.regionserver.TestHRegion   org.apache.hadoop.hbase.util.TestMiniClusterLoadParallel   org.apache.hadoop.hbase.master.balancer.TestRegionsOnMasterOptions   org.apache.hadoop.hbase.io.hfile.TestCacheOnWrite   org.apache.hadoop.hbase.io.encoding.TestLoadAndSwitchEncodeOnDisk   org.apache.hadoop.hbase.TestLocalHBaseCluster   org.apache.hadoop.hbase.regionserver.TestMultiColumnScanner   org.apache.hadoop.hbase.backup.TestBackupStatusProgress   org.apache.hadoop.hbase.regionserver.TestClusterId   org.apache.hadoop.hbase.regionserver.TestRegionServerHostname   org.apache.hadoop.hbase.backup.TestRestoreBoundaryTests   org.apache.hadoop.hbase.backup.TestBackupBoundaryTests   org.apache.hadoop.hbase.fs.TestBlockReorder   org.apache.hadoop.hbase.client.TestTableSnapshotScanner   org.apache.hadoop.hbase.regionserver.TestEndToEndSplitTransaction   org.apache.hadoop.hbase.regionserver.TestHRegionReplayEvents   org.apache.hadoop.hbase.security.access.TestCoprocessorWhitelistMasterObserver   org.apache.hadoop.hbase.replication.TestMultiSlaveReplication   org.apache.hadoop.hbase.io.hfile.TestHFileBlock   org.apache.hadoop.hbase.regionserver.TestRegionReplicaFailover   org.apache.hadoop.hbase.util.TestConnectionCache   org.apache.hadoop.hbase.backup.TestBackupRepair   org.apache.hadoop.hbase.client.TestBlockEvictionFromClient   org.apache.hadoop.hbase.regionserver.TestStore   org.apache.hadoop.hbase.wal.TestBoundedRegionGroupingStrategy   org.apache.hadoop.hbase.wal.TestWALFactory   org.apache.hadoop.hbase.backup.TestIncrementalBackupWithBulkLoad   org.apache.hadoop.hbase.backup.TestBackupMultipleDeletes   org.apache.hadoop.hbase.wal.TestFSHLogProvider   org.apache.hadoop.hbase.util.TestIdReadWriteLock   org.apache.hadoop.hbase.filter.TestFuzzyRowFilterEndToEnd   org.apache.hadoop.hbase.regionserver.TestHRegionServerBulkLoad   org.apache.hadoop.hbase.mapreduce.TestTableSnapshotInputFormat   org.apache.hadoop.hbase.replication.regionserver.TestReplicationSourceManagerZkImpl   org.apache.hadoop.hbase.replication.TestMasterReplication   org.apache.hadoop.hbase.replication.TestReplicationSource   org.apache.hadoop.hbase.master.procedure.TestFastFailOnProcedureNotRegistered   org.apache.hadoop.hbase.regionserver.TestAtomicOperation   org.apache.hadoop.hbase.backup.TestFullBackupSetRestoreSet   org.apache.hadoop.hbase.tool.TestCanaryTool   org.apache.hadoop.hbase.io.TestFileLink   org.apache.hadoop.hbase.mapred.TestTableSnapshotInputFormat   org.apache.hadoop.hbase.io.encoding.TestBufferedDataBlockEncoder   org.apache.hadoop.hbase.regionserver.TestMajorCompaction   org.apache.hadoop.hbase.regionserver.TestCompactionArchiveIOException   org.apache.hadoop.hbase.util.TestFSUtils   org.apache.hadoop.hbase.backup.TestBackupShowHistory   org.apache.hadoop.hbase.io.encoding.TestEncodedSeekers   org.apache.hadoop.hbase.wal.TestWALSplit   org.apache.hadoop.hbase.backup.TestIncrementalBackup Subsystem Report/Notes Docker Client=1.11.2 Server=1.11.2 Image:yetus/hbase:bdc94b1 JIRA Issue HBASE-18627 JIRA Patch URL https://issues.apache.org/jira/secure/attachment/12882595/HBASE-18627.v0.patch Optional Tests asflicense javac javadoc unit findbugs hadoopcheck hbaseanti checkstyle compile uname Linux bf012da84808 3.13.0-116-generic #163-Ubuntu SMP Fri Mar 31 14:13:22 UTC 2017 x86_64 x86_64 x86_64 GNU/Linux Build tool maven Personality /home/jenkins/jenkins-slave/workspace/PreCommit-HBASE-Build/component/dev-support/hbase-personality.sh git revision master / 7fee03e Default Java 1.8.0_144 findbugs v3.1.0-RC3 unit https://builds.apache.org/job/PreCommit-HBASE-Build/8152/artifact/patchprocess/patch-unit-hbase-server.txt Test Results https://builds.apache.org/job/PreCommit-HBASE-Build/8152/testReport/ modules C: hbase-server U: hbase-server Console output https://builds.apache.org/job/PreCommit-HBASE-Build/8152/console Powered by Apache Yetus 0.4.0 http://yetus.apache.org This message was automatically generated.
          Hide
          hadoopqa Hadoop QA added a comment -
          -1 overall



          Vote Subsystem Runtime Comment
          0 reexec 21m 9s Docker mode activated.
          +1 hbaseanti 0m 0s Patch does not have any anti-patterns.
          +1 @author 0m 0s The patch does not contain any @author tags.
          +1 test4tests 0m 0s The patch appears to include 1 new or modified test files.
          +1 mvninstall 9m 7s master passed
          +1 compile 1m 6s master passed
          +1 checkstyle 1m 13s master passed
          +1 mvneclipse 0m 30s master passed
          +1 findbugs 4m 52s master passed
          +1 javadoc 0m 56s master passed
          +1 mvninstall 1m 16s the patch passed
          +1 compile 1m 5s the patch passed
          +1 javac 1m 5s the patch passed
          +1 checkstyle 1m 9s the patch passed
          +1 mvneclipse 0m 27s the patch passed
          +1 whitespace 0m 1s The patch has no whitespace issues.
          +1 hadoopcheck 55m 9s Patch does not cause any errors with Hadoop 2.6.1 2.6.2 2.6.3 2.6.4 2.6.5 2.7.1 2.7.2 2.7.3 or 3.0.0-alpha4.
          +1 findbugs 6m 53s the patch passed
          +1 javadoc 0m 59s the patch passed
          -1 unit 181m 40s hbase-server in the patch failed.
          +1 asflicense 0m 51s The patch does not generate ASF License warnings.
          289m 0s



          Reason Tests
          Failed junit tests hadoop.hbase.security.access.TestCoprocessorWhitelistMasterObserver
          Timed out junit tests org.apache.hadoop.hbase.master.procedure.TestServerCrashProcedure
            org.apache.hadoop.hbase.master.procedure.TestCreateTableProcedure
            org.apache.hadoop.hbase.master.TestGetLastFlushedSequenceId
            org.apache.hadoop.hbase.snapshot.TestSnapshotClientRetries
            org.apache.hadoop.hbase.master.balancer.TestStochasticLoadBalancer2
            org.apache.hadoop.hbase.coprocessor.TestRegionObserverScannerOpenHook
            org.apache.hadoop.hbase.wal.TestWALFiltering
            org.apache.hadoop.hbase.TestZooKeeper
            org.apache.hadoop.hbase.wal.TestWALSplitCompressed
            org.apache.hadoop.hbase.quotas.TestRegionSizeUse
            org.apache.hadoop.hbase.util.TestHBaseFsckEncryption
            org.apache.hadoop.hbase.master.assignment.TestAssignmentOnRSCrash
            org.apache.hadoop.hbase.master.TestSplitLogManager
            org.apache.hadoop.hbase.master.balancer.TestFavoredNodeTableImport
            org.apache.hadoop.hbase.master.TestRollingRestart
            org.apache.hadoop.hbase.master.balancer.TestStochasticLoadBalancer
            org.apache.hadoop.hbase.wal.TestSecureWAL
            org.apache.hadoop.hbase.util.TestMiniClusterLoadEncoded
            org.apache.hadoop.hbase.master.TestDistributedLogSplitting
            org.apache.hadoop.hbase.util.TestMiniClusterLoadSequential
            org.apache.hadoop.hbase.mapreduce.TestHFileOutputFormat2
            org.apache.hadoop.hbase.wal.TestWALRootDir
            org.apache.hadoop.hbase.snapshot.TestExportSnapshotNoCluster
            org.apache.hadoop.hbase.master.assignment.TestRegionStates
            org.apache.hadoop.hbase.TestMovedRegionsCleaner
            org.apache.hadoop.hbase.mapreduce.TestWALRecordReader
            org.apache.hadoop.hbase.TestHBaseOnOtherDfsCluster
            org.apache.hadoop.hbase.master.snapshot.TestSnapshotFileCache
            org.apache.hadoop.hbase.quotas.TestQuotaObserverChoreRegionReports
            org.apache.hadoop.hbase.master.TestRestartCluster
            org.apache.hadoop.hbase.util.TestMiniClusterLoadParallel
            org.apache.hadoop.hbase.master.balancer.TestRegionsOnMasterOptions
            org.apache.hadoop.hbase.TestLocalHBaseCluster
            org.apache.hadoop.hbase.fs.TestBlockReorder
            org.apache.hadoop.hbase.coprocessor.TestRegionServerCoprocessorExceptionWithAbort
            org.apache.hadoop.hbase.util.TestConnectionCache
            org.apache.hadoop.hbase.util.TestIdReadWriteLock
            org.apache.hadoop.hbase.mapreduce.TestTableSnapshotInputFormat
            org.apache.hadoop.hbase.tool.TestCanaryTool
            org.apache.hadoop.hbase.util.TestFSUtils
            org.apache.hadoop.hbase.master.procedure.TestTruncateTableProcedure



          Subsystem Report/Notes
          Docker Client=1.13.1 Server=1.13.1 Image:yetus/hbase:bdc94b1
          JIRA Issue HBASE-18627
          JIRA Patch URL https://issues.apache.org/jira/secure/attachment/12882635/HBASE-18627.v0.patch
          Optional Tests asflicense javac javadoc unit findbugs hadoopcheck hbaseanti checkstyle compile
          uname Linux fded8fd6296a 3.13.0-117-generic #164-Ubuntu SMP Fri Apr 7 11:05:26 UTC 2017 x86_64 x86_64 x86_64 GNU/Linux
          Build tool maven
          Personality /home/jenkins/jenkins-slave/workspace/PreCommit-HBASE-Build/component/dev-support/hbase-personality.sh
          git revision master / 56f9e1a
          Default Java 1.8.0_144
          findbugs v3.1.0-RC3
          unit https://builds.apache.org/job/PreCommit-HBASE-Build/8158/artifact/patchprocess/patch-unit-hbase-server.txt
          Test Results https://builds.apache.org/job/PreCommit-HBASE-Build/8158/testReport/
          modules C: hbase-server U: hbase-server
          Console output https://builds.apache.org/job/PreCommit-HBASE-Build/8158/console
          Powered by Apache Yetus 0.4.0 http://yetus.apache.org

          This message was automatically generated.

          Show
          hadoopqa Hadoop QA added a comment - -1 overall Vote Subsystem Runtime Comment 0 reexec 21m 9s Docker mode activated. +1 hbaseanti 0m 0s Patch does not have any anti-patterns. +1 @author 0m 0s The patch does not contain any @author tags. +1 test4tests 0m 0s The patch appears to include 1 new or modified test files. +1 mvninstall 9m 7s master passed +1 compile 1m 6s master passed +1 checkstyle 1m 13s master passed +1 mvneclipse 0m 30s master passed +1 findbugs 4m 52s master passed +1 javadoc 0m 56s master passed +1 mvninstall 1m 16s the patch passed +1 compile 1m 5s the patch passed +1 javac 1m 5s the patch passed +1 checkstyle 1m 9s the patch passed +1 mvneclipse 0m 27s the patch passed +1 whitespace 0m 1s The patch has no whitespace issues. +1 hadoopcheck 55m 9s Patch does not cause any errors with Hadoop 2.6.1 2.6.2 2.6.3 2.6.4 2.6.5 2.7.1 2.7.2 2.7.3 or 3.0.0-alpha4. +1 findbugs 6m 53s the patch passed +1 javadoc 0m 59s the patch passed -1 unit 181m 40s hbase-server in the patch failed. +1 asflicense 0m 51s The patch does not generate ASF License warnings. 289m 0s Reason Tests Failed junit tests hadoop.hbase.security.access.TestCoprocessorWhitelistMasterObserver Timed out junit tests org.apache.hadoop.hbase.master.procedure.TestServerCrashProcedure   org.apache.hadoop.hbase.master.procedure.TestCreateTableProcedure   org.apache.hadoop.hbase.master.TestGetLastFlushedSequenceId   org.apache.hadoop.hbase.snapshot.TestSnapshotClientRetries   org.apache.hadoop.hbase.master.balancer.TestStochasticLoadBalancer2   org.apache.hadoop.hbase.coprocessor.TestRegionObserverScannerOpenHook   org.apache.hadoop.hbase.wal.TestWALFiltering   org.apache.hadoop.hbase.TestZooKeeper   org.apache.hadoop.hbase.wal.TestWALSplitCompressed   org.apache.hadoop.hbase.quotas.TestRegionSizeUse   org.apache.hadoop.hbase.util.TestHBaseFsckEncryption   org.apache.hadoop.hbase.master.assignment.TestAssignmentOnRSCrash   org.apache.hadoop.hbase.master.TestSplitLogManager   org.apache.hadoop.hbase.master.balancer.TestFavoredNodeTableImport   org.apache.hadoop.hbase.master.TestRollingRestart   org.apache.hadoop.hbase.master.balancer.TestStochasticLoadBalancer   org.apache.hadoop.hbase.wal.TestSecureWAL   org.apache.hadoop.hbase.util.TestMiniClusterLoadEncoded   org.apache.hadoop.hbase.master.TestDistributedLogSplitting   org.apache.hadoop.hbase.util.TestMiniClusterLoadSequential   org.apache.hadoop.hbase.mapreduce.TestHFileOutputFormat2   org.apache.hadoop.hbase.wal.TestWALRootDir   org.apache.hadoop.hbase.snapshot.TestExportSnapshotNoCluster   org.apache.hadoop.hbase.master.assignment.TestRegionStates   org.apache.hadoop.hbase.TestMovedRegionsCleaner   org.apache.hadoop.hbase.mapreduce.TestWALRecordReader   org.apache.hadoop.hbase.TestHBaseOnOtherDfsCluster   org.apache.hadoop.hbase.master.snapshot.TestSnapshotFileCache   org.apache.hadoop.hbase.quotas.TestQuotaObserverChoreRegionReports   org.apache.hadoop.hbase.master.TestRestartCluster   org.apache.hadoop.hbase.util.TestMiniClusterLoadParallel   org.apache.hadoop.hbase.master.balancer.TestRegionsOnMasterOptions   org.apache.hadoop.hbase.TestLocalHBaseCluster   org.apache.hadoop.hbase.fs.TestBlockReorder   org.apache.hadoop.hbase.coprocessor.TestRegionServerCoprocessorExceptionWithAbort   org.apache.hadoop.hbase.util.TestConnectionCache   org.apache.hadoop.hbase.util.TestIdReadWriteLock   org.apache.hadoop.hbase.mapreduce.TestTableSnapshotInputFormat   org.apache.hadoop.hbase.tool.TestCanaryTool   org.apache.hadoop.hbase.util.TestFSUtils   org.apache.hadoop.hbase.master.procedure.TestTruncateTableProcedure Subsystem Report/Notes Docker Client=1.13.1 Server=1.13.1 Image:yetus/hbase:bdc94b1 JIRA Issue HBASE-18627 JIRA Patch URL https://issues.apache.org/jira/secure/attachment/12882635/HBASE-18627.v0.patch Optional Tests asflicense javac javadoc unit findbugs hadoopcheck hbaseanti checkstyle compile uname Linux fded8fd6296a 3.13.0-117-generic #164-Ubuntu SMP Fri Apr 7 11:05:26 UTC 2017 x86_64 x86_64 x86_64 GNU/Linux Build tool maven Personality /home/jenkins/jenkins-slave/workspace/PreCommit-HBASE-Build/component/dev-support/hbase-personality.sh git revision master / 56f9e1a Default Java 1.8.0_144 findbugs v3.1.0-RC3 unit https://builds.apache.org/job/PreCommit-HBASE-Build/8158/artifact/patchprocess/patch-unit-hbase-server.txt Test Results https://builds.apache.org/job/PreCommit-HBASE-Build/8158/testReport/ modules C: hbase-server U: hbase-server Console output https://builds.apache.org/job/PreCommit-HBASE-Build/8158/console Powered by Apache Yetus 0.4.0 http://yetus.apache.org This message was automatically generated.
          Hide
          stack stack added a comment -

          Pushed to branch-2 and master. Thanks for the patch Chia-Ping Tsai

          Show
          stack stack added a comment - Pushed to branch-2 and master. Thanks for the patch Chia-Ping Tsai
          Hide
          hudson Hudson added a comment -

          FAILURE: Integrated in Jenkins build HBase-2.0 #373 (See https://builds.apache.org/job/HBase-2.0/373/)
          HBASE-18627 Fix TestRegionServerReadRequestMetrics (Chia-Ping Tsai) (stack: rev 55ba5d070754a718709e482470f1d0aafca3bb7d)

          • (edit) hbase-server/src/test/java/org/apache/hadoop/hbase/regionserver/TestRegionServerReadRequestMetrics.java
          Show
          hudson Hudson added a comment - FAILURE: Integrated in Jenkins build HBase-2.0 #373 (See https://builds.apache.org/job/HBase-2.0/373/ ) HBASE-18627 Fix TestRegionServerReadRequestMetrics (Chia-Ping Tsai) (stack: rev 55ba5d070754a718709e482470f1d0aafca3bb7d) (edit) hbase-server/src/test/java/org/apache/hadoop/hbase/regionserver/TestRegionServerReadRequestMetrics.java
          Hide
          hudson Hudson added a comment -

          FAILURE: Integrated in Jenkins build HBase-Trunk_matrix #3574 (See https://builds.apache.org/job/HBase-Trunk_matrix/3574/)
          HBASE-18627 Fix TestRegionServerReadRequestMetrics (Chia-Ping Tsai) (stack: rev bf343da4a445cd9ed1da953e2b24861a5b869846)

          • (edit) hbase-server/src/test/java/org/apache/hadoop/hbase/regionserver/TestRegionServerReadRequestMetrics.java
          Show
          hudson Hudson added a comment - FAILURE: Integrated in Jenkins build HBase-Trunk_matrix #3574 (See https://builds.apache.org/job/HBase-Trunk_matrix/3574/ ) HBASE-18627 Fix TestRegionServerReadRequestMetrics (Chia-Ping Tsai) (stack: rev bf343da4a445cd9ed1da953e2b24861a5b869846) (edit) hbase-server/src/test/java/org/apache/hadoop/hbase/regionserver/TestRegionServerReadRequestMetrics.java
          Hide
          hudson Hudson added a comment -

          FAILURE: Integrated in Jenkins build HBASE-14070.HLC #263 (See https://builds.apache.org/job/HBASE-14070.HLC/263/)
          HBASE-18627 Fix TestRegionServerReadRequestMetrics (Chia-Ping Tsai) (stack: rev bf343da4a445cd9ed1da953e2b24861a5b869846)

          • (edit) hbase-server/src/test/java/org/apache/hadoop/hbase/regionserver/TestRegionServerReadRequestMetrics.java
          Show
          hudson Hudson added a comment - FAILURE: Integrated in Jenkins build HBASE-14070 .HLC #263 (See https://builds.apache.org/job/HBASE-14070.HLC/263/ ) HBASE-18627 Fix TestRegionServerReadRequestMetrics (Chia-Ping Tsai) (stack: rev bf343da4a445cd9ed1da953e2b24861a5b869846) (edit) hbase-server/src/test/java/org/apache/hadoop/hbase/regionserver/TestRegionServerReadRequestMetrics.java

            People

            • Assignee:
              chia7712 Chia-Ping Tsai
              Reporter:
              chia7712 Chia-Ping Tsai
            • Votes:
              0 Vote for this issue
              Watchers:
              4 Start watching this issue

              Dates

              • Created:
                Updated:
                Resolved:

                Development