Uploaded image for project: 'HBase'
  1. HBase
  2. HBASE-17079

HBase build fails on windows, hbase-archetype-builder is reason for failure

    XMLWordPrintableJSON

    Details

    • Type: Bug
    • Status: Resolved
    • Priority: Major
    • Resolution: Fixed
    • Affects Version/s: None
    • Fix Version/s: 1.3.2, 1.4.1, 2.0.0
    • Component/s: build
    • Labels:
      None
    • Environment:

      windows

    • Hadoop Flags:
      Reviewed

      Description

      HBase buid fails on windows, hbase-archetype-builder is reason for failure. Cygwin is installed so the shell scripts should execute successfully.
      Here is build failure log

      [INFO] Apache HBase - Archetype builder ................... FAILURE [  1.014 s]
      [INFO] ------------------------------------------------------------------------
      [INFO] BUILD FAILURE
      [INFO] ------------------------------------------------------------------------
      [INFO] Total time: 06:13 min
      [INFO] Finished at: 2016-11-12T18:12:26+05:30
      [INFO] Final Memory: 235M/1012M
      [INFO] ------------------------------------------------------------------------
      [ERROR] Failed to execute goal org.codehaus.mojo:exec-maven-plugin:1.4.0:exec (make-scripts-executable) on project hbase-archetype-builder: Command execution failed. Process exited with an error: 1 (Exit value: 1) -> [Help 1]
      [ERROR]
      [ERROR] To see the full stack trace of the errors, re-run Maven with the -e switch.
      [ERROR] Re-run Maven using the -X switch to enable full debug logging.
      [ERROR]
      [ERROR] For more information about the errors and possible solutions, please read the following articles:
      [ERROR] [Help 1] http://cwiki.apache.org/confluence/display/MAVEN/MojoExecutionException
      [ERROR]
      [ERROR] After correcting the problems, you can resume the build with the command
      [ERROR]   mvn <goals> -rf :hbase-archetype-builder
      

        Attachments

        1. HBASE-17079.master.001.patch
          3 kB
          Mohammad Arshad
        2. HBASE-17079.master.002.patch
          4 kB
          Mohammad Arshad
        3. screenshot-1.png
          197 kB
          Mohammad Arshad
        4. HBASE-17079.branch-1.3.002.patch
          3 kB
          Mohammad Arshad
        5. HBASE-17079.branch-1.3.Verification.jpg
          224 kB
          Mohammad Arshad

          Activity

            People

            • Assignee:
              arshad.mohammad Mohammad Arshad
              Reporter:
              arshad.mohammad Mohammad Arshad
            • Votes:
              0 Vote for this issue
              Watchers:
              4 Start watching this issue

              Dates

              • Created:
                Updated:
                Resolved: