Uploaded image for project: 'HBase'
  1. HBase
  2. HBASE-10103

TestNodeHealthCheckChore#testRSHealthChore: Stoppable must have been stopped

VotersWatch issueWatchersCreate sub-taskLinkCloneUpdate Comment AuthorReplace String in CommentUpdate Comment VisibilityDelete Comments
    XMLWordPrintableJSON

Details

    • Bug
    • Status: Closed
    • Major
    • Resolution: Fixed
    • 0.98.0, 0.99.0
    • 0.98.0, 0.96.1, 0.99.0
    • None
    • None
    • Reviewed

    Description

      Tests run: 4, Failures: 1, Errors: 0, Skipped: 0, Time elapsed: 623.639 sec <<< FAILURE!
      testRSHealthChore(org.apache.hadoop.hbase.TestNodeHealthCheckChore)  Time elapsed: 0.001 sec  <<< FAILURE!
      java.lang.AssertionError: Stoppable must have been stopped.
              at org.junit.Assert.fail(Assert.java:88)
              at org.junit.Assert.assertTrue(Assert.java:41)
              at org.apache.hadoop.hbase.TestNodeHealthCheckChore.testRSHealthChore(TestNodeHealthCheckChore.java:108)
      

      Attachments

        1. 10103.patch
          2 kB
          Andrew Kyle Purtell
        2. 10103.patch
          2 kB
          Andrew Kyle Purtell
        3. 10103.patch
          1 kB
          Andrew Kyle Purtell
        4. 10103-amend-1.patch
          1 kB
          Andrew Kyle Purtell

        Activity

          This comment will be Viewable by All Users Viewable by All Users
          Cancel

          People

            apurtell Andrew Kyle Purtell
            apurtell Andrew Kyle Purtell
            Votes:
            0 Vote for this issue
            Watchers:
            4 Start watching this issue

            Dates

              Created:
              Updated:
              Resolved:

              Issue deployment