Details

    • Type: Bug Bug
    • Status: Open
    • Priority: Major Major
    • Resolution: Unresolved
    • Affects Version/s: 2.0.0-alpha
    • Fix Version/s: 2.5.0
    • Component/s: None
    • Labels:
      None

      Description

      Running org.apache.hadoop.io.compress.TestCodec
      Tests run: 20, Failures: 1, Errors: 0, Skipped: 0, Time elapsed: 27.789 sec <<< FAILURE!

      Running org.apache.hadoop.fs.viewfs.TestFSMainOperationsLocalFileSystem
      Tests run: 98, Failures: 0, Errors: 98, Skipped: 0, Time elapsed: 1.633 sec <<< FAILURE!

      Running org.apache.hadoop.fs.viewfs.TestViewFsTrash
      Tests run: 1, Failures: 0, Errors: 1, Skipped: 0, Time elapsed: 0.658 sec <<< FAILURE!


      TestCodec failed since I didn't pass -Pnative, the test could be improved to ensure snappy tests are skipped if native hadoop isn't present.

        Activity

        Hide
        Eli Collins added a comment - - edited

        Hey Arun

        TestFSMainOperationsLocalFileSystem and TestCodec (w/o -Pnative) both pass for me on the top of branch-2. What change did you run these at, and what specific tests failed?

        TestViewFsTrash fails sporadically, this is HADOOP-8110, I'll take a look now, but don't think this flaky test a blocker for an alpha.

        Thanks,
        Eli

        Show
        Eli Collins added a comment - - edited Hey Arun TestFSMainOperationsLocalFileSystem and TestCodec (w/o -Pnative) both pass for me on the top of branch-2. What change did you run these at, and what specific tests failed? TestViewFsTrash fails sporadically, this is HADOOP-8110 , I'll take a look now, but don't think this flaky test a blocker for an alpha. Thanks, Eli
        Hide
        Arun C Murthy added a comment -

        Thanks for taking a look Eli, downgrading from 'blocker'.

        Show
        Arun C Murthy added a comment - Thanks for taking a look Eli, downgrading from 'blocker'.

          People

          • Assignee:
            Unassigned
            Reporter:
            Arun C Murthy
          • Votes:
            0 Vote for this issue
            Watchers:
            7 Start watching this issue

            Dates

            • Created:
              Updated:

              Development