XMLWordPrintableJSON

    Details

    • Type: Sub-task
    • Status: Resolved
    • Priority: Minor
    • Resolution: Fixed
    • Affects Version/s: 3.4.0
    • Fix Version/s: 3.4.0
    • Component/s: fs/s3, test
    • Labels:
      None

      Description

      Because of HADOOP-17022
      [INFO] Running org.apache.hadoop.fs.s3a.scale.ITestS3ADirectoryPerformance
      [ERROR] Tests run: 5, Failures: 1, Errors: 0, Skipped: 0, Time elapsed: 670.029 s <<< FAILURE! - in org.apache.hadoop.fs.s3a.scale.ITestS3ADirectoryPerformance
      [ERROR] testListOperations(org.apache.hadoop.fs.s3a.scale.ITestS3ADirectoryPerformance) Time elapsed: 44.089 s <<< FAILURE!
      java.lang.AssertionError: object_list_requests starting=166 current=167 diff=1 expected:<2> but was:<1>
      at org.junit.Assert.fail(Assert.java:88)
      at org.junit.Assert.failNotEquals(Assert.java:834)
      at org.junit.Assert.assertEquals(Assert.java:645)
      at org.apache.hadoop.fs.s3a.scale.ITestS3ADirectoryPerformance.testListOperations(ITestS3ADirectoryPerformance.java:117)

        Attachments

          Issue Links

            Activity

              People

              • Assignee:
                mukund-thakur Mukund Thakur
                Reporter:
                mukund-thakur Mukund Thakur
              • Votes:
                0 Vote for this issue
                Watchers:
                2 Start watching this issue

                Dates

                • Created:
                  Updated:
                  Resolved: