Uploaded image for project: 'Hadoop Common'
  1. Hadoop Common
  2. HADOOP-16829 Über-jira: S3A Hadoop 3.3.1 features
  3. HADOOP-17135

ITestS3GuardOutOfBandOperations testListingDelete[auth=false] fails on unversioned bucket

Log workAgile BoardRank to TopRank to BottomAttach filesAttach ScreenshotVotersWatch issueWatchersConvert to IssueMoveLinkCloneLabelsUpdate Comment AuthorReplace String in CommentUpdate Comment VisibilityDelete Comments
    XMLWordPrintableJSON

    Details

    • Type: Sub-task
    • Status: Resolved
    • Priority: Minor
    • Resolution: Won't Fix
    • Affects Version/s: 3.4.0
    • Fix Version/s: None
    • Component/s: fs/s3, test
    • Labels:
      None

      Description

      transient failure of

      [ERROR] Tests run: 24, Failures: 0, Errors: 1, Skipped: 0, Time elapsed: 369.68 s <<< FAILURE! - in org.apache.hadoop.fs.s3a.ITestS3GuardOutOfBandOperations
      [ERROR] testListingDelete[auth=false](org.apache.hadoop.fs.s3a.ITestS3GuardOutOfBandOperations)  Time elapsed: 19.103 s  <<< ERROR!
      java.util.concurrent.ExecutionException: java.io.FileNotFoundException: No such file or directory: s3a://stevel-ireland/fork-0001/test/dir-e34a122f-a04d-48c3-90c1-9d35427fa939/file-1-e34a122f-a04d-48c3-90c1-9d35427fa939
      

      config is unguarded codepath, s3a status was not passed down. Test run was really, really slow (8 threads)

      hypothesis: test run took so long that a TTL expired and the open operation did a HEAD to s3 even when a s3guard record was found.

        Attachments

          Activity

          $i18n.getText('security.level.explanation', $currentSelection) Viewable by All Users
          Cancel

            People

            • Assignee:
              Unassigned Assign to me
              Reporter:
              stevel@apache.org Steve Loughran

              Dates

              • Created:
                Updated:
                Resolved:

                Issue deployment