Uploaded image for project: 'Hadoop Common'
  1. Hadoop Common
  2. HADOOP-15619 Über-JIRA: S3Guard Phase IV: Hadoop 3.3 features
  3. HADOOP-16476

Intermittent failure of ITestS3GuardConcurrentOps#testConcurrentTableCreations

    XMLWordPrintableJSON

    Details

    • Type: Sub-task
    • Status: Open
    • Priority: Minor
    • Resolution: Unresolved
    • Affects Version/s: 3.3.0
    • Fix Version/s: None
    • Component/s: fs/s3
    • Labels:
      None

      Description

      Test is failing intermittently. One possible solution would be to wait (retry) more because the table will be deleted eventually - it's not there after the whole test run.

      [ERROR] Tests run: 1, Failures: 0, Errors: 1, Skipped: 0, Time elapsed: 142.471 s <<< FAILURE! - in org.apache.hadoop.fs.s3a.s3guard.ITestS3GuardConcurrentOps
      [ERROR] testConcurrentTableCreations(org.apache.hadoop.fs.s3a.s3guard.ITestS3GuardConcurrentOps)  Time elapsed: 142.286 s  <<< ERROR!
      java.lang.IllegalArgumentException: Table s3guard.test.testConcurrentTableCreations-1265635747 is not deleted.
      	at com.amazonaws.services.dynamodbv2.document.Table.waitForDelete(Table.java:505)
      	at org.apache.hadoop.fs.s3a.s3guard.ITestS3GuardConcurrentOps.deleteTable(ITestS3GuardConcurrentOps.java:87)
      	at org.apache.hadoop.fs.s3a.s3guard.ITestS3GuardConcurrentOps.testConcurrentTableCreations(ITestS3GuardConcurrentOps.java:178)
      	at sun.reflect.NativeMethodAccessorImpl.invoke0(Native Method)
      	at sun.reflect.NativeMethodAccessorImpl.invoke(NativeMethodAccessorImpl.java:62)
      	at sun.reflect.DelegatingMethodAccessorImpl.invoke(DelegatingMethodAccessorImpl.java:43)
      	at java.lang.reflect.Method.invoke(Method.java:498)
      	at org.junit.runners.model.FrameworkMethod$1.runReflectiveCall(FrameworkMethod.java:50)
      	at org.junit.internal.runners.model.ReflectiveCallable.run(ReflectiveCallable.java:12)
      	at org.junit.runners.model.FrameworkMethod.invokeExplosively(FrameworkMethod.java:47)
      	at org.junit.internal.runners.statements.InvokeMethod.evaluate(InvokeMethod.java:17)
      	at org.junit.internal.runners.statements.RunBefores.evaluate(RunBefores.java:26)
      	at org.junit.internal.runners.statements.RunAfters.evaluate(RunAfters.java:27)
      	at org.junit.internal.runners.statements.FailOnTimeout$CallableStatement.call(FailOnTimeout.java:298)
      	at org.junit.internal.runners.statements.FailOnTimeout$CallableStatement.call(FailOnTimeout.java:292)
      	at java.util.concurrent.FutureTask.run(FutureTask.java:266)
      	at java.lang.Thread.run(Thread.java:748)
      Caused by: com.amazonaws.waiters.WaiterTimedOutException: Reached maximum attempts without transitioning to the desired state
      	at com.amazonaws.waiters.WaiterExecution.pollResource(WaiterExecution.java:86)
      	at com.amazonaws.waiters.WaiterImpl.run(WaiterImpl.java:88)
      	at com.amazonaws.services.dynamodbv2.document.Table.waitForDelete(Table.java:502)
      	... 16 more
      

        Attachments

          Activity

            People

            • Assignee:
              Unassigned
              Reporter:
              gabor.bota Gabor Bota
            • Votes:
              0 Vote for this issue
              Watchers:
              2 Start watching this issue

              Dates

              • Created:
                Updated: