Uploaded image for project: 'Hadoop Common'
  1. Hadoop Common
  2. HADOOP-15619 Über-JIRA: S3Guard Phase IV: Hadoop 3.3 features
  3. HADOOP-16442

Intermittent failure of ITestS3GuardToolDynamoDB#testDynamoDBInitDestroyCycle

    XMLWordPrintableJSON

    Details

    • Type: Sub-task
    • Status: Open
    • Priority: Minor
    • Resolution: Unresolved
    • Affects Version/s: 3.3.0
    • Fix Version/s: None
    • Component/s: fs/s3
    • Labels:
      None

      Description

      ITestS3GuardToolDynamoDB#testDynamoDBInitDestroyCycle test is failing itermittently against ireland with the following stacktrace:

      [ERROR] Tests run: 17, Failures: 1, Errors: 0, Skipped: 0, Time elapsed: 248.895 s <<< FAILURE! - in org.apache.hadoop.fs.s3a.s3guard.ITestS3GuardToolDynamoDB
      [ERROR] testDynamoDBInitDestroyCycle(org.apache.hadoop.fs.s3a.s3guard.ITestS3GuardToolDynamoDB)  Time elapsed: 141.461 s  <<< FAILURE!
      java.lang.AssertionError: s3guard.test.testDynamoDBInitDestroy912421434 still exists
      	at org.junit.Assert.fail(Assert.java:88)
      	at org.junit.Assert.assertTrue(Assert.java:41)
      	at org.junit.Assert.assertFalse(Assert.java:64)
      	at org.apache.hadoop.fs.s3a.s3guard.ITestS3GuardToolDynamoDB.testDynamoDBInitDestroyCycle(ITestS3GuardToolDynamoDB.java:250)
      	at sun.reflect.NativeMethodAccessorImpl.invoke0(Native Method)
      	at sun.reflect.NativeMethodAccessorImpl.invoke(NativeMethodAccessorImpl.java:62)
      	at sun.reflect.DelegatingMethodAccessorImpl.invoke(DelegatingMethodAccessorImpl.java:43)
      	at java.lang.reflect.Method.invoke(Method.java:498)
      	at org.junit.runners.model.FrameworkMethod$1.runReflectiveCall(FrameworkMethod.java:50)
      	at org.junit.internal.runners.model.ReflectiveCallable.run(ReflectiveCallable.java:12)
      	at org.junit.runners.model.FrameworkMethod.invokeExplosively(FrameworkMethod.java:47)
      	at org.junit.internal.runners.statements.InvokeMethod.evaluate(InvokeMethod.java:17)
      	at org.junit.internal.runners.statements.RunBefores.evaluate(RunBefores.java:26)
      	at org.junit.internal.runners.statements.RunAfters.evaluate(RunAfters.java:27)
      	at org.junit.rules.TestWatcher$1.evaluate(TestWatcher.java:55)
      	at org.junit.internal.runners.statements.FailOnTimeout$CallableStatement.call(FailOnTimeout.java:298)
      	at org.junit.internal.runners.statements.FailOnTimeout$CallableStatement.call(FailOnTimeout.java:292)
      	at java.util.concurrent.FutureTask.run(FutureTask.java:266)
      	at java.lang.Thread.run(Thread.java:748)
      

        Attachments

          Activity

            People

            • Assignee:
              Unassigned
              Reporter:
              gabor.bota Gabor Bota
            • Votes:
              0 Vote for this issue
              Watchers:
              2 Start watching this issue

              Dates

              • Created:
                Updated: