VotersWatch issueWatchersLinkCloneUpdate Comment AuthorReplace String in CommentUpdate Comment VisibilityDelete Comments
    XMLWordPrintableJSON

Details

    • Sub-task
    • Status: Resolved
    • Major
    • Resolution: Fixed
    • None
    • 3.2.0, 2.10.2
    • None
    • Reviewed

    Description

      [ERROR] Tests run: 11, Failures: 1, Errors: 0, Skipped: 0, Time elapsed: 5.039 s <<< FAILURE! - in org.apache.hadoop.fs.sftp.TestSFTPFileSystem
      [ERROR] testGetModifyTime(org.apache.hadoop.fs.sftp.TestSFTPFileSystem)  Time elapsed: 0.095 s  <<< FAILURE!
      java.lang.AssertionError: expected:<1537836464942> but was:<1537836464000>
      	at org.junit.Assert.fail(Assert.java:88)
      	at org.junit.Assert.failNotEquals(Assert.java:743)
      	at org.junit.Assert.assertEquals(Assert.java:118)
      	at org.junit.Assert.assertEquals(Assert.java:555)
      	at org.junit.Assert.assertEquals(Assert.java:542)
      	at org.apache.hadoop.fs.sftp.TestSFTPFileSystem.testGetModifyTime(TestSFTPFileSystem.java:329)
      

      Attachments

        1. HADOOP-15783.01.patch
          2 kB
          Akira Ajisaka
        2. HADOOP-15783.02.patch
          1 kB
          Akira Ajisaka

        Issue Links

        Activity

          This comment will be Viewable by All Users Viewable by All Users
          Cancel

          People

            aajisaka Akira Ajisaka
            aajisaka Akira Ajisaka
            Votes:
            0 Vote for this issue
            Watchers:
            3 Start watching this issue

            Dates

              Created:
              Updated:
              Resolved:

              Time Tracking

                Estimated:
                Original Estimate - Not Specified
                Not Specified
                Remaining:
                Remaining Estimate - 0h
                0h
                Logged:
                Time Spent - 40m
                40m

                Slack

                  Issue deployment