Uploaded image for project: 'Hadoop Common'
  1. Hadoop Common
  2. HADOOP-14922

Build of Mapreduce Native Task module fails with unknown opcode "bswap"

    XMLWordPrintableJSON

Details

    • Bug
    • Status: Resolved
    • Major
    • Resolution: Fixed
    • 3.0.0-alpha3
    • 3.4.0, 3.2.3, 3.3.2
    • None
    • None
    • OS: Ubuntu 14.04
      Arch: PPC64LE

    • Reviewed
    • Patch

    Description

      [WARNING] /tmp/cckBBdQp.s: Assembler messages:
      [WARNING] /tmp/cckBBdQp.s:3127: Error: unrecognized opcode: `bswap'
      [WARNING] /tmp/cckBBdQp.s:3152: Error: unrecognized opcode: `bswap'
      [WARNING] make[2]: *** [CMakeFiles/nativetask.dir/main/native/src/codec/BlockCodec.cc.o] Error 1
      [WARNING] make[2]: *** Waiting for unfinished jobs....
      [WARNING] /tmp/ccqRfBZp.s: Assembler messages:
      [WARNING] /tmp/ccqRfBZp.s:2098: Error: unrecognized opcode: `bswap'
      [WARNING] /tmp/ccqRfBZp.s:2123: Error: unrecognized opcode: `bswap'
      [WARNING] make[2]: *** [CMakeFiles/nativetask.dir/main/native/src/codec/Lz4Codec.cc.o] Error 1
      [WARNING] /tmp/cc50B5Mp.s: Assembler messages:
      [WARNING] /tmp/cc50B5Mp.s:3112: Error: unrecognized opcode: `bswap'
      [WARNING] /tmp/cc50B5Mp.s:3137: Error: unrecognized opcode: `bswap'
      [WARNING] make[2]: *** [CMakeFiles/nativetask_static.dir/main/native/src/codec/BlockCodec.cc.o] Error 1
      [WARNING] make[2]: *** Waiting for unfinished jobs....
      [WARNING] /tmp/ccobJqOY.s: Assembler messages:
      [WARNING] /tmp/ccobJqOY.s:2098: Error: unrecognized opcode: `bswap'
      [WARNING] /tmp/ccobJqOY.s:2123: Error: unrecognized opcode: `bswap'
      [WARNING] make[2]: *** [CMakeFiles/nativetask_static.dir/main/native/src/codec/Lz4Codec.cc.o] Error 1
      [WARNING] /tmp/ccdaQ1CY.s: Assembler messages:
      [WARNING] /tmp/ccdaQ1CY.s:2235: Error: unrecognized opcode: `bswap'
      [WARNING] /tmp/ccdaQ1CY.s:2249: Error: unrecognized opcode: `bswap'
      [WARNING] /tmp/ccRwHt5X.s: Assembler messages:
      [WARNING] /tmp/ccRwHt5X.s:2235: Error: unrecognized opcode: `bswap'
      [WARNING] /tmp/ccRwHt5X.s:2249: Error: unrecognized opcode: `bswap'
      [WARNING] make[2]: *** [CMakeFiles/nativetask.dir/main/native/src/codec/SnappyCodec.cc.o] Error 1
      [WARNING] make[1]: *** [CMakeFiles/nativetask.dir/all] Error 2
      [WARNING] make[1]: *** Waiting for unfinished jobs....
      [WARNING] make[2]: *** [CMakeFiles/nativetask_static.dir/main/native/src/codec/SnappyCodec.cc.o] Error 1
      [WARNING] make[1]: *** [CMakeFiles/nativetask_static.dir/all] Error 2
      [WARNING] make: *** [all] Error 2

      Attachments

        1. HADOOP-14922.01.patch
          1 kB
          Anup Halarnkar

        Issue Links

          Activity

            People

              anuphal Anup Halarnkar
              anuphal Anup Halarnkar
              Votes:
              0 Vote for this issue
              Watchers:
              6 Start watching this issue

              Dates

                Created:
                Updated:
                Resolved: