Details

    • Type: Bug
    • Status: Resolved
    • Priority: Trivial
    • Resolution: Fixed
    • Affects Version/s: 2.7.1
    • Fix Version/s: 2.8.0, 3.0.0-alpha1
    • Component/s: ipc
    • Labels:
      None
    • Hadoop Flags:
      Reviewed

      Description

      typos in RpcMetrics.java

      Processsing --> Processing
      sucesses -> successes
      JobTrackerInstrumenation -> JobTrackerInstrumentation

      these are all part of description of the metric or in comments. So should have no impact on backward compact.

        Activity

        Hide
        hudson Hudson added a comment -

        FAILURE: Integrated in Hadoop-Hdfs-trunk-Java8 #276 (See https://builds.apache.org/job/Hadoop-Hdfs-trunk-Java8/276/)
        HADOOP-12322. Typos in rpcmetrics.java. (Contributed by Anu Engineer) (arp: rev 6b1cefc561bf407daf745606275c03b9cda5ef4d)

        • hadoop-common-project/hadoop-common/CHANGES.txt
        • hadoop-common-project/hadoop-common/src/main/java/org/apache/hadoop/ipc/metrics/RpcMetrics.java
        Show
        hudson Hudson added a comment - FAILURE: Integrated in Hadoop-Hdfs-trunk-Java8 #276 (See https://builds.apache.org/job/Hadoop-Hdfs-trunk-Java8/276/ ) HADOOP-12322 . Typos in rpcmetrics.java. (Contributed by Anu Engineer) (arp: rev 6b1cefc561bf407daf745606275c03b9cda5ef4d) hadoop-common-project/hadoop-common/CHANGES.txt hadoop-common-project/hadoop-common/src/main/java/org/apache/hadoop/ipc/metrics/RpcMetrics.java
        Hide
        hudson Hudson added a comment -

        FAILURE: Integrated in Hadoop-Hdfs-trunk #2214 (See https://builds.apache.org/job/Hadoop-Hdfs-trunk/2214/)
        HADOOP-12322. Typos in rpcmetrics.java. (Contributed by Anu Engineer) (arp: rev 6b1cefc561bf407daf745606275c03b9cda5ef4d)

        • hadoop-common-project/hadoop-common/CHANGES.txt
        • hadoop-common-project/hadoop-common/src/main/java/org/apache/hadoop/ipc/metrics/RpcMetrics.java
        Show
        hudson Hudson added a comment - FAILURE: Integrated in Hadoop-Hdfs-trunk #2214 (See https://builds.apache.org/job/Hadoop-Hdfs-trunk/2214/ ) HADOOP-12322 . Typos in rpcmetrics.java. (Contributed by Anu Engineer) (arp: rev 6b1cefc561bf407daf745606275c03b9cda5ef4d) hadoop-common-project/hadoop-common/CHANGES.txt hadoop-common-project/hadoop-common/src/main/java/org/apache/hadoop/ipc/metrics/RpcMetrics.java
        Hide
        hudson Hudson added a comment -

        FAILURE: Integrated in Hadoop-Mapreduce-trunk #2233 (See https://builds.apache.org/job/Hadoop-Mapreduce-trunk/2233/)
        HADOOP-12322. Typos in rpcmetrics.java. (Contributed by Anu Engineer) (arp: rev 6b1cefc561bf407daf745606275c03b9cda5ef4d)

        • hadoop-common-project/hadoop-common/src/main/java/org/apache/hadoop/ipc/metrics/RpcMetrics.java
        • hadoop-common-project/hadoop-common/CHANGES.txt
        Show
        hudson Hudson added a comment - FAILURE: Integrated in Hadoop-Mapreduce-trunk #2233 (See https://builds.apache.org/job/Hadoop-Mapreduce-trunk/2233/ ) HADOOP-12322 . Typos in rpcmetrics.java. (Contributed by Anu Engineer) (arp: rev 6b1cefc561bf407daf745606275c03b9cda5ef4d) hadoop-common-project/hadoop-common/src/main/java/org/apache/hadoop/ipc/metrics/RpcMetrics.java hadoop-common-project/hadoop-common/CHANGES.txt
        Hide
        hudson Hudson added a comment -

        FAILURE: Integrated in Hadoop-Mapreduce-trunk-Java8 #284 (See https://builds.apache.org/job/Hadoop-Mapreduce-trunk-Java8/284/)
        HADOOP-12322. Typos in rpcmetrics.java. (Contributed by Anu Engineer) (arp: rev 6b1cefc561bf407daf745606275c03b9cda5ef4d)

        • hadoop-common-project/hadoop-common/CHANGES.txt
        • hadoop-common-project/hadoop-common/src/main/java/org/apache/hadoop/ipc/metrics/RpcMetrics.java
        Show
        hudson Hudson added a comment - FAILURE: Integrated in Hadoop-Mapreduce-trunk-Java8 #284 (See https://builds.apache.org/job/Hadoop-Mapreduce-trunk-Java8/284/ ) HADOOP-12322 . Typos in rpcmetrics.java. (Contributed by Anu Engineer) (arp: rev 6b1cefc561bf407daf745606275c03b9cda5ef4d) hadoop-common-project/hadoop-common/CHANGES.txt hadoop-common-project/hadoop-common/src/main/java/org/apache/hadoop/ipc/metrics/RpcMetrics.java
        Hide
        hudson Hudson added a comment -

        FAILURE: Integrated in Hadoop-Yarn-trunk #1017 (See https://builds.apache.org/job/Hadoop-Yarn-trunk/1017/)
        HADOOP-12322. Typos in rpcmetrics.java. (Contributed by Anu Engineer) (arp: rev 6b1cefc561bf407daf745606275c03b9cda5ef4d)

        • hadoop-common-project/hadoop-common/CHANGES.txt
        • hadoop-common-project/hadoop-common/src/main/java/org/apache/hadoop/ipc/metrics/RpcMetrics.java
        Show
        hudson Hudson added a comment - FAILURE: Integrated in Hadoop-Yarn-trunk #1017 (See https://builds.apache.org/job/Hadoop-Yarn-trunk/1017/ ) HADOOP-12322 . Typos in rpcmetrics.java. (Contributed by Anu Engineer) (arp: rev 6b1cefc561bf407daf745606275c03b9cda5ef4d) hadoop-common-project/hadoop-common/CHANGES.txt hadoop-common-project/hadoop-common/src/main/java/org/apache/hadoop/ipc/metrics/RpcMetrics.java
        Hide
        hudson Hudson added a comment -

        FAILURE: Integrated in Hadoop-Yarn-trunk-Java8 #287 (See https://builds.apache.org/job/Hadoop-Yarn-trunk-Java8/287/)
        HADOOP-12322. Typos in rpcmetrics.java. (Contributed by Anu Engineer) (arp: rev 6b1cefc561bf407daf745606275c03b9cda5ef4d)

        • hadoop-common-project/hadoop-common/src/main/java/org/apache/hadoop/ipc/metrics/RpcMetrics.java
        • hadoop-common-project/hadoop-common/CHANGES.txt
        Show
        hudson Hudson added a comment - FAILURE: Integrated in Hadoop-Yarn-trunk-Java8 #287 (See https://builds.apache.org/job/Hadoop-Yarn-trunk-Java8/287/ ) HADOOP-12322 . Typos in rpcmetrics.java. (Contributed by Anu Engineer) (arp: rev 6b1cefc561bf407daf745606275c03b9cda5ef4d) hadoop-common-project/hadoop-common/src/main/java/org/apache/hadoop/ipc/metrics/RpcMetrics.java hadoop-common-project/hadoop-common/CHANGES.txt
        Hide
        hudson Hudson added a comment -

        FAILURE: Integrated in Hadoop-trunk-Commit #8297 (See https://builds.apache.org/job/Hadoop-trunk-Commit/8297/)
        HADOOP-12322. Typos in rpcmetrics.java. (Contributed by Anu Engineer) (arp: rev 6b1cefc561bf407daf745606275c03b9cda5ef4d)

        • hadoop-common-project/hadoop-common/CHANGES.txt
        • hadoop-common-project/hadoop-common/src/main/java/org/apache/hadoop/ipc/metrics/RpcMetrics.java
        Show
        hudson Hudson added a comment - FAILURE: Integrated in Hadoop-trunk-Commit #8297 (See https://builds.apache.org/job/Hadoop-trunk-Commit/8297/ ) HADOOP-12322 . Typos in rpcmetrics.java. (Contributed by Anu Engineer) (arp: rev 6b1cefc561bf407daf745606275c03b9cda5ef4d) hadoop-common-project/hadoop-common/CHANGES.txt hadoop-common-project/hadoop-common/src/main/java/org/apache/hadoop/ipc/metrics/RpcMetrics.java
        Hide
        arpitagarwal Arpit Agarwal added a comment -

        Committed for 2.8.0. Thanks for the contribution Anu Engineer.

        Show
        arpitagarwal Arpit Agarwal added a comment - Committed for 2.8.0. Thanks for the contribution Anu Engineer .
        Hide
        anu Anu Engineer added a comment -

        test failures are not related to this patch

        Show
        anu Anu Engineer added a comment - test failures are not related to this patch
        Hide
        hadoopqa Hadoop QA added a comment -



        -1 overall



        Vote Subsystem Runtime Comment
        0 pre-patch 18m 36s Pre-patch trunk compilation is healthy.
        +1 @author 0m 0s The patch does not contain any @author tags.
        -1 tests included 0m 0s The patch doesn't appear to include any new or modified tests. Please justify why no new tests are needed for this patch. Also please list what manual steps were performed to verify this patch.
        +1 javac 8m 14s There were no new javac warning messages.
        +1 javadoc 10m 9s There were no new javadoc warning messages.
        +1 release audit 0m 25s The applied patch does not increase the total number of release audit warnings.
        +1 checkstyle 1m 7s There were no new checkstyle issues.
        +1 whitespace 0m 0s The patch has no lines that end in whitespace.
        +1 install 1m 31s mvn install still works.
        +1 eclipse:eclipse 0m 32s The patch built with eclipse:eclipse.
        +1 findbugs 1m 59s The patch does not introduce any new Findbugs (version 3.0.0) warnings.
        -1 common tests 23m 10s Tests failed in hadoop-common.
            65m 46s  



        Reason Tests
        Failed unit tests hadoop.net.TestNetUtils
          hadoop.ha.TestZKFailoverController
        Timed out tests org.apache.hadoop.security.token.delegation.TestDelegationToken



        Subsystem Report/Notes
        Patch URL http://issues.apache.org/jira/secure/attachment/12750353/HADOOP-12322.001.patch
        Optional Tests javadoc javac unit findbugs checkstyle
        git revision trunk / b73181f
        hadoop-common test log https://builds.apache.org/job/PreCommit-HADOOP-Build/7464/artifact/patchprocess/testrun_hadoop-common.txt
        Test Results https://builds.apache.org/job/PreCommit-HADOOP-Build/7464/testReport/
        Java 1.7.0_55
        uname Linux asf904.gq1.ygridcore.net 3.13.0-36-lowlatency #63-Ubuntu SMP PREEMPT Wed Sep 3 21:56:12 UTC 2014 x86_64 x86_64 x86_64 GNU/Linux
        Console output https://builds.apache.org/job/PreCommit-HADOOP-Build/7464/console

        This message was automatically generated.

        Show
        hadoopqa Hadoop QA added a comment - -1 overall Vote Subsystem Runtime Comment 0 pre-patch 18m 36s Pre-patch trunk compilation is healthy. +1 @author 0m 0s The patch does not contain any @author tags. -1 tests included 0m 0s The patch doesn't appear to include any new or modified tests. Please justify why no new tests are needed for this patch. Also please list what manual steps were performed to verify this patch. +1 javac 8m 14s There were no new javac warning messages. +1 javadoc 10m 9s There were no new javadoc warning messages. +1 release audit 0m 25s The applied patch does not increase the total number of release audit warnings. +1 checkstyle 1m 7s There were no new checkstyle issues. +1 whitespace 0m 0s The patch has no lines that end in whitespace. +1 install 1m 31s mvn install still works. +1 eclipse:eclipse 0m 32s The patch built with eclipse:eclipse. +1 findbugs 1m 59s The patch does not introduce any new Findbugs (version 3.0.0) warnings. -1 common tests 23m 10s Tests failed in hadoop-common.     65m 46s   Reason Tests Failed unit tests hadoop.net.TestNetUtils   hadoop.ha.TestZKFailoverController Timed out tests org.apache.hadoop.security.token.delegation.TestDelegationToken Subsystem Report/Notes Patch URL http://issues.apache.org/jira/secure/attachment/12750353/HADOOP-12322.001.patch Optional Tests javadoc javac unit findbugs checkstyle git revision trunk / b73181f hadoop-common test log https://builds.apache.org/job/PreCommit-HADOOP-Build/7464/artifact/patchprocess/testrun_hadoop-common.txt Test Results https://builds.apache.org/job/PreCommit-HADOOP-Build/7464/testReport/ Java 1.7.0_55 uname Linux asf904.gq1.ygridcore.net 3.13.0-36-lowlatency #63-Ubuntu SMP PREEMPT Wed Sep 3 21:56:12 UTC 2014 x86_64 x86_64 x86_64 GNU/Linux Console output https://builds.apache.org/job/PreCommit-HADOOP-Build/7464/console This message was automatically generated.
        Hide
        arpitagarwal Arpit Agarwal added a comment -

        +1 for the patch pending Jenkins.

        Thanks for fixing this Anu Engineer.

        Show
        arpitagarwal Arpit Agarwal added a comment - +1 for the patch pending Jenkins. Thanks for fixing this Anu Engineer .

          People

          • Assignee:
            anu Anu Engineer
            Reporter:
            anu Anu Engineer
          • Votes:
            0 Vote for this issue
            Watchers:
            5 Start watching this issue

            Dates

            • Created:
              Updated:
              Resolved:

              Development