Uploaded image for project: 'Hadoop Common'
  1. Hadoop Common
  2. HADOOP-12268

AbstractContractAppendTest#testRenameFileBeingAppended misses rename operation.

    Details

    • Type: Bug
    • Status: Resolved
    • Priority: Major
    • Resolution: Fixed
    • Affects Version/s: 2.5.0
    • Fix Version/s: 2.8.0, 3.0.0-alpha1
    • Component/s: test
    • Labels:
      None
    • Target Version/s:
    • Hadoop Flags:
      Reviewed

      Description

      AbstractContractAppendTest#testRenameFileBeingAppended misses rename operation. Also TestHDFSContractAppend can pass the original test after fix the issue at AbstractContractAppendTest#testRenameFileBeingAppended.

      1. HADOOP-12268.000.patch
        2 kB
        zhihai xu
      2. HADOOP-12268.001.patch
        3 kB
        zhihai xu

        Issue Links

          Activity

          Hide
          hadoopqa Hadoop QA added a comment -



          -1 overall



          Vote Subsystem Runtime Comment
          0 pre-patch 9m 23s Pre-patch trunk compilation is healthy.
          +1 @author 0m 0s The patch does not contain any @author tags.
          +1 tests included 0m 0s The patch appears to include 2 new or modified test files.
          +1 javac 7m 35s There were no new javac warning messages.
          +1 release audit 0m 20s The applied patch does not increase the total number of release audit warnings.
          +1 checkstyle 2m 26s There were no new checkstyle issues.
          +1 whitespace 0m 0s The patch has no lines that end in whitespace.
          +1 install 1m 17s mvn install still works.
          +1 eclipse:eclipse 0m 33s The patch built with eclipse:eclipse.
          +1 findbugs 4m 17s The patch does not introduce any new Findbugs (version 3.0.0) warnings.
          +1 common tests 22m 10s Tests passed in hadoop-common.
          -1 hdfs tests 160m 11s Tests failed in hadoop-hdfs.
              208m 16s  



          Reason Tests
          Failed unit tests hadoop.hdfs.TestDistributedFileSystem



          Subsystem Report/Notes
          Patch URL http://issues.apache.org/jira/secure/attachment/12746983/HADOOP-12268.000.patch
          Optional Tests javac unit findbugs checkstyle
          git revision trunk / e202efa
          hadoop-common test log https://builds.apache.org/job/PreCommit-HADOOP-Build/7334/artifact/patchprocess/testrun_hadoop-common.txt
          hadoop-hdfs test log https://builds.apache.org/job/PreCommit-HADOOP-Build/7334/artifact/patchprocess/testrun_hadoop-hdfs.txt
          Test Results https://builds.apache.org/job/PreCommit-HADOOP-Build/7334/testReport/
          Java 1.7.0_55
          uname Linux asf902.gq1.ygridcore.net 3.13.0-36-lowlatency #63-Ubuntu SMP PREEMPT Wed Sep 3 21:56:12 UTC 2014 x86_64 x86_64 x86_64 GNU/Linux
          Console output https://builds.apache.org/job/PreCommit-HADOOP-Build/7334/console

          This message was automatically generated.

          Show
          hadoopqa Hadoop QA added a comment - -1 overall Vote Subsystem Runtime Comment 0 pre-patch 9m 23s Pre-patch trunk compilation is healthy. +1 @author 0m 0s The patch does not contain any @author tags. +1 tests included 0m 0s The patch appears to include 2 new or modified test files. +1 javac 7m 35s There were no new javac warning messages. +1 release audit 0m 20s The applied patch does not increase the total number of release audit warnings. +1 checkstyle 2m 26s There were no new checkstyle issues. +1 whitespace 0m 0s The patch has no lines that end in whitespace. +1 install 1m 17s mvn install still works. +1 eclipse:eclipse 0m 33s The patch built with eclipse:eclipse. +1 findbugs 4m 17s The patch does not introduce any new Findbugs (version 3.0.0) warnings. +1 common tests 22m 10s Tests passed in hadoop-common. -1 hdfs tests 160m 11s Tests failed in hadoop-hdfs.     208m 16s   Reason Tests Failed unit tests hadoop.hdfs.TestDistributedFileSystem Subsystem Report/Notes Patch URL http://issues.apache.org/jira/secure/attachment/12746983/HADOOP-12268.000.patch Optional Tests javac unit findbugs checkstyle git revision trunk / e202efa hadoop-common test log https://builds.apache.org/job/PreCommit-HADOOP-Build/7334/artifact/patchprocess/testrun_hadoop-common.txt hadoop-hdfs test log https://builds.apache.org/job/PreCommit-HADOOP-Build/7334/artifact/patchprocess/testrun_hadoop-hdfs.txt Test Results https://builds.apache.org/job/PreCommit-HADOOP-Build/7334/testReport/ Java 1.7.0_55 uname Linux asf902.gq1.ygridcore.net 3.13.0-36-lowlatency #63-Ubuntu SMP PREEMPT Wed Sep 3 21:56:12 UTC 2014 x86_64 x86_64 x86_64 GNU/Linux Console output https://builds.apache.org/job/PreCommit-HADOOP-Build/7334/console This message was automatically generated.
          Hide
          zxu zhihai xu added a comment -

          The failure test TestDistributedFileSystem.testDFSClientPeerWriteTimeout is not related to my change. it was already reported at HDFS-8785.

          Show
          zxu zhihai xu added a comment - The failure test TestDistributedFileSystem.testDFSClientPeerWriteTimeout is not related to my change. it was already reported at HDFS-8785 .
          Hide
          ajisakaa Akira Ajisaka added a comment -

          Nice catch, zhihai xu! The fix looks good to me. Two comments:
          1. Would you remove unused imports in TestHDFSContractAppend and AbstractContractAppendTest?
          2. Would you please fix the following javadoc comment?

          /**
           * Test concat -if supported
           */
          public abstract class AbstractContractAppendTest extends AbstractFSContractTestBase {
          

          "concat" should be "append".

          Show
          ajisakaa Akira Ajisaka added a comment - Nice catch, zhihai xu ! The fix looks good to me. Two comments: 1. Would you remove unused imports in TestHDFSContractAppend and AbstractContractAppendTest? 2. Would you please fix the following javadoc comment? /** * Test concat - if supported */ public abstract class AbstractContractAppendTest extends AbstractFSContractTestBase { "concat" should be "append".
          Hide
          zxu zhihai xu added a comment -

          Thanks for the review Akira Ajisaka! I uploaded a new patch HADOOP-12268.001.patch, which addressed all your comments. Please review it.

          Show
          zxu zhihai xu added a comment - Thanks for the review Akira Ajisaka ! I uploaded a new patch HADOOP-12268 .001.patch, which addressed all your comments. Please review it.
          Hide
          hadoopqa Hadoop QA added a comment -



          -1 overall



          Vote Subsystem Runtime Comment
          0 pre-patch 10m 24s Pre-patch trunk compilation is healthy.
          +1 @author 0m 0s The patch does not contain any @author tags.
          +1 tests included 0m 0s The patch appears to include 2 new or modified test files.
          +1 javac 8m 26s There were no new javac warning messages.
          +1 release audit 0m 19s The applied patch does not increase the total number of release audit warnings.
          +1 checkstyle 2m 39s There were no new checkstyle issues.
          +1 whitespace 0m 0s The patch has no lines that end in whitespace.
          +1 install 1m 25s mvn install still works.
          +1 eclipse:eclipse 0m 36s The patch built with eclipse:eclipse.
          +1 findbugs 4m 45s The patch does not introduce any new Findbugs (version 3.0.0) warnings.
          +1 common tests 23m 7s Tests passed in hadoop-common.
          -1 hdfs tests 0m 22s Tests failed in hadoop-hdfs.
              52m 7s  



          Reason Tests
          Failed build hadoop-hdfs



          Subsystem Report/Notes
          Patch URL http://issues.apache.org/jira/secure/attachment/12747941/HADOOP-12268.001.patch
          Optional Tests javac unit findbugs checkstyle
          git revision trunk / ddc867ce
          hadoop-common test log https://builds.apache.org/job/PreCommit-HADOOP-Build/7369/artifact/patchprocess/testrun_hadoop-common.txt
          hadoop-hdfs test log https://builds.apache.org/job/PreCommit-HADOOP-Build/7369/artifact/patchprocess/testrun_hadoop-hdfs.txt
          Test Results https://builds.apache.org/job/PreCommit-HADOOP-Build/7369/testReport/
          Java 1.7.0_55
          uname Linux asf904.gq1.ygridcore.net 3.13.0-36-lowlatency #63-Ubuntu SMP PREEMPT Wed Sep 3 21:56:12 UTC 2014 x86_64 x86_64 x86_64 GNU/Linux
          Console output https://builds.apache.org/job/PreCommit-HADOOP-Build/7369/console

          This message was automatically generated.

          Show
          hadoopqa Hadoop QA added a comment - -1 overall Vote Subsystem Runtime Comment 0 pre-patch 10m 24s Pre-patch trunk compilation is healthy. +1 @author 0m 0s The patch does not contain any @author tags. +1 tests included 0m 0s The patch appears to include 2 new or modified test files. +1 javac 8m 26s There were no new javac warning messages. +1 release audit 0m 19s The applied patch does not increase the total number of release audit warnings. +1 checkstyle 2m 39s There were no new checkstyle issues. +1 whitespace 0m 0s The patch has no lines that end in whitespace. +1 install 1m 25s mvn install still works. +1 eclipse:eclipse 0m 36s The patch built with eclipse:eclipse. +1 findbugs 4m 45s The patch does not introduce any new Findbugs (version 3.0.0) warnings. +1 common tests 23m 7s Tests passed in hadoop-common. -1 hdfs tests 0m 22s Tests failed in hadoop-hdfs.     52m 7s   Reason Tests Failed build hadoop-hdfs Subsystem Report/Notes Patch URL http://issues.apache.org/jira/secure/attachment/12747941/HADOOP-12268.001.patch Optional Tests javac unit findbugs checkstyle git revision trunk / ddc867ce hadoop-common test log https://builds.apache.org/job/PreCommit-HADOOP-Build/7369/artifact/patchprocess/testrun_hadoop-common.txt hadoop-hdfs test log https://builds.apache.org/job/PreCommit-HADOOP-Build/7369/artifact/patchprocess/testrun_hadoop-hdfs.txt Test Results https://builds.apache.org/job/PreCommit-HADOOP-Build/7369/testReport/ Java 1.7.0_55 uname Linux asf904.gq1.ygridcore.net 3.13.0-36-lowlatency #63-Ubuntu SMP PREEMPT Wed Sep 3 21:56:12 UTC 2014 x86_64 x86_64 x86_64 GNU/Linux Console output https://builds.apache.org/job/PreCommit-HADOOP-Build/7369/console This message was automatically generated.
          Hide
          hadoopqa Hadoop QA added a comment -



          -1 overall



          Vote Subsystem Runtime Comment
          0 pre-patch 9m 17s Pre-patch trunk compilation is healthy.
          +1 @author 0m 0s The patch does not contain any @author tags.
          +1 tests included 0m 0s The patch appears to include 2 new or modified test files.
          +1 javac 7m 39s There were no new javac warning messages.
          +1 release audit 0m 20s The applied patch does not increase the total number of release audit warnings.
          +1 checkstyle 2m 22s There were no new checkstyle issues.
          +1 whitespace 0m 0s The patch has no lines that end in whitespace.
          +1 install 1m 17s mvn install still works.
          +1 eclipse:eclipse 0m 32s The patch built with eclipse:eclipse.
          +1 findbugs 4m 20s The patch does not introduce any new Findbugs (version 3.0.0) warnings.
          +1 common tests 22m 22s Tests passed in hadoop-common.
          -1 hdfs tests 158m 55s Tests failed in hadoop-hdfs.
              207m 7s  



          Reason Tests
          Failed unit tests hadoop.hdfs.TestAppendSnapshotTruncate



          Subsystem Report/Notes
          Patch URL http://issues.apache.org/jira/secure/attachment/12748028/HADOOP-12268.001.patch
          Optional Tests javac unit findbugs checkstyle
          git revision trunk / 91b42e7
          hadoop-common test log https://builds.apache.org/job/PreCommit-HADOOP-Build/7375/artifact/patchprocess/testrun_hadoop-common.txt
          hadoop-hdfs test log https://builds.apache.org/job/PreCommit-HADOOP-Build/7375/artifact/patchprocess/testrun_hadoop-hdfs.txt
          Test Results https://builds.apache.org/job/PreCommit-HADOOP-Build/7375/testReport/
          Java 1.7.0_55
          uname Linux asf901.gq1.ygridcore.net 3.13.0-36-lowlatency #63-Ubuntu SMP PREEMPT Wed Sep 3 21:56:12 UTC 2014 x86_64 x86_64 x86_64 GNU/Linux
          Console output https://builds.apache.org/job/PreCommit-HADOOP-Build/7375/console

          This message was automatically generated.

          Show
          hadoopqa Hadoop QA added a comment - -1 overall Vote Subsystem Runtime Comment 0 pre-patch 9m 17s Pre-patch trunk compilation is healthy. +1 @author 0m 0s The patch does not contain any @author tags. +1 tests included 0m 0s The patch appears to include 2 new or modified test files. +1 javac 7m 39s There were no new javac warning messages. +1 release audit 0m 20s The applied patch does not increase the total number of release audit warnings. +1 checkstyle 2m 22s There were no new checkstyle issues. +1 whitespace 0m 0s The patch has no lines that end in whitespace. +1 install 1m 17s mvn install still works. +1 eclipse:eclipse 0m 32s The patch built with eclipse:eclipse. +1 findbugs 4m 20s The patch does not introduce any new Findbugs (version 3.0.0) warnings. +1 common tests 22m 22s Tests passed in hadoop-common. -1 hdfs tests 158m 55s Tests failed in hadoop-hdfs.     207m 7s   Reason Tests Failed unit tests hadoop.hdfs.TestAppendSnapshotTruncate Subsystem Report/Notes Patch URL http://issues.apache.org/jira/secure/attachment/12748028/HADOOP-12268.001.patch Optional Tests javac unit findbugs checkstyle git revision trunk / 91b42e7 hadoop-common test log https://builds.apache.org/job/PreCommit-HADOOP-Build/7375/artifact/patchprocess/testrun_hadoop-common.txt hadoop-hdfs test log https://builds.apache.org/job/PreCommit-HADOOP-Build/7375/artifact/patchprocess/testrun_hadoop-hdfs.txt Test Results https://builds.apache.org/job/PreCommit-HADOOP-Build/7375/testReport/ Java 1.7.0_55 uname Linux asf901.gq1.ygridcore.net 3.13.0-36-lowlatency #63-Ubuntu SMP PREEMPT Wed Sep 3 21:56:12 UTC 2014 x86_64 x86_64 x86_64 GNU/Linux Console output https://builds.apache.org/job/PreCommit-HADOOP-Build/7375/console This message was automatically generated.
          Hide
          hadoopqa Hadoop QA added a comment -



          -1 overall



          Vote Subsystem Runtime Comment
          -1 pre-patch 7m 14s Findbugs (version ) appears to be broken on trunk.
          +1 @author 0m 0s The patch does not contain any @author tags.
          +1 tests included 0m 0s The patch appears to include 2 new or modified test files.
          +1 javac 7m 31s There were no new javac warning messages.
          +1 release audit 0m 19s The applied patch does not increase the total number of release audit warnings.
          +1 checkstyle 1m 35s There were no new checkstyle issues.
          +1 whitespace 0m 0s The patch has no lines that end in whitespace.
          +1 install 1m 29s mvn install still works.
          +1 eclipse:eclipse 0m 33s The patch built with eclipse:eclipse.
          +1 findbugs 4m 18s The patch does not introduce any new Findbugs (version 3.0.0) warnings.
          +1 common tests 22m 15s Tests passed in hadoop-common.
          -1 hdfs tests 161m 40s Tests failed in hadoop-hdfs.
              206m 56s  



          Reason Tests
          Failed unit tests hadoop.hdfs.server.namenode.ha.TestStandbyIsHot



          Subsystem Report/Notes
          Patch URL http://issues.apache.org/jira/secure/attachment/12748077/HADOOP-12268.001.patch
          Optional Tests javac unit findbugs checkstyle
          git revision trunk / 88d8736
          hadoop-common test log https://builds.apache.org/job/PreCommit-HADOOP-Build/7380/artifact/patchprocess/testrun_hadoop-common.txt
          hadoop-hdfs test log https://builds.apache.org/job/PreCommit-HADOOP-Build/7380/artifact/patchprocess/testrun_hadoop-hdfs.txt
          Test Results https://builds.apache.org/job/PreCommit-HADOOP-Build/7380/testReport/
          Java 1.7.0_55
          uname Linux asf906.gq1.ygridcore.net 3.13.0-36-lowlatency #63-Ubuntu SMP PREEMPT Wed Sep 3 21:56:12 UTC 2014 x86_64 x86_64 x86_64 GNU/Linux
          Console output https://builds.apache.org/job/PreCommit-HADOOP-Build/7380/console

          This message was automatically generated.

          Show
          hadoopqa Hadoop QA added a comment - -1 overall Vote Subsystem Runtime Comment -1 pre-patch 7m 14s Findbugs (version ) appears to be broken on trunk. +1 @author 0m 0s The patch does not contain any @author tags. +1 tests included 0m 0s The patch appears to include 2 new or modified test files. +1 javac 7m 31s There were no new javac warning messages. +1 release audit 0m 19s The applied patch does not increase the total number of release audit warnings. +1 checkstyle 1m 35s There were no new checkstyle issues. +1 whitespace 0m 0s The patch has no lines that end in whitespace. +1 install 1m 29s mvn install still works. +1 eclipse:eclipse 0m 33s The patch built with eclipse:eclipse. +1 findbugs 4m 18s The patch does not introduce any new Findbugs (version 3.0.0) warnings. +1 common tests 22m 15s Tests passed in hadoop-common. -1 hdfs tests 161m 40s Tests failed in hadoop-hdfs.     206m 56s   Reason Tests Failed unit tests hadoop.hdfs.server.namenode.ha.TestStandbyIsHot Subsystem Report/Notes Patch URL http://issues.apache.org/jira/secure/attachment/12748077/HADOOP-12268.001.patch Optional Tests javac unit findbugs checkstyle git revision trunk / 88d8736 hadoop-common test log https://builds.apache.org/job/PreCommit-HADOOP-Build/7380/artifact/patchprocess/testrun_hadoop-common.txt hadoop-hdfs test log https://builds.apache.org/job/PreCommit-HADOOP-Build/7380/artifact/patchprocess/testrun_hadoop-hdfs.txt Test Results https://builds.apache.org/job/PreCommit-HADOOP-Build/7380/testReport/ Java 1.7.0_55 uname Linux asf906.gq1.ygridcore.net 3.13.0-36-lowlatency #63-Ubuntu SMP PREEMPT Wed Sep 3 21:56:12 UTC 2014 x86_64 x86_64 x86_64 GNU/Linux Console output https://builds.apache.org/job/PreCommit-HADOOP-Build/7380/console This message was automatically generated.
          Hide
          hadoopqa Hadoop QA added a comment -



          -1 overall



          Vote Subsystem Runtime Comment
          0 pre-patch 9m 25s Pre-patch trunk compilation is healthy.
          +1 @author 0m 0s The patch does not contain any @author tags.
          +1 tests included 0m 0s The patch appears to include 2 new or modified test files.
          +1 javac 7m 39s There were no new javac warning messages.
          +1 release audit 0m 20s The applied patch does not increase the total number of release audit warnings.
          +1 checkstyle 2m 27s There were no new checkstyle issues.
          +1 whitespace 0m 0s The patch has no lines that end in whitespace.
          +1 install 1m 22s mvn install still works.
          +1 eclipse:eclipse 0m 32s The patch built with eclipse:eclipse.
          +1 findbugs 4m 21s The patch does not introduce any new Findbugs (version 3.0.0) warnings.
          +1 common tests 22m 26s Tests passed in hadoop-common.
          -1 hdfs tests 161m 48s Tests failed in hadoop-hdfs.
              210m 23s  



          Reason Tests
          Failed unit tests hadoop.hdfs.server.namenode.ha.TestStandbyIsHot
            hadoop.hdfs.server.namenode.ha.TestDFSUpgradeWithHA



          Subsystem Report/Notes
          Patch URL http://issues.apache.org/jira/secure/attachment/12748104/HADOOP-12268.001.patch
          Optional Tests javac unit findbugs checkstyle
          git revision trunk / 88d8736
          hadoop-common test log https://builds.apache.org/job/PreCommit-HADOOP-Build/7381/artifact/patchprocess/testrun_hadoop-common.txt
          hadoop-hdfs test log https://builds.apache.org/job/PreCommit-HADOOP-Build/7381/artifact/patchprocess/testrun_hadoop-hdfs.txt
          Test Results https://builds.apache.org/job/PreCommit-HADOOP-Build/7381/testReport/
          Java 1.7.0_55
          uname Linux asf900.gq1.ygridcore.net 3.13.0-36-lowlatency #63-Ubuntu SMP PREEMPT Wed Sep 3 21:56:12 UTC 2014 x86_64 x86_64 x86_64 GNU/Linux
          Console output https://builds.apache.org/job/PreCommit-HADOOP-Build/7381/console

          This message was automatically generated.

          Show
          hadoopqa Hadoop QA added a comment - -1 overall Vote Subsystem Runtime Comment 0 pre-patch 9m 25s Pre-patch trunk compilation is healthy. +1 @author 0m 0s The patch does not contain any @author tags. +1 tests included 0m 0s The patch appears to include 2 new or modified test files. +1 javac 7m 39s There were no new javac warning messages. +1 release audit 0m 20s The applied patch does not increase the total number of release audit warnings. +1 checkstyle 2m 27s There were no new checkstyle issues. +1 whitespace 0m 0s The patch has no lines that end in whitespace. +1 install 1m 22s mvn install still works. +1 eclipse:eclipse 0m 32s The patch built with eclipse:eclipse. +1 findbugs 4m 21s The patch does not introduce any new Findbugs (version 3.0.0) warnings. +1 common tests 22m 26s Tests passed in hadoop-common. -1 hdfs tests 161m 48s Tests failed in hadoop-hdfs.     210m 23s   Reason Tests Failed unit tests hadoop.hdfs.server.namenode.ha.TestStandbyIsHot   hadoop.hdfs.server.namenode.ha.TestDFSUpgradeWithHA Subsystem Report/Notes Patch URL http://issues.apache.org/jira/secure/attachment/12748104/HADOOP-12268.001.patch Optional Tests javac unit findbugs checkstyle git revision trunk / 88d8736 hadoop-common test log https://builds.apache.org/job/PreCommit-HADOOP-Build/7381/artifact/patchprocess/testrun_hadoop-common.txt hadoop-hdfs test log https://builds.apache.org/job/PreCommit-HADOOP-Build/7381/artifact/patchprocess/testrun_hadoop-hdfs.txt Test Results https://builds.apache.org/job/PreCommit-HADOOP-Build/7381/testReport/ Java 1.7.0_55 uname Linux asf900.gq1.ygridcore.net 3.13.0-36-lowlatency #63-Ubuntu SMP PREEMPT Wed Sep 3 21:56:12 UTC 2014 x86_64 x86_64 x86_64 GNU/Linux Console output https://builds.apache.org/job/PreCommit-HADOOP-Build/7381/console This message was automatically generated.
          Hide
          ajisakaa Akira Ajisaka added a comment -

          +1, thanks zhihai xu. These test failures look unrelated to the patch. They were reported by HDFS-8772 and HDFS-7553.

          Show
          ajisakaa Akira Ajisaka added a comment - +1, thanks zhihai xu . These test failures look unrelated to the patch. They were reported by HDFS-8772 and HDFS-7553 .
          Hide
          zxu zhihai xu added a comment -

          thanks for the review Akira Ajisaka! Will commit the patch shortly.

          Show
          zxu zhihai xu added a comment - thanks for the review Akira Ajisaka ! Will commit the patch shortly.
          Hide
          zxu zhihai xu added a comment -

          HADOOP-12268.001.patch has change in hdfs project. Split the patch to two changes: AbstractContractAppendTest.java for HADOOP-12268 and TestHDFSContractAppend.java for HDFS-8847.

          Show
          zxu zhihai xu added a comment - HADOOP-12268 .001.patch has change in hdfs project. Split the patch to two changes: AbstractContractAppendTest.java for HADOOP-12268 and TestHDFSContractAppend.java for HDFS-8847 .
          Hide
          zxu zhihai xu added a comment -

          I committed the patch to trunk and branch-2.

          Show
          zxu zhihai xu added a comment - I committed the patch to trunk and branch-2.
          Hide
          hudson Hudson added a comment -

          FAILURE: Integrated in Hadoop-trunk-Commit #8254 (See https://builds.apache.org/job/Hadoop-trunk-Commit/8254/)
          HADOOP-12268. AbstractContractAppendTest#testRenameFileBeingAppended misses rename operation. Contributed by Zhihai Xu (zxu: rev a628a6f126473a99f9370ba642994ce2909a2d9e)

          • hadoop-common-project/hadoop-common/CHANGES.txt
          • hadoop-common-project/hadoop-common/src/test/java/org/apache/hadoop/fs/contract/AbstractContractAppendTest.java
          Show
          hudson Hudson added a comment - FAILURE: Integrated in Hadoop-trunk-Commit #8254 (See https://builds.apache.org/job/Hadoop-trunk-Commit/8254/ ) HADOOP-12268 . AbstractContractAppendTest#testRenameFileBeingAppended misses rename operation. Contributed by Zhihai Xu (zxu: rev a628a6f126473a99f9370ba642994ce2909a2d9e) hadoop-common-project/hadoop-common/CHANGES.txt hadoop-common-project/hadoop-common/src/test/java/org/apache/hadoop/fs/contract/AbstractContractAppendTest.java
          Hide
          hudson Hudson added a comment -

          FAILURE: Integrated in Hadoop-Yarn-trunk #1004 (See https://builds.apache.org/job/Hadoop-Yarn-trunk/1004/)
          HADOOP-12268. AbstractContractAppendTest#testRenameFileBeingAppended misses rename operation. Contributed by Zhihai Xu (zxu: rev a628a6f126473a99f9370ba642994ce2909a2d9e)

          • hadoop-common-project/hadoop-common/CHANGES.txt
          • hadoop-common-project/hadoop-common/src/test/java/org/apache/hadoop/fs/contract/AbstractContractAppendTest.java
          Show
          hudson Hudson added a comment - FAILURE: Integrated in Hadoop-Yarn-trunk #1004 (See https://builds.apache.org/job/Hadoop-Yarn-trunk/1004/ ) HADOOP-12268 . AbstractContractAppendTest#testRenameFileBeingAppended misses rename operation. Contributed by Zhihai Xu (zxu: rev a628a6f126473a99f9370ba642994ce2909a2d9e) hadoop-common-project/hadoop-common/CHANGES.txt hadoop-common-project/hadoop-common/src/test/java/org/apache/hadoop/fs/contract/AbstractContractAppendTest.java
          Hide
          hudson Hudson added a comment -

          SUCCESS: Integrated in Hadoop-Yarn-trunk-Java8 #274 (See https://builds.apache.org/job/Hadoop-Yarn-trunk-Java8/274/)
          HADOOP-12268. AbstractContractAppendTest#testRenameFileBeingAppended misses rename operation. Contributed by Zhihai Xu (zxu: rev a628a6f126473a99f9370ba642994ce2909a2d9e)

          • hadoop-common-project/hadoop-common/CHANGES.txt
          • hadoop-common-project/hadoop-common/src/test/java/org/apache/hadoop/fs/contract/AbstractContractAppendTest.java
          Show
          hudson Hudson added a comment - SUCCESS: Integrated in Hadoop-Yarn-trunk-Java8 #274 (See https://builds.apache.org/job/Hadoop-Yarn-trunk-Java8/274/ ) HADOOP-12268 . AbstractContractAppendTest#testRenameFileBeingAppended misses rename operation. Contributed by Zhihai Xu (zxu: rev a628a6f126473a99f9370ba642994ce2909a2d9e) hadoop-common-project/hadoop-common/CHANGES.txt hadoop-common-project/hadoop-common/src/test/java/org/apache/hadoop/fs/contract/AbstractContractAppendTest.java
          Hide
          hudson Hudson added a comment -

          FAILURE: Integrated in Hadoop-Mapreduce-trunk #2220 (See https://builds.apache.org/job/Hadoop-Mapreduce-trunk/2220/)
          HADOOP-12268. AbstractContractAppendTest#testRenameFileBeingAppended misses rename operation. Contributed by Zhihai Xu (zxu: rev a628a6f126473a99f9370ba642994ce2909a2d9e)

          • hadoop-common-project/hadoop-common/CHANGES.txt
          • hadoop-common-project/hadoop-common/src/test/java/org/apache/hadoop/fs/contract/AbstractContractAppendTest.java
          Show
          hudson Hudson added a comment - FAILURE: Integrated in Hadoop-Mapreduce-trunk #2220 (See https://builds.apache.org/job/Hadoop-Mapreduce-trunk/2220/ ) HADOOP-12268 . AbstractContractAppendTest#testRenameFileBeingAppended misses rename operation. Contributed by Zhihai Xu (zxu: rev a628a6f126473a99f9370ba642994ce2909a2d9e) hadoop-common-project/hadoop-common/CHANGES.txt hadoop-common-project/hadoop-common/src/test/java/org/apache/hadoop/fs/contract/AbstractContractAppendTest.java
          Hide
          hudson Hudson added a comment -

          FAILURE: Integrated in Hadoop-Hdfs-trunk #2201 (See https://builds.apache.org/job/Hadoop-Hdfs-trunk/2201/)
          HADOOP-12268. AbstractContractAppendTest#testRenameFileBeingAppended misses rename operation. Contributed by Zhihai Xu (zxu: rev a628a6f126473a99f9370ba642994ce2909a2d9e)

          • hadoop-common-project/hadoop-common/CHANGES.txt
          • hadoop-common-project/hadoop-common/src/test/java/org/apache/hadoop/fs/contract/AbstractContractAppendTest.java
          Show
          hudson Hudson added a comment - FAILURE: Integrated in Hadoop-Hdfs-trunk #2201 (See https://builds.apache.org/job/Hadoop-Hdfs-trunk/2201/ ) HADOOP-12268 . AbstractContractAppendTest#testRenameFileBeingAppended misses rename operation. Contributed by Zhihai Xu (zxu: rev a628a6f126473a99f9370ba642994ce2909a2d9e) hadoop-common-project/hadoop-common/CHANGES.txt hadoop-common-project/hadoop-common/src/test/java/org/apache/hadoop/fs/contract/AbstractContractAppendTest.java
          Hide
          hudson Hudson added a comment -

          FAILURE: Integrated in Hadoop-Hdfs-trunk-Java8 #263 (See https://builds.apache.org/job/Hadoop-Hdfs-trunk-Java8/263/)
          HADOOP-12268. AbstractContractAppendTest#testRenameFileBeingAppended misses rename operation. Contributed by Zhihai Xu (zxu: rev a628a6f126473a99f9370ba642994ce2909a2d9e)

          • hadoop-common-project/hadoop-common/src/test/java/org/apache/hadoop/fs/contract/AbstractContractAppendTest.java
          • hadoop-common-project/hadoop-common/CHANGES.txt
          Show
          hudson Hudson added a comment - FAILURE: Integrated in Hadoop-Hdfs-trunk-Java8 #263 (See https://builds.apache.org/job/Hadoop-Hdfs-trunk-Java8/263/ ) HADOOP-12268 . AbstractContractAppendTest#testRenameFileBeingAppended misses rename operation. Contributed by Zhihai Xu (zxu: rev a628a6f126473a99f9370ba642994ce2909a2d9e) hadoop-common-project/hadoop-common/src/test/java/org/apache/hadoop/fs/contract/AbstractContractAppendTest.java hadoop-common-project/hadoop-common/CHANGES.txt
          Hide
          hudson Hudson added a comment -

          SUCCESS: Integrated in Hadoop-Mapreduce-trunk-Java8 #271 (See https://builds.apache.org/job/Hadoop-Mapreduce-trunk-Java8/271/)
          HADOOP-12268. AbstractContractAppendTest#testRenameFileBeingAppended misses rename operation. Contributed by Zhihai Xu (zxu: rev a628a6f126473a99f9370ba642994ce2909a2d9e)

          • hadoop-common-project/hadoop-common/src/test/java/org/apache/hadoop/fs/contract/AbstractContractAppendTest.java
          • hadoop-common-project/hadoop-common/CHANGES.txt
          Show
          hudson Hudson added a comment - SUCCESS: Integrated in Hadoop-Mapreduce-trunk-Java8 #271 (See https://builds.apache.org/job/Hadoop-Mapreduce-trunk-Java8/271/ ) HADOOP-12268 . AbstractContractAppendTest#testRenameFileBeingAppended misses rename operation. Contributed by Zhihai Xu (zxu: rev a628a6f126473a99f9370ba642994ce2909a2d9e) hadoop-common-project/hadoop-common/src/test/java/org/apache/hadoop/fs/contract/AbstractContractAppendTest.java hadoop-common-project/hadoop-common/CHANGES.txt

            People

            • Assignee:
              zxu zhihai xu
              Reporter:
              zxu zhihai xu
            • Votes:
              0 Vote for this issue
              Watchers:
              4 Start watching this issue

              Dates

              • Created:
                Updated:
                Resolved:

                Development