Uploaded image for project: 'Hadoop Common'
  1. Hadoop Common
  2. HADOOP-12200

TestCryptoStreamsWithOpensslAesCtrCryptoCodec should be skipped in non-native profile

    Details

    • Type: Bug
    • Status: Resolved
    • Priority: Minor
    • Resolution: Fixed
    • Affects Version/s: 2.8.0
    • Fix Version/s: 2.8.0, 3.0.0-alpha1
    • Component/s: test
    • Labels:
      None
    • Target Version/s:
    • Hadoop Flags:
      Reviewed

      Description

      mvn test -Dtest=TestCryptoStreamsWithOpensslAesCtrCryptoCodec fails on trunk and branch-2.

      org.apache.hadoop.crypto.TestCryptoStreamsWithOpensslAesCtrCryptoCodec  Time elapsed: 0.69 sec  <<< FAILURE!
      java.lang.AssertionError: Unable to instantiate codec org.apache.hadoop.crypto.OpensslAesCtrCryptoCodec, is the required version of OpenSSL installed?
      	at org.junit.Assert.fail(Assert.java:88)
      	at org.junit.Assert.assertTrue(Assert.java:41)
      	at org.junit.Assert.assertNotNull(Assert.java:621)
      	at org.apache.hadoop.crypto.TestCryptoStreamsWithOpensslAesCtrCryptoCodec.init(TestCryptoStreamsWithOpensslAesCtrCryptoCodec.java:37)
      

        Issue Links

          Activity

          Hide
          hadoopqa Hadoop QA added a comment -



          -1 overall



          Vote Subsystem Runtime Comment
          0 pre-patch 7m 16s Pre-patch trunk compilation is healthy.
          +1 @author 0m 0s The patch does not contain any @author tags.
          +1 tests included 0m 0s The patch appears to include 1 new or modified test files.
          +1 javac 7m 40s There were no new javac warning messages.
          +1 release audit 0m 19s The applied patch does not increase the total number of release audit warnings.
          +1 checkstyle 1m 6s There were no new checkstyle issues.
          +1 whitespace 0m 0s The patch has no lines that end in whitespace.
          +1 install 1m 34s mvn install still works.
          +1 eclipse:eclipse 0m 31s The patch built with eclipse:eclipse.
          +1 findbugs 1m 52s The patch does not introduce any new Findbugs (version 3.0.0) warnings.
          -1 common tests 21m 21s Tests failed in hadoop-common.
              41m 42s  



          Reason Tests
          Failed unit tests hadoop.security.token.delegation.web.TestWebDelegationToken



          Subsystem Report/Notes
          Patch URL http://issues.apache.org/jira/secure/attachment/12743913/HADOOP-12200.001.patch
          Optional Tests javac unit findbugs checkstyle
          git revision trunk / af63427
          hadoop-common test log https://builds.apache.org/job/PreCommit-HADOOP-Build/7177/artifact/patchprocess/testrun_hadoop-common.txt
          Test Results https://builds.apache.org/job/PreCommit-HADOOP-Build/7177/testReport/
          Java 1.7.0_55
          uname Linux asf907.gq1.ygridcore.net 3.13.0-36-lowlatency #63-Ubuntu SMP PREEMPT Wed Sep 3 21:56:12 UTC 2014 x86_64 x86_64 x86_64 GNU/Linux
          Console output https://builds.apache.org/job/PreCommit-HADOOP-Build/7177/console

          This message was automatically generated.

          Show
          hadoopqa Hadoop QA added a comment - -1 overall Vote Subsystem Runtime Comment 0 pre-patch 7m 16s Pre-patch trunk compilation is healthy. +1 @author 0m 0s The patch does not contain any @author tags. +1 tests included 0m 0s The patch appears to include 1 new or modified test files. +1 javac 7m 40s There were no new javac warning messages. +1 release audit 0m 19s The applied patch does not increase the total number of release audit warnings. +1 checkstyle 1m 6s There were no new checkstyle issues. +1 whitespace 0m 0s The patch has no lines that end in whitespace. +1 install 1m 34s mvn install still works. +1 eclipse:eclipse 0m 31s The patch built with eclipse:eclipse. +1 findbugs 1m 52s The patch does not introduce any new Findbugs (version 3.0.0) warnings. -1 common tests 21m 21s Tests failed in hadoop-common.     41m 42s   Reason Tests Failed unit tests hadoop.security.token.delegation.web.TestWebDelegationToken Subsystem Report/Notes Patch URL http://issues.apache.org/jira/secure/attachment/12743913/HADOOP-12200.001.patch Optional Tests javac unit findbugs checkstyle git revision trunk / af63427 hadoop-common test log https://builds.apache.org/job/PreCommit-HADOOP-Build/7177/artifact/patchprocess/testrun_hadoop-common.txt Test Results https://builds.apache.org/job/PreCommit-HADOOP-Build/7177/testReport/ Java 1.7.0_55 uname Linux asf907.gq1.ygridcore.net 3.13.0-36-lowlatency #63-Ubuntu SMP PREEMPT Wed Sep 3 21:56:12 UTC 2014 x86_64 x86_64 x86_64 GNU/Linux Console output https://builds.apache.org/job/PreCommit-HADOOP-Build/7177/console This message was automatically generated.
          Hide
          iwasakims Masatake Iwasaki added a comment -

          The test failure is not related to the patch. HADOOP-11439 seems to be filed for this.

          Show
          iwasakims Masatake Iwasaki added a comment - The test failure is not related to the patch. HADOOP-11439 seems to be filed for this.
          Hide
          ajisakaa Akira Ajisaka added a comment -

          +1, thanks Masatake.

          Show
          ajisakaa Akira Ajisaka added a comment - +1, thanks Masatake.
          Hide
          ajisakaa Akira Ajisaka added a comment -

          Committed this patch to trunk and branch-2. Thanks Masatake Iwasaki for the contribution.

          Show
          ajisakaa Akira Ajisaka added a comment - Committed this patch to trunk and branch-2. Thanks Masatake Iwasaki for the contribution.
          Hide
          hudson Hudson added a comment -

          FAILURE: Integrated in Hadoop-trunk-Commit #8137 (See https://builds.apache.org/job/Hadoop-trunk-Commit/8137/)
          HADOOP-12200. TestCryptoStreamsWithOpensslAesCtrCryptoCodec should be skipped in non-native profile. Contributed by Masatake Iwasaki. (aajisaka: rev 6b7692c468931215ec0de7e11f0bdf15b80e68ce)

          • hadoop-common-project/hadoop-common/CHANGES.txt
          • hadoop-common-project/hadoop-common/src/test/java/org/apache/hadoop/crypto/TestCryptoStreamsWithOpensslAesCtrCryptoCodec.java
          Show
          hudson Hudson added a comment - FAILURE: Integrated in Hadoop-trunk-Commit #8137 (See https://builds.apache.org/job/Hadoop-trunk-Commit/8137/ ) HADOOP-12200 . TestCryptoStreamsWithOpensslAesCtrCryptoCodec should be skipped in non-native profile. Contributed by Masatake Iwasaki. (aajisaka: rev 6b7692c468931215ec0de7e11f0bdf15b80e68ce) hadoop-common-project/hadoop-common/CHANGES.txt hadoop-common-project/hadoop-common/src/test/java/org/apache/hadoop/crypto/TestCryptoStreamsWithOpensslAesCtrCryptoCodec.java
          Hide
          hudson Hudson added a comment -

          FAILURE: Integrated in Hadoop-Yarn-trunk-Java8 #251 (See https://builds.apache.org/job/Hadoop-Yarn-trunk-Java8/251/)
          HADOOP-12200. TestCryptoStreamsWithOpensslAesCtrCryptoCodec should be skipped in non-native profile. Contributed by Masatake Iwasaki. (aajisaka: rev 6b7692c468931215ec0de7e11f0bdf15b80e68ce)

          • hadoop-common-project/hadoop-common/CHANGES.txt
          • hadoop-common-project/hadoop-common/src/test/java/org/apache/hadoop/crypto/TestCryptoStreamsWithOpensslAesCtrCryptoCodec.java
          Show
          hudson Hudson added a comment - FAILURE: Integrated in Hadoop-Yarn-trunk-Java8 #251 (See https://builds.apache.org/job/Hadoop-Yarn-trunk-Java8/251/ ) HADOOP-12200 . TestCryptoStreamsWithOpensslAesCtrCryptoCodec should be skipped in non-native profile. Contributed by Masatake Iwasaki. (aajisaka: rev 6b7692c468931215ec0de7e11f0bdf15b80e68ce) hadoop-common-project/hadoop-common/CHANGES.txt hadoop-common-project/hadoop-common/src/test/java/org/apache/hadoop/crypto/TestCryptoStreamsWithOpensslAesCtrCryptoCodec.java
          Hide
          hudson Hudson added a comment -

          FAILURE: Integrated in Hadoop-Yarn-trunk #981 (See https://builds.apache.org/job/Hadoop-Yarn-trunk/981/)
          HADOOP-12200. TestCryptoStreamsWithOpensslAesCtrCryptoCodec should be skipped in non-native profile. Contributed by Masatake Iwasaki. (aajisaka: rev 6b7692c468931215ec0de7e11f0bdf15b80e68ce)

          • hadoop-common-project/hadoop-common/CHANGES.txt
          • hadoop-common-project/hadoop-common/src/test/java/org/apache/hadoop/crypto/TestCryptoStreamsWithOpensslAesCtrCryptoCodec.java
          Show
          hudson Hudson added a comment - FAILURE: Integrated in Hadoop-Yarn-trunk #981 (See https://builds.apache.org/job/Hadoop-Yarn-trunk/981/ ) HADOOP-12200 . TestCryptoStreamsWithOpensslAesCtrCryptoCodec should be skipped in non-native profile. Contributed by Masatake Iwasaki. (aajisaka: rev 6b7692c468931215ec0de7e11f0bdf15b80e68ce) hadoop-common-project/hadoop-common/CHANGES.txt hadoop-common-project/hadoop-common/src/test/java/org/apache/hadoop/crypto/TestCryptoStreamsWithOpensslAesCtrCryptoCodec.java
          Hide
          hudson Hudson added a comment -

          FAILURE: Integrated in Hadoop-Hdfs-trunk-Java8 #239 (See https://builds.apache.org/job/Hadoop-Hdfs-trunk-Java8/239/)
          HADOOP-12200. TestCryptoStreamsWithOpensslAesCtrCryptoCodec should be skipped in non-native profile. Contributed by Masatake Iwasaki. (aajisaka: rev 6b7692c468931215ec0de7e11f0bdf15b80e68ce)

          • hadoop-common-project/hadoop-common/src/test/java/org/apache/hadoop/crypto/TestCryptoStreamsWithOpensslAesCtrCryptoCodec.java
          • hadoop-common-project/hadoop-common/CHANGES.txt
          Show
          hudson Hudson added a comment - FAILURE: Integrated in Hadoop-Hdfs-trunk-Java8 #239 (See https://builds.apache.org/job/Hadoop-Hdfs-trunk-Java8/239/ ) HADOOP-12200 . TestCryptoStreamsWithOpensslAesCtrCryptoCodec should be skipped in non-native profile. Contributed by Masatake Iwasaki. (aajisaka: rev 6b7692c468931215ec0de7e11f0bdf15b80e68ce) hadoop-common-project/hadoop-common/src/test/java/org/apache/hadoop/crypto/TestCryptoStreamsWithOpensslAesCtrCryptoCodec.java hadoop-common-project/hadoop-common/CHANGES.txt
          Hide
          hudson Hudson added a comment -

          SUCCESS: Integrated in Hadoop-Hdfs-trunk #2178 (See https://builds.apache.org/job/Hadoop-Hdfs-trunk/2178/)
          HADOOP-12200. TestCryptoStreamsWithOpensslAesCtrCryptoCodec should be skipped in non-native profile. Contributed by Masatake Iwasaki. (aajisaka: rev 6b7692c468931215ec0de7e11f0bdf15b80e68ce)

          • hadoop-common-project/hadoop-common/CHANGES.txt
          • hadoop-common-project/hadoop-common/src/test/java/org/apache/hadoop/crypto/TestCryptoStreamsWithOpensslAesCtrCryptoCodec.java
          Show
          hudson Hudson added a comment - SUCCESS: Integrated in Hadoop-Hdfs-trunk #2178 (See https://builds.apache.org/job/Hadoop-Hdfs-trunk/2178/ ) HADOOP-12200 . TestCryptoStreamsWithOpensslAesCtrCryptoCodec should be skipped in non-native profile. Contributed by Masatake Iwasaki. (aajisaka: rev 6b7692c468931215ec0de7e11f0bdf15b80e68ce) hadoop-common-project/hadoop-common/CHANGES.txt hadoop-common-project/hadoop-common/src/test/java/org/apache/hadoop/crypto/TestCryptoStreamsWithOpensslAesCtrCryptoCodec.java
          Hide
          hudson Hudson added a comment -

          SUCCESS: Integrated in Hadoop-Mapreduce-trunk-Java8 #249 (See https://builds.apache.org/job/Hadoop-Mapreduce-trunk-Java8/249/)
          HADOOP-12200. TestCryptoStreamsWithOpensslAesCtrCryptoCodec should be skipped in non-native profile. Contributed by Masatake Iwasaki. (aajisaka: rev 6b7692c468931215ec0de7e11f0bdf15b80e68ce)

          • hadoop-common-project/hadoop-common/CHANGES.txt
          • hadoop-common-project/hadoop-common/src/test/java/org/apache/hadoop/crypto/TestCryptoStreamsWithOpensslAesCtrCryptoCodec.java
          Show
          hudson Hudson added a comment - SUCCESS: Integrated in Hadoop-Mapreduce-trunk-Java8 #249 (See https://builds.apache.org/job/Hadoop-Mapreduce-trunk-Java8/249/ ) HADOOP-12200 . TestCryptoStreamsWithOpensslAesCtrCryptoCodec should be skipped in non-native profile. Contributed by Masatake Iwasaki. (aajisaka: rev 6b7692c468931215ec0de7e11f0bdf15b80e68ce) hadoop-common-project/hadoop-common/CHANGES.txt hadoop-common-project/hadoop-common/src/test/java/org/apache/hadoop/crypto/TestCryptoStreamsWithOpensslAesCtrCryptoCodec.java
          Hide
          hudson Hudson added a comment -

          SUCCESS: Integrated in Hadoop-Mapreduce-trunk #2197 (See https://builds.apache.org/job/Hadoop-Mapreduce-trunk/2197/)
          HADOOP-12200. TestCryptoStreamsWithOpensslAesCtrCryptoCodec should be skipped in non-native profile. Contributed by Masatake Iwasaki. (aajisaka: rev 6b7692c468931215ec0de7e11f0bdf15b80e68ce)

          • hadoop-common-project/hadoop-common/src/test/java/org/apache/hadoop/crypto/TestCryptoStreamsWithOpensslAesCtrCryptoCodec.java
          • hadoop-common-project/hadoop-common/CHANGES.txt
          Show
          hudson Hudson added a comment - SUCCESS: Integrated in Hadoop-Mapreduce-trunk #2197 (See https://builds.apache.org/job/Hadoop-Mapreduce-trunk/2197/ ) HADOOP-12200 . TestCryptoStreamsWithOpensslAesCtrCryptoCodec should be skipped in non-native profile. Contributed by Masatake Iwasaki. (aajisaka: rev 6b7692c468931215ec0de7e11f0bdf15b80e68ce) hadoop-common-project/hadoop-common/src/test/java/org/apache/hadoop/crypto/TestCryptoStreamsWithOpensslAesCtrCryptoCodec.java hadoop-common-project/hadoop-common/CHANGES.txt

            People

            • Assignee:
              iwasakims Masatake Iwasaki
              Reporter:
              iwasakims Masatake Iwasaki
            • Votes:
              0 Vote for this issue
              Watchers:
              4 Start watching this issue

              Dates

              • Created:
                Updated:
                Resolved:

                Development