Uploaded image for project: 'Hadoop Common'
  1. Hadoop Common
  2. HADOOP-12100

ImmutableFsPermission should not override applyUmask since that method doesn't modify the FsPermission

Log workAgile BoardRank to TopRank to BottomAttach filesAttach ScreenshotBulk Copy AttachmentsBulk Move AttachmentsVotersWatch issueWatchersCreate sub-taskConvert to sub-taskMoveLinkCloneLabelsUpdate Comment AuthorReplace String in CommentUpdate Comment VisibilityDelete Comments
    XMLWordPrintableJSON

Details

    • Bug
    • Status: Closed
    • Major
    • Resolution: Fixed
    • 2.7.1
    • 2.8.0, 2.7.1, 3.0.0-alpha1
    • None
    • None

    Description

      ImmutableFsPermission should not override applyUmask since that method doesn't modify the FsPermission.

      This bug is currently causing the TestRollingLevelDBTimelineStore test to fail. HADOOP-11347 changed some code to use applyUmask, which exposed this bug.

      Running org.apache.hadoop.yarn.server.timeline.TestRollingLevelDBTimelineStore
      Tests run: 16, Failures: 0, Errors: 16, Skipped: 0, Time elapsed: 2.65 sec <<< FAILURE! - in org.apache.hadoop.yarn.server.timeline.TestRollingLevelDBTimelineStore
      testGetDomains(org.apache.hadoop.yarn.server.timeline.TestRollingLevelDBTimelineStore)  Time elapsed: 1.533 sec  <<< ERROR!
      java.lang.UnsupportedOperationException: null
      	at org.apache.hadoop.fs.permission.FsPermission$ImmutableFsPermission.applyUMask(FsPermission.java:380)
      	at org.apache.hadoop.fs.RawLocalFileSystem.mkOneDirWithMode(RawLocalFileSystem.java:496)
      	at org.apache.hadoop.fs.RawLocalFileSystem.mkdirsWithOptionalPermission(RawLocalFileSystem.java:551)
      	at org.apache.hadoop.fs.RawLocalFileSystem.mkdirs(RawLocalFileSystem.java:529)
      	at org.apache.hadoop.fs.FilterFileSystem.mkdirs(FilterFileSystem.java:314)
      	at org.apache.hadoop.yarn.server.timeline.RollingLevelDB.initFileSystem(RollingLevelDB.java:207)
      	at org.apache.hadoop.yarn.server.timeline.RollingLevelDB.init(RollingLevelDB.java:200)
      	at org.apache.hadoop.yarn.server.timeline.RollingLevelDBTimelineStore.serviceInit(RollingLevelDBTimelineStore.java:321)
      	at org.apache.hadoop.service.AbstractService.init(AbstractService.java:163)
      	at org.apache.hadoop.yarn.server.timeline.TestRollingLevelDBTimelineStore.setup(TestRollingLevelDBTimelineStore.java:65)
      
      testRelatingToNonExistingEntity(org.apache.hadoop.yarn.server.timeline.TestRollingLevelDBTimelineStore)  Time elapsed: 0.085 sec  <<< ERROR!
      java.lang.UnsupportedOperationException: null
      	at org.apache.hadoop.fs.permission.FsPermission$ImmutableFsPermission.applyUMask(FsPermission.java:380)
      	at org.apache.hadoop.fs.RawLocalFileSystem.mkOneDirWithMode(RawLocalFileSystem.java:496)
      	at org.apache.hadoop.fs.RawLocalFileSystem.mkdirsWithOptionalPermission(RawLocalFileSystem.java:551)
      	at org.apache.hadoop.fs.RawLocalFileSystem.mkdirs(RawLocalFileSystem.java:529)
      	at org.apache.hadoop.fs.FilterFileSystem.mkdirs(FilterFileSystem.java:314)
      	at org.apache.hadoop.yarn.server.timeline.RollingLevelDB.initFileSystem(RollingLevelDB.java:207)
      	at org.apache.hadoop.yarn.server.timeline.RollingLevelDB.init(RollingLevelDB.java:200)
      	at org.apache.hadoop.yarn.server.timeline.RollingLevelDBTimelineStore.serviceInit(RollingLevelDBTimelineStore.java:321)
      	at org.apache.hadoop.service.AbstractService.init(AbstractService.java:163)
      	at org.apache.hadoop.yarn.server.timeline.TestRollingLevelDBTimelineStore.setup(TestRollingLevelDBTimelineStore.java:65)
      
      testValidateConfig(org.apache.hadoop.yarn.server.timeline.TestRollingLevelDBTimelineStore)  Time elapsed: 0.07 sec  <<< ERROR!
      java.lang.UnsupportedOperationException: null
      	at org.apache.hadoop.fs.permission.FsPermission$ImmutableFsPermission.applyUMask(FsPermission.java:380)
      	at org.apache.hadoop.fs.RawLocalFileSystem.mkOneDirWithMode(RawLocalFileSystem.java:496)
      	at org.apache.hadoop.fs.RawLocalFileSystem.mkdirsWithOptionalPermission(RawLocalFileSystem.java:551)
      	at org.apache.hadoop.fs.RawLocalFileSystem.mkdirs(RawLocalFileSystem.java:529)
      	at org.apache.hadoop.fs.FilterFileSystem.mkdirs(FilterFileSystem.java:314)
      	at org.apache.hadoop.yarn.server.timeline.RollingLevelDB.initFileSystem(RollingLevelDB.java:207)
      	at org.apache.hadoop.yarn.server.timeline.RollingLevelDB.init(RollingLevelDB.java:200)
      	at org.apache.hadoop.yarn.server.timeline.RollingLevelDBTimelineStore.serviceInit(RollingLevelDBTimelineStore.java:321)
      	at org.apache.hadoop.service.AbstractService.init(AbstractService.java:163)
      	at org.apache.hadoop.yarn.server.timeline.TestRollingLevelDBTimelineStore.setup(TestRollingLevelDBTimelineStore.java:65)
      
      testGetEntitiesWithPrimaryFilters(org.apache.hadoop.yarn.server.timeline.TestRollingLevelDBTimelineStore)  Time elapsed: 0.061 sec  <<< ERROR!
      java.lang.UnsupportedOperationException: null
      	at org.apache.hadoop.fs.permission.FsPermission$ImmutableFsPermission.applyUMask(FsPermission.java:380)
      	at org.apache.hadoop.fs.RawLocalFileSystem.mkOneDirWithMode(RawLocalFileSystem.java:496)
      	at org.apache.hadoop.fs.RawLocalFileSystem.mkdirsWithOptionalPermission(RawLocalFileSystem.java:551)
      	at org.apache.hadoop.fs.RawLocalFileSystem.mkdirs(RawLocalFileSystem.java:529)
      	at org.apache.hadoop.fs.FilterFileSystem.mkdirs(FilterFileSystem.java:314)
      	at org.apache.hadoop.yarn.server.timeline.RollingLevelDB.initFileSystem(RollingLevelDB.java:207)
      	at org.apache.hadoop.yarn.server.timeline.RollingLevelDB.init(RollingLevelDB.java:200)
      	at org.apache.hadoop.yarn.server.timeline.RollingLevelDBTimelineStore.serviceInit(RollingLevelDBTimelineStore.java:321)
      	at org.apache.hadoop.service.AbstractService.init(AbstractService.java:163)
      	at org.apache.hadoop.yarn.server.timeline.TestRollingLevelDBTimelineStore.setup(TestRollingLevelDBTimelineStore.java:65)
      
      testRelatingToOldEntityWithoutDomainId(org.apache.hadoop.yarn.server.timeline.TestRollingLevelDBTimelineStore)  Time elapsed: 0.055 sec  <<< ERROR!
      java.lang.UnsupportedOperationException: null
      	at org.apache.hadoop.fs.permission.FsPermission$ImmutableFsPermission.applyUMask(FsPermission.java:380)
      	at org.apache.hadoop.fs.RawLocalFileSystem.mkOneDirWithMode(RawLocalFileSystem.java:496)
      	at org.apache.hadoop.fs.RawLocalFileSystem.mkdirsWithOptionalPermission(RawLocalFileSystem.java:551)
      	at org.apache.hadoop.fs.RawLocalFileSystem.mkdirs(RawLocalFileSystem.java:529)
      	at org.apache.hadoop.fs.FilterFileSystem.mkdirs(FilterFileSystem.java:314)
      	at org.apache.hadoop.yarn.server.timeline.RollingLevelDB.initFileSystem(RollingLevelDB.java:207)
      	at org.apache.hadoop.yarn.server.timeline.RollingLevelDB.init(RollingLevelDB.java:200)
      	at org.apache.hadoop.yarn.server.timeline.RollingLevelDBTimelineStore.serviceInit(RollingLevelDBTimelineStore.java:321)
      	at org.apache.hadoop.service.AbstractService.init(AbstractService.java:163)
      	at org.apache.hadoop.yarn.server.timeline.TestRollingLevelDBTimelineStore.setup(TestRollingLevelDBTimelineStore.java:65)
      
      testRootDirPermission(org.apache.hadoop.yarn.server.timeline.TestRollingLevelDBTimelineStore)  Time elapsed: 0.056 sec  <<< ERROR!
      java.lang.UnsupportedOperationException: null
      	at org.apache.hadoop.fs.permission.FsPermission$ImmutableFsPermission.applyUMask(FsPermission.java:380)
      	at org.apache.hadoop.fs.RawLocalFileSystem.mkOneDirWithMode(RawLocalFileSystem.java:496)
      	at org.apache.hadoop.fs.RawLocalFileSystem.mkdirsWithOptionalPermission(RawLocalFileSystem.java:551)
      	at org.apache.hadoop.fs.RawLocalFileSystem.mkdirs(RawLocalFileSystem.java:529)
      	at org.apache.hadoop.fs.FilterFileSystem.mkdirs(FilterFileSystem.java:314)
      	at org.apache.hadoop.yarn.server.timeline.RollingLevelDB.initFileSystem(RollingLevelDB.java:207)
      	at org.apache.hadoop.yarn.server.timeline.RollingLevelDB.init(RollingLevelDB.java:200)
      	at org.apache.hadoop.yarn.server.timeline.RollingLevelDBTimelineStore.serviceInit(RollingLevelDBTimelineStore.java:321)
      	at org.apache.hadoop.service.AbstractService.init(AbstractService.java:163)
      	at org.apache.hadoop.yarn.server.timeline.TestRollingLevelDBTimelineStore.setup(TestRollingLevelDBTimelineStore.java:65)
      
      testGetSingleEntity(org.apache.hadoop.yarn.server.timeline.TestRollingLevelDBTimelineStore)  Time elapsed: 0.05 sec  <<< ERROR!
      java.lang.UnsupportedOperationException: null
      	at org.apache.hadoop.fs.permission.FsPermission$ImmutableFsPermission.applyUMask(FsPermission.java:380)
      	at org.apache.hadoop.fs.RawLocalFileSystem.mkOneDirWithMode(RawLocalFileSystem.java:496)
      	at org.apache.hadoop.fs.RawLocalFileSystem.mkdirsWithOptionalPermission(RawLocalFileSystem.java:551)
      	at org.apache.hadoop.fs.RawLocalFileSystem.mkdirs(RawLocalFileSystem.java:529)
      	at org.apache.hadoop.fs.FilterFileSystem.mkdirs(FilterFileSystem.java:314)
      	at org.apache.hadoop.yarn.server.timeline.RollingLevelDB.initFileSystem(RollingLevelDB.java:207)
      	at org.apache.hadoop.yarn.server.timeline.RollingLevelDB.init(RollingLevelDB.java:200)
      	at org.apache.hadoop.yarn.server.timeline.RollingLevelDBTimelineStore.serviceInit(RollingLevelDBTimelineStore.java:321)
      	at org.apache.hadoop.service.AbstractService.init(AbstractService.java:163)
      	at org.apache.hadoop.yarn.server.timeline.TestRollingLevelDBTimelineStore.setup(TestRollingLevelDBTimelineStore.java:65)
      
      testCacheSizes(org.apache.hadoop.yarn.server.timeline.TestRollingLevelDBTimelineStore)  Time elapsed: 0.051 sec  <<< ERROR!
      java.lang.UnsupportedOperationException: null
      	at org.apache.hadoop.fs.permission.FsPermission$ImmutableFsPermission.applyUMask(FsPermission.java:380)
      	at org.apache.hadoop.fs.RawLocalFileSystem.mkOneDirWithMode(RawLocalFileSystem.java:496)
      	at org.apache.hadoop.fs.RawLocalFileSystem.mkdirsWithOptionalPermission(RawLocalFileSystem.java:551)
      	at org.apache.hadoop.fs.RawLocalFileSystem.mkdirs(RawLocalFileSystem.java:529)
      	at org.apache.hadoop.fs.FilterFileSystem.mkdirs(FilterFileSystem.java:314)
      	at org.apache.hadoop.yarn.server.timeline.RollingLevelDB.initFileSystem(RollingLevelDB.java:207)
      	at org.apache.hadoop.yarn.server.timeline.RollingLevelDB.init(RollingLevelDB.java:200)
      	at org.apache.hadoop.yarn.server.timeline.RollingLevelDBTimelineStore.serviceInit(RollingLevelDBTimelineStore.java:321)
      	at org.apache.hadoop.service.AbstractService.init(AbstractService.java:163)
      	at org.apache.hadoop.yarn.server.timeline.TestRollingLevelDBTimelineStore.setup(TestRollingLevelDBTimelineStore.java:65)
      
      testGetEntities(org.apache.hadoop.yarn.server.timeline.TestRollingLevelDBTimelineStore)  Time elapsed: 0.049 sec  <<< ERROR!
      java.lang.UnsupportedOperationException: null
      	at org.apache.hadoop.fs.permission.FsPermission$ImmutableFsPermission.applyUMask(FsPermission.java:380)
      	at org.apache.hadoop.fs.RawLocalFileSystem.mkOneDirWithMode(RawLocalFileSystem.java:496)
      	at org.apache.hadoop.fs.RawLocalFileSystem.mkdirsWithOptionalPermission(RawLocalFileSystem.java:551)
      	at org.apache.hadoop.fs.RawLocalFileSystem.mkdirs(RawLocalFileSystem.java:529)
      	at org.apache.hadoop.fs.FilterFileSystem.mkdirs(FilterFileSystem.java:314)
      	at org.apache.hadoop.yarn.server.timeline.RollingLevelDB.initFileSystem(RollingLevelDB.java:207)
      	at org.apache.hadoop.yarn.server.timeline.RollingLevelDB.init(RollingLevelDB.java:200)
      	at org.apache.hadoop.yarn.server.timeline.RollingLevelDBTimelineStore.serviceInit(RollingLevelDBTimelineStore.java:321)
      	at org.apache.hadoop.service.AbstractService.init(AbstractService.java:163)
      	at org.apache.hadoop.yarn.server.timeline.TestRollingLevelDBTimelineStore.setup(TestRollingLevelDBTimelineStore.java:65)
      
      testRelatingToEntityInSamePut(org.apache.hadoop.yarn.server.timeline.TestRollingLevelDBTimelineStore)  Time elapsed: 0.056 sec  <<< ERROR!
      java.lang.UnsupportedOperationException: null
      	at org.apache.hadoop.fs.permission.FsPermission$ImmutableFsPermission.applyUMask(FsPermission.java:380)
      	at org.apache.hadoop.fs.RawLocalFileSystem.mkOneDirWithMode(RawLocalFileSystem.java:496)
      	at org.apache.hadoop.fs.RawLocalFileSystem.mkdirsWithOptionalPermission(RawLocalFileSystem.java:551)
      	at org.apache.hadoop.fs.RawLocalFileSystem.mkdirs(RawLocalFileSystem.java:529)
      	at org.apache.hadoop.fs.FilterFileSystem.mkdirs(FilterFileSystem.java:314)
      	at org.apache.hadoop.yarn.server.timeline.RollingLevelDB.initFileSystem(RollingLevelDB.java:207)
      	at org.apache.hadoop.yarn.server.timeline.RollingLevelDB.init(RollingLevelDB.java:200)
      	at org.apache.hadoop.yarn.server.timeline.RollingLevelDBTimelineStore.serviceInit(RollingLevelDBTimelineStore.java:321)
      	at org.apache.hadoop.service.AbstractService.init(AbstractService.java:163)
      	at org.apache.hadoop.yarn.server.timeline.TestRollingLevelDBTimelineStore.setup(TestRollingLevelDBTimelineStore.java:65)
      
      testGetDomain(org.apache.hadoop.yarn.server.timeline.TestRollingLevelDBTimelineStore)  Time elapsed: 0.049 sec  <<< ERROR!
      java.lang.UnsupportedOperationException: null
      	at org.apache.hadoop.fs.permission.FsPermission$ImmutableFsPermission.applyUMask(FsPermission.java:380)
      	at org.apache.hadoop.fs.RawLocalFileSystem.mkOneDirWithMode(RawLocalFileSystem.java:496)
      	at org.apache.hadoop.fs.RawLocalFileSystem.mkdirsWithOptionalPermission(RawLocalFileSystem.java:551)
      	at org.apache.hadoop.fs.RawLocalFileSystem.mkdirs(RawLocalFileSystem.java:529)
      	at org.apache.hadoop.fs.FilterFileSystem.mkdirs(FilterFileSystem.java:314)
      	at org.apache.hadoop.yarn.server.timeline.RollingLevelDB.initFileSystem(RollingLevelDB.java:207)
      	at org.apache.hadoop.yarn.server.timeline.RollingLevelDB.init(RollingLevelDB.java:200)
      	at org.apache.hadoop.yarn.server.timeline.RollingLevelDBTimelineStore.serviceInit(RollingLevelDBTimelineStore.java:321)
      	at org.apache.hadoop.service.AbstractService.init(AbstractService.java:163)
      	at org.apache.hadoop.yarn.server.timeline.TestRollingLevelDBTimelineStore.setup(TestRollingLevelDBTimelineStore.java:65)
      
      testGetEvents(org.apache.hadoop.yarn.server.timeline.TestRollingLevelDBTimelineStore)  Time elapsed: 0.049 sec  <<< ERROR!
      java.lang.UnsupportedOperationException: null
      	at org.apache.hadoop.fs.permission.FsPermission$ImmutableFsPermission.applyUMask(FsPermission.java:380)
      	at org.apache.hadoop.fs.RawLocalFileSystem.mkOneDirWithMode(RawLocalFileSystem.java:496)
      	at org.apache.hadoop.fs.RawLocalFileSystem.mkdirsWithOptionalPermission(RawLocalFileSystem.java:551)
      	at org.apache.hadoop.fs.RawLocalFileSystem.mkdirs(RawLocalFileSystem.java:529)
      	at org.apache.hadoop.fs.FilterFileSystem.mkdirs(FilterFileSystem.java:314)
      	at org.apache.hadoop.yarn.server.timeline.RollingLevelDB.initFileSystem(RollingLevelDB.java:207)
      	at org.apache.hadoop.yarn.server.timeline.RollingLevelDB.init(RollingLevelDB.java:200)
      	at org.apache.hadoop.yarn.server.timeline.RollingLevelDBTimelineStore.serviceInit(RollingLevelDBTimelineStore.java:321)
      	at org.apache.hadoop.service.AbstractService.init(AbstractService.java:163)
      	at org.apache.hadoop.yarn.server.timeline.TestRollingLevelDBTimelineStore.setup(TestRollingLevelDBTimelineStore.java:65)
      
      testGetEntitiesWithSecondaryFilters(org.apache.hadoop.yarn.server.timeline.TestRollingLevelDBTimelineStore)  Time elapsed: 0.05 sec  <<< ERROR!
      java.lang.UnsupportedOperationException: null
      	at org.apache.hadoop.fs.permission.FsPermission$ImmutableFsPermission.applyUMask(FsPermission.java:380)
      	at org.apache.hadoop.fs.RawLocalFileSystem.mkOneDirWithMode(RawLocalFileSystem.java:496)
      	at org.apache.hadoop.fs.RawLocalFileSystem.mkdirsWithOptionalPermission(RawLocalFileSystem.java:551)
      	at org.apache.hadoop.fs.RawLocalFileSystem.mkdirs(RawLocalFileSystem.java:529)
      	at org.apache.hadoop.fs.FilterFileSystem.mkdirs(FilterFileSystem.java:314)
      	at org.apache.hadoop.yarn.server.timeline.RollingLevelDB.initFileSystem(RollingLevelDB.java:207)
      	at org.apache.hadoop.yarn.server.timeline.RollingLevelDB.init(RollingLevelDB.java:200)
      	at org.apache.hadoop.yarn.server.timeline.RollingLevelDBTimelineStore.serviceInit(RollingLevelDBTimelineStore.java:321)
      	at org.apache.hadoop.service.AbstractService.init(AbstractService.java:163)
      	at org.apache.hadoop.yarn.server.timeline.TestRollingLevelDBTimelineStore.setup(TestRollingLevelDBTimelineStore.java:65)
      
      testCheckVersion(org.apache.hadoop.yarn.server.timeline.TestRollingLevelDBTimelineStore)  Time elapsed: 0.05 sec  <<< ERROR!
      java.lang.UnsupportedOperationException: null
      	at org.apache.hadoop.fs.permission.FsPermission$ImmutableFsPermission.applyUMask(FsPermission.java:380)
      	at org.apache.hadoop.fs.RawLocalFileSystem.mkOneDirWithMode(RawLocalFileSystem.java:496)
      	at org.apache.hadoop.fs.RawLocalFileSystem.mkdirsWithOptionalPermission(RawLocalFileSystem.java:551)
      	at org.apache.hadoop.fs.RawLocalFileSystem.mkdirs(RawLocalFileSystem.java:529)
      	at org.apache.hadoop.fs.FilterFileSystem.mkdirs(FilterFileSystem.java:314)
      	at org.apache.hadoop.yarn.server.timeline.RollingLevelDB.initFileSystem(RollingLevelDB.java:207)
      	at org.apache.hadoop.yarn.server.timeline.RollingLevelDB.init(RollingLevelDB.java:200)
      	at org.apache.hadoop.yarn.server.timeline.RollingLevelDBTimelineStore.serviceInit(RollingLevelDBTimelineStore.java:321)
      	at org.apache.hadoop.service.AbstractService.init(AbstractService.java:163)
      	at org.apache.hadoop.yarn.server.timeline.TestRollingLevelDBTimelineStore.setup(TestRollingLevelDBTimelineStore.java:65)
      
      testGetEntitiesWithFromId(org.apache.hadoop.yarn.server.timeline.TestRollingLevelDBTimelineStore)  Time elapsed: 0.055 sec  <<< ERROR!
      java.lang.UnsupportedOperationException: null
      	at org.apache.hadoop.fs.permission.FsPermission$ImmutableFsPermission.applyUMask(FsPermission.java:380)
      	at org.apache.hadoop.fs.RawLocalFileSystem.mkOneDirWithMode(RawLocalFileSystem.java:496)
      	at org.apache.hadoop.fs.RawLocalFileSystem.mkdirsWithOptionalPermission(RawLocalFileSystem.java:551)
      	at org.apache.hadoop.fs.RawLocalFileSystem.mkdirs(RawLocalFileSystem.java:529)
      	at org.apache.hadoop.fs.FilterFileSystem.mkdirs(FilterFileSystem.java:314)
      	at org.apache.hadoop.yarn.server.timeline.RollingLevelDB.initFileSystem(RollingLevelDB.java:207)
      	at org.apache.hadoop.yarn.server.timeline.RollingLevelDB.init(RollingLevelDB.java:200)
      	at org.apache.hadoop.yarn.server.timeline.RollingLevelDBTimelineStore.serviceInit(RollingLevelDBTimelineStore.java:321)
      	at org.apache.hadoop.service.AbstractService.init(AbstractService.java:163)
      	at org.apache.hadoop.yarn.server.timeline.TestRollingLevelDBTimelineStore.setup(TestRollingLevelDBTimelineStore.java:65)
      
      testGetEntitiesWithFromTs(org.apache.hadoop.yarn.server.timeline.TestRollingLevelDBTimelineStore)  Time elapsed: 0.049 sec  <<< ERROR!
      java.lang.UnsupportedOperationException: null
      	at org.apache.hadoop.fs.permission.FsPermission$ImmutableFsPermission.applyUMask(FsPermission.java:380)
      	at org.apache.hadoop.fs.RawLocalFileSystem.mkOneDirWithMode(RawLocalFileSystem.java:496)
      	at org.apache.hadoop.fs.RawLocalFileSystem.mkdirsWithOptionalPermission(RawLocalFileSystem.java:551)
      	at org.apache.hadoop.fs.RawLocalFileSystem.mkdirs(RawLocalFileSystem.java:529)
      	at org.apache.hadoop.fs.FilterFileSystem.mkdirs(FilterFileSystem.java:314)
      	at org.apache.hadoop.yarn.server.timeline.RollingLevelDB.initFileSystem(RollingLevelDB.java:207)
      	at org.apache.hadoop.yarn.server.timeline.RollingLevelDB.init(RollingLevelDB.java:200)
      	at org.apache.hadoop.yarn.server.timeline.RollingLevelDBTimelineStore.serviceInit(RollingLevelDBTimelineStore.java:321)
      	at org.apache.hadoop.service.AbstractService.init(AbstractService.java:163)
      	at org.apache.hadoop.yarn.server.timeline.TestRollingLevelDBTimelineStore.setup(TestRollingLevelDBTimelineStore.java:65)
      
      
      Results :
      
      Tests in error: 
        TestRollingLevelDBTimelineStore.setup:65 » UnsupportedOperation
        TestRollingLevelDBTimelineStore.setup:65 » UnsupportedOperation
        TestRollingLevelDBTimelineStore.setup:65 » UnsupportedOperation
        TestRollingLevelDBTimelineStore.setup:65 » UnsupportedOperation
        TestRollingLevelDBTimelineStore.setup:65 » UnsupportedOperation
        TestRollingLevelDBTimelineStore.setup:65 » UnsupportedOperation
        TestRollingLevelDBTimelineStore.setup:65 » UnsupportedOperation
        TestRollingLevelDBTimelineStore.setup:65 » UnsupportedOperation
        TestRollingLevelDBTimelineStore.setup:65 » UnsupportedOperation
        TestRollingLevelDBTimelineStore.setup:65 » UnsupportedOperation
        TestRollingLevelDBTimelineStore.setup:65 » UnsupportedOperation
        TestRollingLevelDBTimelineStore.setup:65 » UnsupportedOperation
        TestRollingLevelDBTimelineStore.setup:65 » UnsupportedOperation
        TestRollingLevelDBTimelineStore.setup:65 » UnsupportedOperation
        TestRollingLevelDBTimelineStore.setup:65 » UnsupportedOperation
        TestRollingLevelDBTimelineStore.setup:65 » UnsupportedOperation
      
      Tests run: 16, Failures: 0, Errors: 16, Skipped: 0
      

      Attachments

        Issue Links

        Activity

          This comment will be Viewable by All Users Viewable by All Users
          Cancel

          People

            bibinchundatt Bibin Chundatt Assign to me
            rkanter Robert Kanter
            Votes:
            0 Vote for this issue
            Watchers:
            8 Start watching this issue

            Dates

              Created:
              Updated:
              Resolved:

              Slack

                Issue deployment