Uploaded image for project: 'Hadoop Common'
  1. Hadoop Common
  2. HADOOP-10438

TestStreamingTaskLog fails

    XMLWordPrintableJSON

    Details

    • Type: Bug
    • Status: Resolved
    • Priority: Major
    • Resolution: Duplicate
    • Affects Version/s: None
    • Fix Version/s: None
    • Component/s: test
    • Labels:
      None

      Description

      TestStreamingTaskLog#testStreamingTaskLogWithHadoopCmd fails intermittently.

      Running org.apache.hadoop.streaming.TestStreamingTaskLog
      Tests run: 1, Failures: 1, Errors: 0, Skipped: 0, Time elapsed: 49.003 sec <<< FAILURE! - in org.apache.hadoop.streaming.TestStreamingTaskLog
      testStreamingTaskLogWithHadoopCmd(org.apache.hadoop.streaming.TestStreamingTaskLog)  Time elapsed: 48.918 sec  <<< FAILURE!
      java.lang.AssertionError: environment set for child is wrong
              at org.junit.Assert.fail(Assert.java:93)
              at org.junit.Assert.assertTrue(Assert.java:43)
              at org.apache.hadoop.streaming.TestStreamingTaskLog.runStreamJobAndValidateEnv(TestStreamingTaskLog.java:157)
              at org.apache.hadoop.streaming.TestStreamingTaskLog.testStreamingTaskLogWithHadoopCmd(TestStreamingTaskLog.java:107)
      

        Attachments

          Issue Links

            Activity

              People

              • Assignee:
                Unassigned
                Reporter:
                aajisaka Akira Ajisaka
              • Votes:
                0 Vote for this issue
                Watchers:
                1 Start watching this issue

                Dates

                • Created:
                  Updated:
                  Resolved: