Uploaded image for project: 'Geode'
  1. Geode
  2. GEODE-7798

CI: org.apache.geode.redis.PubSubTest failed intermittently on Windows

    XMLWordPrintableJSON

    Details

    • Type: Bug
    • Status: Resolved
    • Priority: Major
    • Resolution: Fixed
    • Affects Version/s: None
    • Fix Version/s: 1.13.0
    • Component/s: None
    • Labels:
      None

      Description

      https://concourse.apachegeode-ci.info/teams/main/pipelines/apache-develop-main/jobs/WindowsIntegrationTestOpenJDK11/builds/1240
      https://concourse.apachegeode-ci.info/teams/main/pipelines/apache-develop-main/jobs/WindowsIntegrationTestOpenJDK11/builds/1242

      org.apache.geode.redis.PubSubTest > testTwoSubscribersOneChannel FAILED
      org.junit.ComparisonFailure: expected:<[2]L> but was:<[1]L>
      at jdk.internal.reflect.NativeConstructorAccessorImpl.newInstance0(Native Method)
      at jdk.internal.reflect.NativeConstructorAccessorImpl.newInstance(NativeConstructorAccessorImpl.java:62)
      at jdk.internal.reflect.DelegatingConstructorAccessorImpl.newInstance(DelegatingConstructorAccessorImpl.java:45)
      at org.apache.geode.redis.PubSubTest.testTwoSubscribersOneChannel(PubSubTest.java:163)

      org.apache.geode.redis.PubSubTest > testOneSubscriberSubscribingToTwoChannels FAILED
      org.junit.ComparisonFailure: expected:<[1]L> but was:<[2]L>
      at jdk.internal.reflect.NativeConstructorAccessorImpl.newInstance0(Native Method)
      at jdk.internal.reflect.NativeConstructorAccessorImpl.newInstance(NativeConstructorAccessorImpl.java:62)
      at jdk.internal.reflect.DelegatingConstructorAccessorImpl.newInstance(DelegatingConstructorAccessorImpl.java:45)
      at org.apache.geode.redis.PubSubTest.testOneSubscriberSubscribingToTwoChannels(PubSubTest.java:124)

      org.apache.geode.redis.PubSubTest > testDeadSubscriber FAILED
      org.junit.ComparisonFailure: expected:<[0]L> but was:<[2]L>
      at jdk.internal.reflect.NativeConstructorAccessorImpl.newInstance0(Native Method)
      at jdk.internal.reflect.NativeConstructorAccessorImpl.newInstance(NativeConstructorAccessorImpl.java:62)
      at jdk.internal.reflect.DelegatingConstructorAccessorImpl.newInstance(DelegatingConstructorAccessorImpl.java:45)
      at org.apache.geode.redis.PubSubTest.testDeadSubscriber(PubSubTest.java:250)

      org.apache.geode.redis.PubSubTest > testOneSubscriberOneChannelTwoTimes FAILED
      org.junit.ComparisonFailure: expected:<[1]L> but was:<[3]L>
      at jdk.internal.reflect.NativeConstructorAccessorImpl.newInstance0(Native Method)
      at jdk.internal.reflect.NativeConstructorAccessorImpl.newInstance(NativeConstructorAccessorImpl.java:62)
      at jdk.internal.reflect.DelegatingConstructorAccessorImpl.newInstance(DelegatingConstructorAccessorImpl.java:45)
      at org.apache.geode.redis.PubSubTest.testOneSubscriberOneChannelTwoTimes(PubSubTest.java:210)

        Attachments

          Activity

            People

            • Assignee:
              jens.deppe Jens Deppe
              Reporter:
              jinmeiliao Jinmei Liao
            • Votes:
              0 Vote for this issue
              Watchers:
              3 Start watching this issue

              Dates

              • Created:
                Updated:
                Resolved:

                Time Tracking

                Estimated:
                Original Estimate - Not Specified
                Not Specified
                Remaining:
                Remaining Estimate - 0h
                0h
                Logged:
                Time Spent - 1h
                1h