Uploaded image for project: 'Geode'
  1. Geode
  2. GEODE-3704

CI Failure: CommandOverHttpDUnitTest fails

    XMLWordPrintableJSON

Details

    • Bug
    • Status: Closed
    • Major
    • Resolution: Fixed
    • None
    • 1.3.0
    • None
    • None

    Description

      org.apache.geode.management.internal.cli.commands.CommandOverHttpDUnitTest > org.apache.geode.management.internal.cli.commands.FunctionCommandsDUnitTest.testExecuteFunctionOnRegionWithCustomResultCollector@org.apache.geode.management.internal.cli.commands.CommandOverHttpDUnitTest FAILED
      java.lang.AssertionError
      at org.junit.Assert.fail(Assert.java:86)
      at org.junit.Assert.assertTrue(Assert.java:41)
      at org.junit.Assert.assertTrue(Assert.java:52)
      at org.apache.geode.management.internal.cli.commands.FunctionCommandsDUnitTest.testExecuteFunctionOnRegionWithCustomResultCollector(FunctionCommandsDUnitTest.java:200)

      org.apache.geode.management.internal.cli.commands.CommandOverHttpDUnitTest > org.apache.geode.management.internal.cli.commands.FunctionCommandsDUnitTest.testExecuteFunctionOnMembersWithArgsAndCustomResultCollector@org.apache.geode.management.internal.cli.commands.CommandOverHttpDUnitTest FAILED
      java.lang.AssertionError
      at org.junit.Assert.fail(Assert.java:86)
      at org.junit.Assert.assertTrue(Assert.java:41)
      at org.junit.Assert.assertTrue(Assert.java:52)
      at org.apache.geode.management.internal.cli.commands.FunctionCommandsDUnitTest.testExecuteFunctionOnMembersWithArgsAndCustomResultCollector(FunctionCommandsDUnitTest.java:423)

      org.apache.geode.management.internal.cli.commands.CommandOverHttpDUnitTest > org.apache.geode.management.internal.cli.commands.FunctionCommandsDUnitTest.testExecuteFunctionOnMembersWithArgs@org.apache.geode.management.internal.cli.commands.CommandOverHttpDUnitTest FAILED
      java.lang.AssertionError
      at org.junit.Assert.fail(Assert.java:86)
      at org.junit.Assert.assertTrue(Assert.java:41)
      at org.junit.Assert.assertTrue(Assert.java:52)
      at org.apache.geode.management.internal.cli.commands.FunctionCommandsDUnitTest.testExecuteFunctionOnMembersWithArgs(FunctionCommandsDUnitTest.java:385)

      Attachments

        Activity

          People

            jinmeiliao Jinmei Liao
            jinmeiliao Jinmei Liao
            Votes:
            0 Vote for this issue
            Watchers:
            2 Start watching this issue

            Dates

              Created:
              Updated:
              Resolved: