Uploaded image for project: 'Flume'
  1. Flume
  2. FLUME-2582

TestSpillableMemoryChannel crashes intermittently

    XMLWordPrintableJSON

    Details

    • Type: Bug
    • Status: Open
    • Priority: Major
    • Resolution: Unresolved
    • Affects Version/s: 1.5.1
    • Fix Version/s: None
    • Component/s: Channel, Test
    • Labels:
      None

      Description

      TestSpillableMemoryChannel results in the following crash, and this happens a lot of times
      Failed to execute goal org.apache.maven.plugins:maven-surefire-plugin:2.12.3:test (default-test) on project flume-spillable-memory-channel: ExecutionException; nested exception is java.util.concurrent.ExecutionException: java.lang.RuntimeException: The forked VM terminated without saying properly goodbye. VM crash or System.exit called ? '

      Detailed error message:

      Forking command line: /bin/sh -c cd /root/flume/flume-ng-channels/flume-spillable-memory-channel && /usr/java/jdk1.6.0_31/jre/bin/java -jar /root/flume/flume-ng-channels/flume-spillable-memory-channel/target/surefire/surefirebooter2963086161274326773.jar /root/flume/flume-ng-channels/flume-spillable-memory-channel/target/surefire/surefire300958755351670987tmp /root/flume/flume-ng-channels/flume-spillable-memory-channel/target/surefire/surefire_03106733112498636367tmp
      Running org.apache.flume.channel.TestSpillableMemoryChannel

      Results :

      Tests run: 0, Failures: 0, Errors: 0, Skipped: 0

      [INFO] ------------------------------------------------------------------------
      [INFO] BUILD FAILURE
      [INFO] ------------------------------------------------------------------------
      [INFO] Total time: 15:07.500s
      [INFO] Finished at: Wed Dec 24 10:56:32 PST 2014
      [INFO] Final Memory: 15M/233M
      [INFO] ------------------------------------------------------------------------
      [ERROR] Failed to execute goal org.apache.maven.plugins:maven-surefire-plugin:2.12.3:test (default-test) on project flume-spillable-memory-channel: ExecutionException; nested exception is java.util.concurrent.ExecutionException: java.lang.RuntimeException: The forked VM terminated without saying properly goodbye. VM crash or System.exit called ? -> [Help 1]
      org.apache.maven.lifecycle.LifecycleExecutionException: Failed to execute goal org.apache.maven.plugins:maven-surefire-plugin:2.12.3:test (default-test) on project flume-spillable-memory-channel: ExecutionException; nested exception is java.util.concurrent.ExecutionException: java.lang.RuntimeException: The forked VM terminated without saying properly goodbye. VM crash or System.exit called ?
      at org.apache.maven.lifecycle.internal.MojoExecutor.execute(MojoExecutor.java:217)
      at org.apache.maven.lifecycle.internal.MojoExecutor.execute(MojoExecutor.java:153)
      at org.apache.maven.lifecycle.internal.MojoExecutor.execute(MojoExecutor.java:145)
      at org.apache.maven.lifecycle.internal.LifecycleModuleBuilder.buildProject(LifecycleModuleBuilder.java:84)
      at org.apache.maven.lifecycle.internal.LifecycleModuleBuilder.buildProject(LifecycleModuleBuilder.java:59)
      at org.apache.maven.lifecycle.internal.LifecycleStarter.singleThreadedBuild(LifecycleStarter.java:183)
      at org.apache.maven.lifecycle.internal.LifecycleStarter.execute(LifecycleStarter.java:161)
      at org.apache.maven.DefaultMaven.doExecute(DefaultMaven.java:320)
      at org.apache.maven.DefaultMaven.execute(DefaultMaven.java:156)
      at org.apache.maven.cli.MavenCli.execute(MavenCli.java:537)
      at org.apache.maven.cli.MavenCli.doMain(MavenCli.java:196)
      at org.apache.maven.cli.MavenCli.main(MavenCli.java:141)
      at sun.reflect.NativeMethodAccessorImpl.invoke0(Native Method)
      at sun.reflect.NativeMethodAccessorImpl.invoke(NativeMethodAccessorImpl.java:39)
      at sun.reflect.DelegatingMethodAccessorImpl.invoke(DelegatingMethodAccessorImpl.java:25)
      at java.lang.reflect.Method.invoke(Method.java:597)
      at org.codehaus.plexus.classworlds.launcher.Launcher.launchEnhanced(Launcher.java:290)
      at org.codehaus.plexus.classworlds.launcher.Launcher.launch(Launcher.java:230)
      at org.codehaus.plexus.classworlds.launcher.Launcher.mainWithExitCode(Launcher.java:409)
      at org.codehaus.plexus.classworlds.launcher.Launcher.main(Launcher.java:352)
      Caused by: org.apache.maven.plugin.MojoExecutionException: ExecutionException; nested exception is java.util.concurrent.ExecutionException: java.lang.RuntimeException: The forked VM terminated without saying properly goodbye. VM crash or System.exit called ?
      at org.apache.maven.plugin.surefire.SurefirePlugin.assertNoException(SurefirePlugin.java:160)
      at org.apache.maven.plugin.surefire.SurefirePlugin.handleSummary(SurefirePlugin.java:149)
      at org.apache.maven.plugin.surefire.AbstractSurefireMojo.executeAfterPreconditionsChecked(AbstractSurefireMojo.java:650)
      at org.apache.maven.plugin.surefire.AbstractSurefireMojo.execute(AbstractSurefireMojo.java:586)
      at org.apache.maven.plugin.DefaultBuildPluginManager.executeMojo(DefaultBuildPluginManager.java:101)
      at org.apache.maven.lifecycle.internal.MojoExecutor.execute(MojoExecutor.java:209)
      ... 19 more
      Caused by: org.apache.maven.surefire.booter.SurefireBooterForkException: ExecutionException; nested exception is java.util.concurrent.ExecutionException: java.lang.RuntimeException: The forked VM terminated without saying properly goodbye. VM crash or System.exit called ?
      at org.apache.maven.plugin.surefire.booterclient.ForkStarter.runSuitesForkPerTestSet(ForkStarter.java:192)
      at org.apache.maven.plugin.surefire.booterclient.ForkStarter.run(ForkStarter.java:121)
      at org.apache.maven.plugin.surefire.AbstractSurefireMojo.executeProvider(AbstractSurefireMojo.java:740)
      at org.apache.maven.plugin.surefire.AbstractSurefireMojo.executeAllProviders(AbstractSurefireMojo.java:682)
      at org.apache.maven.plugin.surefire.AbstractSurefireMojo.executeAfterPreconditionsChecked(AbstractSurefireMojo.java:648)
      ... 22 more
      Caused by: java.util.concurrent.ExecutionException: java.lang.RuntimeException: The forked VM terminated without saying properly goodbye. VM crash or System.exit called ?
      at java.util.concurrent.FutureTask$Sync.innerGet(FutureTask.java:222)
      at java.util.concurrent.FutureTask.get(FutureTask.java:83)
      at org.apache.maven.plugin.surefire.booterclient.ForkStarter.runSuitesForkPerTestSet(ForkStarter.java:176)
      ... 26 more
      Caused by: java.lang.RuntimeException: The forked VM terminated without saying properly goodbye. VM crash or System.exit called ?
      at org.apache.maven.plugin.surefire.booterclient.output.ForkClient.close(ForkClient.java:257)
      at org.apache.maven.plugin.surefire.booterclient.ForkStarter.fork(ForkStarter.java:301)
      at org.apache.maven.plugin.surefire.booterclient.ForkStarter.access$100(ForkStarter.java:75)
      at org.apache.maven.plugin.surefire.booterclient.ForkStarter$1.call(ForkStarter.java:163)
      at org.apache.maven.plugin.surefire.booterclient.ForkStarter$1.call(ForkStarter.java:160)
      at java.util.concurrent.FutureTask$Sync.innerRun(FutureTask.java:303)
      at java.util.concurrent.FutureTask.run(FutureTask.java:138)
      at java.util.concurrent.ThreadPoolExecutor$Worker.runTask(ThreadPoolExecutor.java:886)
      at java.util.concurrent.ThreadPoolExecutor$Worker.run(ThreadPoolExecutor.java:908)
      at java.lang.Thread.run(Thread.java:662)
      [ERROR]
      [ERROR]
      [ERROR] For more information about the errors and possible solutions, please read the following articles:
      [ERROR] [Help 1] http://cwiki.apache.org/confluence/display/MAVEN/MojoExecutionException

        Attachments

          Activity

            People

            • Assignee:
              Unassigned
              Reporter:
              jrufus Johny Rufus
            • Votes:
              2 Vote for this issue
              Watchers:
              3 Start watching this issue

              Dates

              • Created:
                Updated: