Uploaded image for project: 'Flink'
  1. Flink
  2. FLINK-28199

Failures on YARNHighAvailabilityITCase.testClusterClientRetrieval and YARNHighAvailabilityITCase.testKillYarnSessionClusterEntrypoint

    XMLWordPrintableJSON

Details

    • Bug
    • Status: Open
    • Major
    • Resolution: Unresolved
    • 1.16.0
    • None
    • Deployment / YARN

    Description

      Jun 22 08:57:50 [ERROR] Errors: 
      Jun 22 08:57:50 [ERROR]   YARNHighAvailabilityITCase.testClusterClientRetrieval » Timeout testClusterCli...
      Jun 22 08:57:50 [ERROR]   YARNHighAvailabilityITCase.testKillYarnSessionClusterEntrypoint:156->YarnTestBase.runTest:288->lambda$testKillYarnSessionClusterEntrypoint$0:182->waitForJobTermination:325 » Execution
      Jun 22 08:57:50 [INFO] 
      Jun 22 08:57:50 [ERROR] Tests run: 27, Failures: 0, Errors: 2, Skipped: 0
      

      https://dev.azure.com/apache-flink/apache-flink/_build/results?buildId=37037&view=logs&j=fc5181b0-e452-5c8f-68de-1097947f6483&t=995c650b-6573-581c-9ce6-7ad4cc038461&l=29523

      Attachments

        Activity

          People

            Unassigned Unassigned
            martijnvisser Martijn Visser
            Votes:
            0 Vote for this issue
            Watchers:
            4 Start watching this issue

            Dates

              Created:
              Updated: