Uploaded image for project: 'Flink'
  1. Flink
  2. FLINK-26621

flink-tests failed on azure due to Error occurred in starting fork

Attach filesAttach ScreenshotAdd voteVotersWatch issueWatchersCreate sub-taskLinkCloneUpdate Comment AuthorReplace String in CommentUpdate Comment VisibilityDelete Comments
    XMLWordPrintableJSON

Details

    Description

      2022-03-11T16:20:12.6929558Z Mar 11 16:20:12 [WARNING] The requested profile "skip-webui-build" could not be activated because it does not exist.
      2022-03-11T16:20:12.6939269Z Mar 11 16:20:12 [ERROR] Failed to execute goal org.apache.maven.plugins:maven-surefire-plugin:3.0.0-M5:test (integration-tests) on project flink-tests: There are test failures.
      2022-03-11T16:20:12.6940062Z Mar 11 16:20:12 [ERROR] 
      2022-03-11T16:20:12.6940954Z Mar 11 16:20:12 [ERROR] Please refer to /__w/2/s/flink-tests/target/surefire-reports for the individual test results.
      2022-03-11T16:20:12.6941875Z Mar 11 16:20:12 [ERROR] Please refer to dump files (if any exist) [date].dump, [date]-jvmRun[N].dump and [date].dumpstream.
      2022-03-11T16:20:12.6942966Z Mar 11 16:20:12 [ERROR] ExecutionException Error occurred in starting fork, check output in log
      2022-03-11T16:20:12.6943919Z Mar 11 16:20:12 [ERROR] org.apache.maven.surefire.booter.SurefireBooterForkException: ExecutionException Error occurred in starting fork, check output in log
      2022-03-11T16:20:12.6945023Z Mar 11 16:20:12 [ERROR] at org.apache.maven.plugin.surefire.booterclient.ForkStarter.awaitResultsDone(ForkStarter.java:532)
      2022-03-11T16:20:12.6945878Z Mar 11 16:20:12 [ERROR] at org.apache.maven.plugin.surefire.booterclient.ForkStarter.runSuitesForkPerTestSet(ForkStarter.java:479)
      2022-03-11T16:20:12.6946761Z Mar 11 16:20:12 [ERROR] at org.apache.maven.plugin.surefire.booterclient.ForkStarter.run(ForkStarter.java:322)
      2022-03-11T16:20:12.6947532Z Mar 11 16:20:12 [ERROR] at org.apache.maven.plugin.surefire.booterclient.ForkStarter.run(ForkStarter.java:266)
      2022-03-11T16:20:12.6953051Z Mar 11 16:20:12 [ERROR] at org.apache.maven.plugin.surefire.AbstractSurefireMojo.executeProvider(AbstractSurefireMojo.java:1314)
      2022-03-11T16:20:12.6954035Z Mar 11 16:20:12 [ERROR] at org.apache.maven.plugin.surefire.AbstractSurefireMojo.executeAfterPreconditionsChecked(AbstractSurefireMojo.java:1159)
      2022-03-11T16:20:12.6954917Z Mar 11 16:20:12 [ERROR] at org.apache.maven.plugin.surefire.AbstractSurefireMojo.execute(AbstractSurefireMojo.java:932)
      2022-03-11T16:20:12.6955749Z Mar 11 16:20:12 [ERROR] at org.apache.maven.plugin.DefaultBuildPluginManager.executeMojo(DefaultBuildPluginManager.java:132)
      2022-03-11T16:20:12.6956542Z Mar 11 16:20:12 [ERROR] at org.apache.maven.lifecycle.internal.MojoExecutor.execute(MojoExecutor.java:208)
      2022-03-11T16:20:12.6957456Z Mar 11 16:20:12 [ERROR] at org.apache.maven.lifecycle.internal.MojoExecutor.execute(MojoExecutor.java:153)
      2022-03-11T16:20:12.6958232Z Mar 11 16:20:12 [ERROR] at org.apache.maven.lifecycle.internal.MojoExecutor.execute(MojoExecutor.java:145)
      2022-03-11T16:20:12.6959038Z Mar 11 16:20:12 [ERROR] at org.apache.maven.lifecycle.internal.LifecycleModuleBuilder.buildProject(LifecycleModuleBuilder.java:116)
      2022-03-11T16:20:12.6960553Z Mar 11 16:20:12 [ERROR] at org.apache.maven.lifecycle.internal.LifecycleModuleBuilder.buildProject(LifecycleModuleBuilder.java:80)
      2022-03-11T16:20:12.6962116Z Mar 11 16:20:12 [ERROR] at org.apache.maven.lifecycle.internal.builder.singlethreaded.SingleThreadedBuilder.build(SingleThreadedBuilder.java:51)
      2022-03-11T16:20:12.6963009Z Mar 11 16:20:12 [ERROR] at org.apache.maven.lifecycle.internal.LifecycleStarter.execute(LifecycleStarter.java:120)
      2022-03-11T16:20:12.6963737Z Mar 11 16:20:12 [ERROR] at org.apache.maven.DefaultMaven.doExecute(DefaultMaven.java:355)
      2022-03-11T16:20:12.6964644Z Mar 11 16:20:12 [ERROR] at org.apache.maven.DefaultMaven.execute(DefaultMaven.java:155)
      2022-03-11T16:20:12.6965647Z Mar 11 16:20:12 [ERROR] at org.apache.maven.cli.MavenCli.execute(MavenCli.java:584)
      2022-03-11T16:20:12.6966732Z Mar 11 16:20:12 [ERROR] at org.apache.maven.cli.MavenCli.doMain(MavenCli.java:216)
      2022-03-11T16:20:12.6967818Z Mar 11 16:20:12 [ERROR] at org.apache.maven.cli.MavenCli.main(MavenCli.java:160)
      2022-03-11T16:20:12.6968857Z Mar 11 16:20:12 [ERROR] at sun.reflect.NativeMethodAccessorImpl.invoke0(Native Method)
      2022-03-11T16:20:12.6969986Z Mar 11 16:20:12 [ERROR] at sun.reflect.NativeMethodAccessorImpl.invoke(NativeMethodAccessorImpl.java:62)
      2022-03-11T16:20:12.6971491Z Mar 11 16:20:12 [ERROR] at sun.reflect.DelegatingMethodAccessorImpl.invoke(DelegatingMethodAccessorImpl.java:43)
      2022-03-11T16:20:12.6972207Z Mar 11 16:20:12 [ERROR] at java.lang.reflect.Method.invoke(Method.java:498)
      2022-03-11T16:20:12.6973134Z Mar 11 16:20:12 [ERROR] at org.codehaus.plexus.classworlds.launcher.Launcher.launchEnhanced(Launcher.java:289)
      2022-03-11T16:20:12.6974067Z Mar 11 16:20:12 [ERROR] at org.codehaus.plexus.classworlds.launcher.Launcher.launch(Launcher.java:229)
      2022-03-11T16:20:12.6974828Z Mar 11 16:20:12 [ERROR] at org.codehaus.plexus.classworlds.launcher.Launcher.mainWithExitCode(Launcher.java:415)
      2022-03-11T16:20:12.6975753Z Mar 11 16:20:12 [ERROR] at org.codehaus.plexus.classworlds.launcher.Launcher.main(Launcher.java:356)
      2022-03-11T16:20:12.6976620Z Mar 11 16:20:12 [ERROR] Caused by: org.apache.maven.surefire.booter.SurefireBooterForkException: Error occurred in starting fork, check output in log
      2022-03-11T16:20:12.6977893Z Mar 11 16:20:12 [ERROR] at org.apache.maven.plugin.surefire.booterclient.ForkStarter.fork(ForkStarter.java:662)
      2022-03-11T16:20:12.6978949Z Mar 11 16:20:12 [ERROR] at org.apache.maven.plugin.surefire.booterclient.ForkStarter.access$700(ForkStarter.java:121)
      2022-03-11T16:20:12.6980306Z Mar 11 16:20:12 [ERROR] at org.apache.maven.plugin.surefire.booterclient.ForkStarter$2.call(ForkStarter.java:465)
      2022-03-11T16:20:12.6981716Z Mar 11 16:20:12 [ERROR] at org.apache.maven.plugin.surefire.booterclient.ForkStarter$2.call(ForkStarter.java:442)
      2022-03-11T16:20:12.6982449Z Mar 11 16:20:12 [ERROR] at java.util.concurrent.FutureTask.run(FutureTask.java:266)
      2022-03-11T16:20:12.6983156Z Mar 11 16:20:12 [ERROR] at java.util.concurrent.ThreadPoolExecutor.runWorker(ThreadPoolExecutor.java:1149)
      2022-03-11T16:20:12.6983904Z Mar 11 16:20:12 [ERROR] at java.util.concurrent.ThreadPoolExecutor$Worker.run(ThreadPoolExecutor.java:624)
      2022-03-11T16:20:12.6984533Z Mar 11 16:20:12 [ERROR] at java.lang.Thread.run(Thread.java:748)
      2022-03-11T16:20:12.6985373Z Mar 11 16:20:12 [ERROR] -> [Help 1]
      2022-03-11T16:20:12.6985741Z Mar 11 16:20:12 [ERROR] 
      2022-03-11T16:20:12.6986424Z Mar 11 16:20:12 [ERROR] To see the full stack trace of the errors, re-run Maven with the -e switch.
      2022-03-11T16:20:12.6987456Z Mar 11 16:20:12 [ERROR] Re-run Maven using the -X switch to enable full debug logging.
      2022-03-11T16:20:12.6987935Z Mar 11 16:20:12 [ERROR] 
      2022-03-11T16:20:12.6988446Z Mar 11 16:20:12 [ERROR] For more information about the errors and possible solutions, please read the following articles:
      2022-03-11T16:20:12.6989125Z Mar 11 16:20:12 [ERROR] [Help 1] http://cwiki.apache.org/confluence/display/MAVEN/MojoExecutionException
      2022-03-11T16:20:12.6989631Z Mar 11 16:20:12 [ERROR] 
      2022-03-11T16:20:12.6990284Z Mar 11 16:20:12 [ERROR] After correcting the problems, you can resume the build with the command
      2022-03-11T16:20:12.6991194Z Mar 11 16:20:12 [ERROR]   mvn <goals> -rf :flink-tests
      2022-03-11T16:20:13.5874703Z Mar 11 16:20:13 Process exited with EXIT CODE: 1.
      

      https://dev.azure.com/apache-flink/apache-flink/_build/results?buildId=32927&view=logs&j=5c8e7682-d68f-54d1-16a2-a09310218a49&t=86f654fa-ab48-5c1a-25f4-7e7f6afb9bba&l=6255

      Attachments

        Activity

          This comment will be Viewable by All Users Viewable by All Users
          Cancel

          People

            chesnay Chesnay Schepler
            gaoyunhaii Yun Gao

            Dates

              Created:
              Updated:

              Slack

                Issue deployment