Uploaded image for project: 'Flink'
  1. Flink
  2. FLINK-25585

JobManagerHAProcessFailureRecoveryITCase.testDispatcherProcessFailure failed on the azure

    XMLWordPrintableJSON

Details

    Description

      2022-01-08T02:39:54.7103772Z Jan 08 02:39:54 [ERROR] Tests run: 2, Failures: 1, Errors: 0, Skipped: 0, Time elapsed: 349.282 s <<< FAILURE! - in org.apache.flink.test.recovery.JobManagerHAProcessFailureRecoveryITCase
      2022-01-08T02:39:54.7105233Z Jan 08 02:39:54 [ERROR] testDispatcherProcessFailure[ExecutionMode BATCH]  Time elapsed: 302.006 s  <<< FAILURE!
      2022-01-08T02:39:54.7106478Z Jan 08 02:39:54 java.lang.AssertionError: The program encountered a RuntimeException : java.util.concurrent.ExecutionException: java.lang.RuntimeException: Error while waiting for job to be initialized
      2022-01-08T02:39:54.7107409Z Jan 08 02:39:54 	at org.junit.Assert.fail(Assert.java:89)
      2022-01-08T02:39:54.7108084Z Jan 08 02:39:54 	at org.apache.flink.test.recovery.JobManagerHAProcessFailureRecoveryITCase.testDispatcherProcessFailure(JobManagerHAProcessFailureRecoveryITCase.java:383)
      2022-01-08T02:39:54.7108952Z Jan 08 02:39:54 	at sun.reflect.NativeMethodAccessorImpl.invoke0(Native Method)
      2022-01-08T02:39:54.7109491Z Jan 08 02:39:54 	at sun.reflect.NativeMethodAccessorImpl.invoke(NativeMethodAccessorImpl.java:62)
      2022-01-08T02:39:54.7110107Z Jan 08 02:39:54 	at sun.reflect.DelegatingMethodAccessorImpl.invoke(DelegatingMethodAccessorImpl.java:43)
      2022-01-08T02:39:54.7110772Z Jan 08 02:39:54 	at java.lang.reflect.Method.invoke(Method.java:498)
      2022-01-08T02:39:54.7111594Z Jan 08 02:39:54 	at org.junit.runners.model.FrameworkMethod$1.runReflectiveCall(FrameworkMethod.java:59)
      2022-01-08T02:39:54.7112510Z Jan 08 02:39:54 	at org.junit.internal.runners.model.ReflectiveCallable.run(ReflectiveCallable.java:12)
      2022-01-08T02:39:54.7113734Z Jan 08 02:39:54 	at org.junit.runners.model.FrameworkMethod.invokeExplosively(FrameworkMethod.java:56)
      2022-01-08T02:39:54.7114673Z Jan 08 02:39:54 	at org.junit.internal.runners.statements.InvokeMethod.evaluate(InvokeMethod.java:17)
      2022-01-08T02:39:54.7115423Z Jan 08 02:39:54 	at org.junit.internal.runners.statements.RunBefores.evaluate(RunBefores.java:26)
      2022-01-08T02:39:54.7116011Z Jan 08 02:39:54 	at org.junit.rules.ExternalResource$1.evaluate(ExternalResource.java:54)
      2022-01-08T02:39:54.7116586Z Jan 08 02:39:54 	at org.apache.flink.util.TestNameProvider$1.evaluate(TestNameProvider.java:45)
      2022-01-08T02:39:54.7117154Z Jan 08 02:39:54 	at org.junit.rules.TestWatcher$1.evaluate(TestWatcher.java:61)
      2022-01-08T02:39:54.7117686Z Jan 08 02:39:54 	at org.junit.runners.ParentRunner$3.evaluate(ParentRunner.java:306)
      2022-01-08T02:39:54.7118448Z Jan 08 02:39:54 	at org.junit.runners.BlockJUnit4ClassRunner$1.evaluate(BlockJUnit4ClassRunner.java:100)
      2022-01-08T02:39:54.7119020Z Jan 08 02:39:54 	at org.junit.runners.ParentRunner.runLeaf(ParentRunner.java:366)
      2022-01-08T02:39:54.7119571Z Jan 08 02:39:54 	at org.junit.runners.BlockJUnit4ClassRunner.runChild(BlockJUnit4ClassRunner.java:103)
      2022-01-08T02:39:54.7120180Z Jan 08 02:39:54 	at org.junit.runners.BlockJUnit4ClassRunner.runChild(BlockJUnit4ClassRunner.java:63)
      2022-01-08T02:39:54.7120754Z Jan 08 02:39:54 	at org.junit.runners.ParentRunner$4.run(ParentRunner.java:331)
      2022-01-08T02:39:54.7121286Z Jan 08 02:39:54 	at org.junit.runners.ParentRunner$1.schedule(ParentRunner.java:79)
      2022-01-08T02:39:54.7121832Z Jan 08 02:39:54 	at org.junit.runners.ParentRunner.runChildren(ParentRunner.java:329)
      2022-01-08T02:39:54.7122376Z Jan 08 02:39:54 	at org.junit.runners.ParentRunner.access$100(ParentRunner.java:66)
      2022-01-08T02:39:54.7123179Z Jan 08 02:39:54 	at org.junit.runners.ParentRunner$2.evaluate(ParentRunner.java:293)
      2022-01-08T02:39:54.7123796Z Jan 08 02:39:54 	at org.junit.runners.ParentRunner.run(ParentRunner.java:413)
      2022-01-08T02:39:54.7124304Z Jan 08 02:39:54 	at org.junit.runners.Suite.runChild(Suite.java:128)
      2022-01-08T02:39:54.7125001Z Jan 08 02:39:54 	at org.junit.runners.Suite.runChild(Suite.java:27)
      2022-01-08T02:39:54.7125753Z Jan 08 02:39:54 	at org.junit.runners.ParentRunner$4.run(ParentRunner.java:331)
      2022-01-08T02:39:54.7126595Z Jan 08 02:39:54 	at org.junit.runners.ParentRunner$1.schedule(ParentRunner.java:79)
      2022-01-08T02:39:54.7127354Z Jan 08 02:39:54 	at org.junit.runners.ParentRunner.runChildren(ParentRunner.java:329)
      2022-01-08T02:39:54.7127911Z Jan 08 02:39:54 	at org.junit.runners.ParentRunner.access$100(ParentRunner.java:66)
      2022-01-08T02:39:54.7128456Z Jan 08 02:39:54 	at org.junit.runners.ParentRunner$2.evaluate(ParentRunner.java:293)
      2022-01-08T02:39:54.7129019Z Jan 08 02:39:54 	at org.junit.internal.runners.statements.RunBefores.evaluate(RunBefores.java:26)
      2022-01-08T02:39:54.7129593Z Jan 08 02:39:54 	at org.junit.internal.runners.statements.RunAfters.evaluate(RunAfters.java:27)
      2022-01-08T02:39:54.7130155Z Jan 08 02:39:54 	at org.junit.runners.ParentRunner$3.evaluate(ParentRunner.java:306)
      2022-01-08T02:39:54.7130682Z Jan 08 02:39:54 	at org.junit.runners.ParentRunner.run(ParentRunner.java:413)
      2022-01-08T02:39:54.7131183Z Jan 08 02:39:54 	at org.junit.runner.JUnitCore.run(JUnitCore.java:137)
      2022-01-08T02:39:54.7131826Z Jan 08 02:39:54 	at org.junit.runner.JUnitCore.run(JUnitCore.java:115)
      2022-01-08T02:39:54.7132375Z Jan 08 02:39:54 	at org.junit.vintage.engine.execution.RunnerExecutor.execute(RunnerExecutor.java:43)
      2022-01-08T02:39:54.7133122Z Jan 08 02:39:54 	at java.util.stream.ForEachOps$ForEachOp$OfRef.accept(ForEachOps.java:183)
      2022-01-08T02:39:54.7133866Z Jan 08 02:39:54 	at java.util.stream.ReferencePipeline$3$1.accept(ReferencePipeline.java:193)
      2022-01-08T02:39:54.7134676Z Jan 08 02:39:54 	at java.util.Iterator.forEachRemaining(Iterator.java:116)
      2022-01-08T02:39:54.7135476Z Jan 08 02:39:54 	at java.util.Spliterators$IteratorSpliterator.forEachRemaining(Spliterators.java:1801)
      2022-01-08T02:39:54.7136127Z Jan 08 02:39:54 	at java.util.stream.AbstractPipeline.copyInto(AbstractPipeline.java:482)
      2022-01-08T02:39:54.7136711Z Jan 08 02:39:54 	at java.util.stream.AbstractPipeline.wrapAndCopyInto(AbstractPipeline.java:472)
      2022-01-08T02:39:54.7137304Z Jan 08 02:39:54 	at java.util.stream.ForEachOps$ForEachOp.evaluateSequential(ForEachOps.java:150)
      2022-01-08T02:39:54.7137912Z Jan 08 02:39:54 	at java.util.stream.ForEachOps$ForEachOp$OfRef.evaluateSequential(ForEachOps.java:173)
      2022-01-08T02:39:54.7138473Z Jan 08 02:39:54 	at java.util.stream.AbstractPipeline.evaluate(AbstractPipeline.java:234)
      2022-01-08T02:39:54.7139036Z Jan 08 02:39:54 	at java.util.stream.ReferencePipeline.forEach(ReferencePipeline.java:485)
      2022-01-08T02:39:54.7139911Z Jan 08 02:39:54 	at org.junit.vintage.engine.VintageTestEngine.executeAllChildren(VintageTestEngine.java:82)
      2022-01-08T02:39:54.7140861Z Jan 08 02:39:54 	at org.junit.vintage.engine.VintageTestEngine.execute(VintageTestEngine.java:73)
      2022-01-08T02:39:54.7141786Z Jan 08 02:39:54 	at org.junit.platform.launcher.core.DefaultLauncher.execute(DefaultLauncher.java:220)
      2022-01-08T02:39:54.7142701Z Jan 08 02:39:54 	at org.junit.platform.launcher.core.DefaultLauncher.lambda$execute$6(DefaultLauncher.java:188)
      2022-01-08T02:39:54.7143705Z Jan 08 02:39:54 	at org.junit.platform.launcher.core.DefaultLauncher.withInterceptedStreams(DefaultLauncher.java:202)
      2022-01-08T02:39:54.7144644Z Jan 08 02:39:54 	at org.junit.platform.launcher.core.DefaultLauncher.execute(DefaultLauncher.java:181)
      2022-01-08T02:39:54.7145404Z Jan 08 02:39:54 	at org.junit.platform.launcher.core.DefaultLauncher.execute(DefaultLauncher.java:128)
      2022-01-08T02:39:54.7146351Z Jan 08 02:39:54 	at org.apache.maven.surefire.junitplatform.JUnitPlatformProvider.invokeAllTests(JUnitPlatformProvider.java:150)
      2022-01-08T02:39:54.7147366Z Jan 08 02:39:54 	at org.apache.maven.surefire.junitplatform.JUnitPlatformProvider.invoke(JUnitPlatformProvider.java:120)
      2022-01-08T02:39:54.7148318Z Jan 08 02:39:54 	at org.apache.maven.surefire.booter.ForkedBooter.invokeProviderInSameClassLoader(ForkedBooter.java:384)
      2022-01-08T02:39:54.7149246Z Jan 08 02:39:54 	at org.apache.maven.surefire.booter.ForkedBooter.runSuitesInProcess(ForkedBooter.java:345)
      2022-01-08T02:39:54.7150166Z Jan 08 02:39:54 	at org.apache.maven.surefire.booter.ForkedBooter.execute(ForkedBooter.java:126)
      2022-01-08T02:39:54.7151077Z Jan 08 02:39:54 	at org.apache.maven.surefire.booter.ForkedBooter.main(ForkedBooter.java:418)
      2022-01-08T02:39:54.7151764Z Jan 08 02:39:54 
      

      https://dev.azure.com/apache-flink/apache-flink/_build/results?buildId=29121&view=logs&j=8fd9202e-fd17-5b26-353c-ac1ff76c8f28&t=ea7cf968-e585-52cb-e0fc-f48de023a7ca&l=5359

      Attachments

        Issue Links

          Activity

            People

              Unassigned Unassigned
              gaoyunhaii Yun Gao
              Votes:
              0 Vote for this issue
              Watchers:
              5 Start watching this issue

              Dates

                Created:
                Updated:
                Resolved: