Uploaded image for project: 'Flink'
  1. Flink
  2. FLINK-25442

HBaseConnectorITCase.testTableSink failed on azure

    XMLWordPrintableJSON

Details

    Description

      Dec 24 00:48:54 Picked up JAVA_TOOL_OPTIONS: -XX:+HeapDumpOnOutOfMemoryError
      Dec 24 00:48:54 OpenJDK 64-Bit Server VM warning: ignoring option MaxPermSize=128m; support was removed in 8.0
      Dec 24 00:48:54 Running org.apache.flink.connector.hbase2.HBaseConnectorITCase
      Dec 24 00:48:59 Formatting using clusterid: testClusterID
      Dec 24 00:50:15 java.lang.ThreadGroup[name=PEWorkerGroup,maxpri=10]
      Dec 24 00:50:15     Thread[HFileArchiver-8,5,PEWorkerGroup]
      Dec 24 00:50:15     Thread[HFileArchiver-9,5,PEWorkerGroup]
      Dec 24 00:50:15     Thread[HFileArchiver-10,5,PEWorkerGroup]
      Dec 24 00:50:15     Thread[HFileArchiver-11,5,PEWorkerGroup]
      Dec 24 00:50:15     Thread[HFileArchiver-12,5,PEWorkerGroup]
      Dec 24 00:50:15     Thread[HFileArchiver-13,5,PEWorkerGroup]
      Dec 24 00:50:16 Tests run: 9, Failures: 1, Errors: 0, Skipped: 0, Time elapsed: 82.068 sec <<< FAILURE! - in org.apache.flink.connector.hbase2.HBaseConnectorITCase
      Dec 24 00:50:16 testTableSink(org.apache.flink.connector.hbase2.HBaseConnectorITCase)  Time elapsed: 8.534 sec  <<< FAILURE!
      Dec 24 00:50:16 java.lang.AssertionError: expected:<8> but was:<5>
      Dec 24 00:50:16 	at org.junit.Assert.fail(Assert.java:89)
      Dec 24 00:50:16 	at org.junit.Assert.failNotEquals(Assert.java:835)
      Dec 24 00:50:16 	at org.junit.Assert.assertEquals(Assert.java:120)
      Dec 24 00:50:16 	at org.junit.Assert.assertEquals(Assert.java:146)
      Dec 24 00:50:16 	at org.apache.flink.connector.hbase2.HBaseConnectorITCase.testTableSink(HBaseConnectorITCase.java:291)
      Dec 24 00:50:16 	at sun.reflect.NativeMethodAccessorImpl.invoke0(Native Method)
      Dec 24 00:50:16 	at sun.reflect.NativeMethodAccessorImpl.invoke(NativeMethodAccessorImpl.java:62)
      Dec 24 00:50:16 	at sun.reflect.DelegatingMethodAccessorImpl.invoke(DelegatingMethodAccessorImpl.java:43)
      Dec 24 00:50:16 	at java.lang.reflect.Method.invoke(Method.java:498)
      Dec 24 00:50:16 	at org.junit.runners.model.FrameworkMethod$1.runReflectiveCall(FrameworkMethod.java:59)
      Dec 24 00:50:16 	at org.junit.internal.runners.model.ReflectiveCallable.run(ReflectiveCallable.java:12)
      Dec 24 00:50:16 	at org.junit.runners.model.FrameworkMethod.invokeExplosively(FrameworkMethod.java:56)
      Dec 24 00:50:16 	at org.junit.internal.runners.statements.InvokeMethod.evaluate(InvokeMethod.java:17)
      Dec 24 00:50:16 	at org.junit.internal.runners.statements.RunBefores.evaluate(RunBefores.java:26)
      Dec 24 00:50:16 	at org.junit.runners.ParentRunner$3.evaluate(ParentRunner.java:306)
      Dec 24 00:50:16 	at org.junit.runners.BlockJUnit4ClassRunner$1.evaluate(BlockJUnit4ClassRunner.java:100)
      Dec 24 00:50:16 	at org.junit.runners.ParentRunner.runLeaf(ParentRunner.java:366)
      Dec 24 00:50:16 	at org.junit.runners.BlockJUnit4ClassRunner.runChild(BlockJUnit4ClassRunner.java:103)
      Dec 24 00:50:16 	at org.junit.runners.BlockJUnit4ClassRunner.runChild(BlockJUnit4ClassRunner.java:63)
      Dec 24 00:50:16 	at org.junit.runners.ParentRunner$4.run(ParentRunner.java:331)
      Dec 24 00:50:16 	at org.junit.runners.ParentRunner$1.schedule(ParentRunner.java:79)
      Dec 24 00:50:16 	at org.junit.runners.ParentRunner.runChildren(ParentRunner.java:329)
      Dec 24 00:50:16 	at org.junit.runners.ParentRunner.access$100(ParentRunner.java:66)
      
      

      Attachments

        Activity

          People

            Unassigned Unassigned
            gaoyunhaii Yun Gao
            Votes:
            0 Vote for this issue
            Watchers:
            4 Start watching this issue

            Dates

              Created:
              Updated: